Build Record

Build Number: 6547

Transaction: 2903
Package: cjs
Version: 3.4.1-1
Start: 05/25/2017 12:54AM
Finish: 05/25/2017 01:02AM
Result: completed
 cjs/PKGBUILD CHANGED

Build Log

   1 [05/25/2017 12:54AM]: [\^/\^/^\^/^\^/\^/\^/^\^/^\^/]  SETTING UP ENVIRONMENT  [\^/\^/^\^/^\^/\^/\^/^\^/^\^/]
   2  [05/25/2017 12:54AM]: [\^/\^/^\^/^\^/\^/\^/^\^/^\^/]  ADDING UPSTREAM PGP KEYS TO KEYRING  [\^/\^/^\^/^\^/\^/\^/^\^/^\^/]
   3  [05/25/2017 12:54AM]: gpg: directory /tmp/antbs/.gnupg created
   4  [05/25/2017 12:54AM]: gpg: keybox /tmp/antbs/.gnupg/pubring.kbx created
   5  [05/25/2017 12:54AM]: gpg: /tmp/antbs/.gnupg/trustdb.gpg: trustdb created
   6  [05/25/2017 12:54AM]: gpg: key 23EFEFE93C4CFFFE: public key Italo A. Casas <[email protected]> imported
   7  [05/25/2017 12:54AM]: gpg: key B63B535A4C206CA9: public key Evan Lucas <[email protected]> imported
   8  [05/25/2017 12:54AM]: gpg: key E73BC641CC11F4C8: public key Myles Borins <[email protected]> imported
   9  [05/25/2017 12:54AM]: gpg: key C273792F7D83545D: public key Rod Vagg <[email protected]> imported
  10  [05/25/2017 12:54AM]: gpg: key C97EC7A07EDE3FC1: public key keybase.io/jasnell <[email protected]> imported
  11  [05/25/2017 12:54AM]: gpg: key 09FE44734EB7990E: public key Jeremiah Senkpiel <[email protected]> imported
  12  [05/25/2017 12:54AM]: gpg: key 7434390BDBE9B9C5: public key Colin Ihrig <[email protected]> imported
  13  [05/25/2017 12:54AM]: gpg: key 61B7B526D98F0353: public key Mozilla Software Releases <[email protected]> imported
  14  [05/25/2017 12:54AM]: gpg: key 61B7B526D98F0353: Mozilla Software Releases <[email protected]> not changed
  15  [05/25/2017 12:54AM]: gpg: no ultimately trusted keys found
  16  [05/25/2017 12:54AM]: gpg: Total number processed: 9
  17  [05/25/2017 12:54AM]: gpg:               imported: 8
  18  [05/25/2017 12:54AM]: gpg:              unchanged: 1
  19  [05/25/2017 12:54AM]: [\^/\^/^\^/^\^/\^/\^/^\^/^\^/]  SYNCING REPO DATABASES  [\^/\^/^\^/^\^/\^/\^/^\^/^\^/]
  20  [05/25/2017 12:54AM]: :: Synchronizing package databases...
  21  [05/25/2017 12:54AM]: downloading antergos-staging.db...
  22  [05/25/2017 12:54AM]: downloading antergos.db...
  23  [05/25/2017 12:54AM]: downloading core.db...
  24  [05/25/2017 12:54AM]: downloading community.db...
  25  [05/25/2017 12:54AM]: :: Starting full system upgrade...
  26  [05/25/2017 12:54AM]: [\^/\^/^\^/^\^/\^/\^/^\^/^\^/]  i686 DETECTED  [\^/\^/^\^/^\^/\^/\^/^\^/^\^/]
  27  [05/25/2017 12:54AM]: cp: -r not specified; omitting directory /pkg/32bit
  28  [05/25/2017 12:54AM]: cp: -r not specified; omitting directory /pkg/32build
  29  [05/25/2017 12:54AM]: [\^/\^/^\^/^\^/\^/\^/^\^/^\^/]  TRYING BUILD  [\^/\^/^\^/^\^/\^/\^/^\^/^\^/]
  30  [05/25/2017 12:54AM]: [\^/\^/^\^/^\^/\^/\^/^\^/^\^/]  UPDATING SOURCE CHECKSUMS  [\^/\^/^\^/^\^/\^/\^/^\^/^\^/]
  31  [05/25/2017 12:54AM]:   -> Downloading cjs-3.4.1.tar.gz...
  32  [05/25/2017 12:54AM]:   % Total    % Received % Xferd  Average Speed   Time    Time     Time  Current
  33  [05/25/2017 12:54AM]:                                  Dload  Upload   Total   Spent    Left  Speed
  34  [05/25/2017 12:54AM]: 
  35   0     0    0     0    0     0      0      0 --:--:-- --:--:-- --:--:--     0
  36 100   120    0   120    0     0   1175      0 --:--:-- --:--:-- --:--:--  1176
  37  [05/25/2017 12:54AM]: 
  38 100  415k    0  415k    0     0  1260k      0 --:--:-- --:--:-- --:--:-- 1260k
  39  [05/25/2017 12:54AM]: ==> Generating checksums for source files...
  40  [05/25/2017 12:54AM]: ==> Making package: cjs 3.4.1-1 (Thu May 25 05:54:57 UTC 2017)
  41  [05/25/2017 12:54AM]: ==> Checking runtime dependencies...
  42  [05/25/2017 12:54AM]: ==> Installing missing dependencies...
  43  [05/25/2017 12:54AM]: :: There are 3 providers available for libgl:
  44  [05/25/2017 12:54AM]:    1) libglvnd  2) nvidia-304xx-utils  3) nvidia-340xx-utils
  45  [05/25/2017 12:54AM]: Enter a number (default=1):
  46  [05/25/2017 12:54AM]: looking for conflicting packages...
  47  [05/25/2017 12:54AM]: warning: dependency cycle detected:
  48  [05/25/2017 12:54AM]: warning: harfbuzz will be installed before its freetype2 dependency
  49  [05/25/2017 12:54AM]: warning: mesa will be installed before its libglvnd dependency
  50  [05/25/2017 12:54AM]: Packages (41) damageproto-1.2.1-3  fixesproto-5.0+9+g4292ec1-1  fontconfig-2.12.1-4  freetype2-2.8-2  graphite-1:1.3.10-1  harfbuzz-1.4.6-1  kbproto-1.0.7-1  libdrm-2.4.80-1  libglvnd-0.2.999+g4ba53457-2  libomxil-bellagio-0.9.3-1  libpciaccess-0.13.5-1  libpng-1.6.29-1  libtxc_dxtn-1.0.1-6  libunwind-1.2-1  libx11-1.6.5-1  libxau-1.0.8-2  libxcb-1.12-1  libxdamage-1.1.4-2  libxdmcp-1.1.2-1  libxext-1.3.3-1  libxfixes-5.0.3-1  libxml2-2.9.4+16+g07418011-2  libxrender-0.9.10-1  libxshmfence-1.2-1  libxxf86vm-1.1.4-1  llvm-libs-4.0.0-2  lm_sensors-3.4.0-2  lzo-2.10-1  mesa-17.1.0-1  nspr-4.14-1  pixman-0.34.0-1  renderproto-0.11.1-3  wayland-1.13.0-1  xcb-proto-1.12-3  xextproto-7.3.0-1  xf86vidmodeproto-2.3.1-3  xproto-7.0.31-1  cairo-1.14.8-1  dbus-glib-0.108-1  gobject-introspection-runtime-1.52.1-1  js38-38.8.0-3
  51  [05/25/2017 12:54AM]: Total Download Size:     2.27 MiB
  52  [05/25/2017 12:54AM]: Total Installed Size:  168.05 MiB
  53  [05/25/2017 12:54AM]: :: Proceed with installation? [Y/n]
  54  [05/25/2017 12:54AM]: downloading js38-38.8.0-3-x86_64.pkg.tar.xz...
  55  [05/25/2017 12:55AM]: checking package integrity...
  56  [05/25/2017 12:55AM]: checking for file conflicts...
  57  [05/25/2017 12:55AM]: :: Processing package changes...
  58  [05/25/2017 12:55AM]: Optional dependencies for harfbuzz
  59  [05/25/2017 12:55AM]:     cairo: hb-view program [pending]
  60  [05/25/2017 12:55AM]: warning: directory permissions differ on /var/
  61  [05/25/2017 12:55AM]: filesystem: 777  package: 755
  62  [05/25/2017 12:55AM]:   Fontconfig configuration is done via /etc/fonts/conf.avail and conf.d.
  63  [05/25/2017 12:55AM]:   Read /etc/fonts/conf.d/README for more information.
  64  [05/25/2017 12:55AM]:   Configuration via /etc/fonts/local.conf is still possible,
  65  [05/25/2017 12:55AM]:   but is no longer recommended for options available in conf.avail.
  66  [05/25/2017 12:55AM]:   Main systemwide configuration should be done by symlinks
  67  [05/25/2017 12:55AM]:   (especially for autohinting, sub-pixel and lcdfilter):
  68  [05/25/2017 12:55AM]:   ln -s ../conf.avail/XX-foo.conf
  69  [05/25/2017 12:55AM]:   Check also https://wiki.archlinux.org/index.php/Font_Configuration
  70  [05/25/2017 12:55AM]:   and https://wiki.archlinux.org/index.php/Fonts.
  71  [05/25/2017 12:55AM]: updating font cache... done.
  72  [05/25/2017 12:55AM]: installing xf86vidmodeproto...
  73  [05/25/2017 12:55AM]: installing libomxil-bellagio...
  74  [05/25/2017 12:55AM]: Optional dependencies for lm_sensors
  75  [05/25/2017 12:55AM]:     rrdtool: for logging with sensord
  76  [05/25/2017 12:55AM]: Optional dependencies for mesa
  77  [05/25/2017 12:55AM]:     opengl-man-pages: for the OpenGL API man pages
  78  [05/25/2017 12:55AM]:     mesa-vdpau: for accelerated video playback
  79  [05/25/2017 12:55AM]:     libva-mesa-driver: for accelerated video playback
  80  [05/25/2017 12:55AM]: installing gobject-introspection-runtime...
  81  [05/25/2017 12:55AM]: :: Running post-transaction hooks...
  82  [05/25/2017 12:55AM]: (1/1) Arming ConditionNeedsUpdate...
  83  [05/25/2017 12:55AM]: Packages (24) autoconf-archive-1:2017.03.21-1  boost-libs-1.63.0-2  docbook-xml-4.5-6  docbook-xsl-1.79.1-2  glib2-docs-2.52.2+1+gb8bd46bc8-1  gtk-doc-1.25+33+g567353f-1  intltool-0.51.0-2  itstool-2.0.2+5+g676f3f7-2  libxslt-1.1.29+42+gac341cbd-1  perl-xml-parser-2.44-3  python-appdirs-1.4.3-1  python-beaker-1.8.1-2  python-mako-1.0.6-2  python-markupsafe-1.0-1  python-packaging-16.8-2  python-pyparsing-2.2.0-1  python-setuptools-1:35.0.2-1  python-six-1.10.0-3  source-highlight-3.1.8-11  yelp-tools-3.18.0+1+g193c2bd-1  yelp-xsl-3.20.1-2  gnome-common-3.18.0-2  gobject-introspection-1.52.1-1  python2-2.7.13-2
  84  [05/25/2017 12:55AM]: Total Installed Size:  143.43 MiB
  85  [05/25/2017 12:55AM]: installing autoconf-archive...
  86  [05/25/2017 12:55AM]: Optional dependencies for autoconf-archive
  87  [05/25/2017 12:55AM]:     automake: macros for use with it [installed]
  88  [05/25/2017 12:55AM]: installing perl-xml-parser...
  89  [05/25/2017 12:55AM]: Optional dependencies for python2
  90  [05/25/2017 12:55AM]: Optional dependencies for boost-libs
  91  [05/25/2017 12:55AM]:     openmpi: for mpi support
  92  [05/25/2017 12:55AM]: installing source-highlight...
  93  [05/25/2017 12:55AM]: Optional dependencies for gtk-doc
  94  [05/25/2017 12:55AM]: installing python-markupsafe...
  95  [05/25/2017 12:55AM]: installing python-pyparsing...
  96  [05/25/2017 12:55AM]: installing python-appdirs...
  97  [05/25/2017 12:55AM]: installing python-setuptools...
  98  [05/25/2017 12:55AM]: installing gobject-introspection...
  99  [05/25/2017 12:55AM]: (2/2) Updating the info directory file...
 100  [05/25/2017 12:55AM]:   -> Found cjs-3.4.1.tar.gz
 101  [05/25/2017 12:55AM]: ==> Validating source files with md5sums...
 102  [05/25/2017 12:55AM]:     cjs-3.4.1.tar.gz ... Passed
 103  [05/25/2017 12:55AM]:   -> Extracting cjs-3.4.1.tar.gz with bsdtar
 104  [05/25/2017 12:55AM]: autoreconf: Entering directory `.
 105  [05/25/2017 12:55AM]: autoreconf: configure.ac: not using Gettext
 106  [05/25/2017 12:55AM]: autoreconf: running: aclocal --force -I m4
 107  [05/25/2017 12:55AM]: autoreconf: configure.ac: tracing
 108  [05/25/2017 12:55AM]: autoreconf: running: libtoolize --copy --force
 109  [05/25/2017 12:55AM]: libtoolize: putting auxiliary files in ..
 110  [05/25/2017 12:55AM]: libtoolize: copying file ./ltmain.sh
 111  [05/25/2017 12:55AM]: libtoolize: putting macros in AC_CONFIG_MACRO_DIRS, m4.
 112  [05/25/2017 12:55AM]: libtoolize: copying file m4/libtool.m4
 113  [05/25/2017 12:55AM]: libtoolize: copying file m4/ltoptions.m4
 114  [05/25/2017 12:55AM]: libtoolize: copying file m4/ltsugar.m4
 115  [05/25/2017 12:55AM]: libtoolize: copying file m4/ltversion.m4
 116  [05/25/2017 12:55AM]: libtoolize: copying file m4/lt~obsolete.m4
 117  [05/25/2017 12:55AM]: autoreconf: running: /usr/bin/autoconf --force
 118  [05/25/2017 12:55AM]: autoreconf: running: /usr/bin/autoheader --force
 119  [05/25/2017 12:55AM]: autoreconf: running: automake --add-missing --copy --force-missing
 120  [05/25/2017 12:55AM]: configure.ac:39: installing ./compile
 121  [05/25/2017 12:55AM]: configure.ac:39: installing ./config.guess
 122  [05/25/2017 12:55AM]: configure.ac:39: installing ./config.sub
 123  [05/25/2017 12:55AM]: configure.ac:12: installing ./install-sh
 124  [05/25/2017 12:55AM]: configure.ac:12: installing ./missing
 125  [05/25/2017 12:55AM]: configure.ac:18: installing ./tap-driver.sh
 126  [05/25/2017 12:55AM]: Makefile.am: installing ./INSTALL
 127  [05/25/2017 12:55AM]: Makefile.am: installing ./depcomp
 128  [05/25/2017 12:55AM]: autoreconf: Leaving directory `.
 129  [05/25/2017 12:55AM]: checking for a BSD-compatible install... /usr/bin/install -c
 130  [05/25/2017 12:55AM]: checking whether build environment is sane... yes
 131  [05/25/2017 12:55AM]: checking for a thread-safe mkdir -p... /usr/bin/mkdir -p
 132  [05/25/2017 12:55AM]: checking whether make sets $(MAKE)... yes
 133  [05/25/2017 12:55AM]: checking whether make supports nested variables... yes
 134  [05/25/2017 12:55AM]: checking whether UID 1001 is supported by ustar format... yes
 135  [05/25/2017 12:55AM]: checking whether GID 100 is supported by ustar format... yes
 136  [05/25/2017 12:55AM]: checking how to create a ustar tar archive... gnutar
 137  [05/25/2017 12:55AM]: checking whether to enable maintainer-specific portions of Makefiles... yes
 138  [05/25/2017 12:55AM]: checking whether make supports nested variables... (cached) yes
 139  [05/25/2017 12:55AM]: checking for pkg-config... /usr/bin/pkg-config
 140  [05/25/2017 12:55AM]: checking pkg-config is at least version 0.9.0... yes
 141  [05/25/2017 12:55AM]: checking whether the C++ compiler works... yes
 142  [05/25/2017 12:55AM]: checking for C++ compiler default output file name... a.out
 143  [05/25/2017 12:55AM]: checking for suffix of executables...
 144  [05/25/2017 12:55AM]: checking whether we are cross compiling... no
 145  [05/25/2017 12:55AM]: checking for suffix of object files... o
 146  [05/25/2017 12:55AM]: checking whether we are using the GNU C++ compiler... yes
 147  [05/25/2017 12:55AM]: checking whether g++ accepts -g... yes
 148  [05/25/2017 12:55AM]: checking for style of include used by make... GNU
 149  [05/25/2017 12:55AM]: checking dependency style of g++... gcc3
 150  [05/25/2017 12:55AM]: checking whether g++ supports C++11 features by default... yes
 151  [05/25/2017 12:55AM]: checking build system type... x86_64-unknown-linux-gnu
 152  [05/25/2017 12:55AM]: checking host system type... x86_64-unknown-linux-gnu
 153  [05/25/2017 12:55AM]: checking how to print strings... printf
 154  [05/25/2017 12:55AM]: checking whether we are using the GNU C compiler... yes
 155  [05/25/2017 12:55AM]: checking for gcc option to accept ISO C89... none needed
 156  [05/25/2017 12:55AM]: checking whether gcc understands -c and -o together... yes
 157  [05/25/2017 12:55AM]: checking dependency style of gcc... gcc3
 158  [05/25/2017 12:55AM]: checking for a sed that does not truncate output... /usr/bin/sed
 159  [05/25/2017 12:55AM]: checking for grep that handles long lines and -e... /usr/bin/grep
 160  [05/25/2017 12:55AM]: checking for egrep... /usr/bin/grep -E
 161  [05/25/2017 12:55AM]: checking for fgrep... /usr/bin/grep -F
 162  [05/25/2017 12:55AM]: checking for ld used by gcc... /usr/bin/ld
 163  [05/25/2017 12:55AM]: checking if the linker (/usr/bin/ld) is GNU ld... yes
 164  [05/25/2017 12:55AM]: checking for BSD- or MS-compatible name lister (nm)... /usr/bin/nm -B
 165  [05/25/2017 12:55AM]: checking the name lister (/usr/bin/nm -B) interface... BSD nm
 166  [05/25/2017 12:55AM]: checking whether ln -s works... yes
 167  [05/25/2017 12:55AM]: checking the maximum length of command line arguments... 1572864
 168  [05/25/2017 12:55AM]: checking how to convert x86_64-unknown-linux-gnu file names to x86_64-unknown-linux-gnu format... func_convert_file_noop
 169  [05/25/2017 12:55AM]: checking how to convert x86_64-unknown-linux-gnu file names to toolchain format... func_convert_file_noop
 170  [05/25/2017 12:55AM]: checking for /usr/bin/ld option to reload object files... -r
 171  [05/25/2017 12:55AM]: checking for objdump... objdump
 172  [05/25/2017 12:55AM]: checking how to recognize dependent libraries... pass_all
 173  [05/25/2017 12:55AM]: checking for dlltool... no
 174  [05/25/2017 12:55AM]: checking how to associate runtime and link libraries... printf %s\n
 175  [05/25/2017 12:55AM]: checking for archiver @FILE support... @
 176  [05/25/2017 12:55AM]: checking for strip... strip
 177  [05/25/2017 12:55AM]: checking for ranlib... ranlib
 178  [05/25/2017 12:55AM]: checking command to parse /usr/bin/nm -B output from gcc object... ok
 179  [05/25/2017 12:55AM]: checking for a working dd... /usr/bin/dd
 180  [05/25/2017 12:55AM]: checking how to truncate binary pipes... /usr/bin/dd bs=4096 count=1
 181  [05/25/2017 12:55AM]: checking if : is a manifest tool... no
 182  [05/25/2017 12:55AM]: checking how to run the C preprocessor... gcc -E
 183  [05/25/2017 12:55AM]: checking for ANSI C header files... yes
 184  [05/25/2017 12:55AM]: checking for sys/types.h... yes
 185  [05/25/2017 12:55AM]: checking for sys/stat.h... yes
 186  [05/25/2017 12:55AM]: checking for stdlib.h... yes
 187  [05/25/2017 12:55AM]: checking for strings.h... yes
 188  [05/25/2017 12:55AM]: checking for dlfcn.h... yes
 189  [05/25/2017 12:55AM]: checking for objdir... .libs
 190  [05/25/2017 12:55AM]: checking if gcc supports -fno-rtti -fno-exceptions... no
 191  [05/25/2017 12:55AM]: checking for gcc option to produce PIC... -fPIC -DPIC
 192  [05/25/2017 12:55AM]: checking if gcc PIC flag -fPIC -DPIC works... yes
 193  [05/25/2017 12:55AM]: checking if gcc static flag -static works... yes
 194  [05/25/2017 12:55AM]: checking if gcc supports -c -o file.o... yes
 195  [05/25/2017 12:55AM]: checking if gcc supports -c -o file.o... (cached) yes
 196  [05/25/2017 12:55AM]: checking whether the gcc linker (/usr/bin/ld -m elf_x86_64) supports shared libraries... yes
 197  [05/25/2017 12:55AM]: checking whether -lc should be explicitly linked in... no
 198  [05/25/2017 12:55AM]: checking dynamic linker characteristics... GNU/Linux ld.so
 199  [05/25/2017 12:55AM]: checking how to hardcode library paths into programs... immediate
 200  [05/25/2017 12:55AM]: checking whether stripping libraries is possible... yes
 201  [05/25/2017 12:55AM]: checking if libtool supports shared libraries... yes
 202  [05/25/2017 12:55AM]: checking whether to build shared libraries... yes
 203  [05/25/2017 12:55AM]: checking whether to build static libraries... no
 204  [05/25/2017 12:55AM]: checking how to run the C++ preprocessor... g++ -E
 205  [05/25/2017 12:55AM]: checking for ld used by g++... /usr/bin/ld -m elf_x86_64
 206  [05/25/2017 12:55AM]: checking if the linker (/usr/bin/ld -m elf_x86_64) is GNU ld... yes
 207  [05/25/2017 12:55AM]: checking dynamic linker characteristics... (cached) GNU/Linux ld.so
 208  [05/25/2017 12:55AM]: checking for a sed that does not truncate output... (cached) /usr/bin/sed
 209  [05/25/2017 12:55AM]: checking for gawk... (cached) gawk
 210  [05/25/2017 12:55AM]: checking whether C compiler accepts -Werror=unknown-warning-option... no
 211  [05/25/2017 12:55AM]: checking whether C compiler accepts -Wno-suggest-attribute=format... yes
 212  [05/25/2017 12:55AM]: checking whether C compiler accepts -fno-strict-aliasing... yes
 213  [05/25/2017 12:55AM]: checking whether C compiler accepts -Wall... yes
 214  [05/25/2017 12:55AM]: checking whether C compiler accepts -Wextra... yes
 215  [05/25/2017 12:55AM]: checking whether C compiler accepts -Wundef... yes
 216  [05/25/2017 12:55AM]: checking whether C compiler accepts -Wnested-externs... yes
 217  [05/25/2017 12:55AM]: checking whether C compiler accepts -Wwrite-strings... yes
 218  [05/25/2017 12:55AM]: checking whether C compiler accepts -Wpointer-arith... yes
 219  [05/25/2017 12:55AM]: checking whether C compiler accepts -Wmissing-declarations... yes
 220  [05/25/2017 12:55AM]: checking whether C compiler accepts -Wmissing-prototypes... yes
 221  [05/25/2017 12:55AM]: checking whether C compiler accepts -Wstrict-prototypes... yes
 222  [05/25/2017 12:55AM]: checking whether C compiler accepts -Wredundant-decls... yes
 223  [05/25/2017 12:55AM]: checking whether C compiler accepts -Wno-unused-parameter... yes
 224  [05/25/2017 12:55AM]: checking whether C compiler accepts -Wno-missing-field-initializers... yes
 225  [05/25/2017 12:55AM]: checking whether C compiler accepts -Wdeclaration-after-statement... yes
 226  [05/25/2017 12:55AM]: checking whether C compiler accepts -Wformat=2... yes
 227  [05/25/2017 12:55AM]: checking whether C compiler accepts -Wold-style-definition... yes
 228  [05/25/2017 12:55AM]: checking whether C compiler accepts -Wcast-align... yes
 229  [05/25/2017 12:55AM]: checking whether C compiler accepts -Wformat-nonliteral... yes
 230  [05/25/2017 12:55AM]: checking whether C compiler accepts -Wformat-security... yes
 231  [05/25/2017 12:55AM]: checking whether C compiler accepts -Wsign-compare... yes
 232  [05/25/2017 12:55AM]: checking whether C compiler accepts -Wstrict-aliasing... yes
 233  [05/25/2017 12:55AM]: checking whether C compiler accepts -Wshadow... yes
 234  [05/25/2017 12:55AM]: checking whether C compiler accepts -Winline... yes
 235  [05/25/2017 12:55AM]: checking whether C compiler accepts -Wpacked... yes
 236  [05/25/2017 12:55AM]: checking whether C compiler accepts -Wmissing-format-attribute... yes
 237  [05/25/2017 12:55AM]: checking whether C compiler accepts -Wmissing-noreturn... yes
 238  [05/25/2017 12:55AM]: checking whether C compiler accepts -Winit-self... yes
 239  [05/25/2017 12:55AM]: checking whether C compiler accepts -Wredundant-decls... (cached) yes
 240  [05/25/2017 12:55AM]: checking whether C compiler accepts -Wmissing-include-dirs... yes
 241  [05/25/2017 12:55AM]: checking whether C compiler accepts -Wunused-but-set-variable... yes
 242  [05/25/2017 12:55AM]: checking whether C compiler accepts -Warray-bounds... yes
 243  [05/25/2017 12:55AM]: checking whether C compiler accepts -Wimplicit-function-declaration... yes
 244  [05/25/2017 12:55AM]: checking whether C compiler accepts -Wreturn-type... yes
 245  [05/25/2017 12:55AM]: checking whether C compiler accepts -Wswitch-enum... yes
 246  [05/25/2017 12:55AM]: checking whether C compiler accepts -Wswitch-default... yes
 247  [05/25/2017 12:55AM]: checking whether C compiler accepts -Wno-error=unused-parameter... yes
 248  [05/25/2017 12:55AM]: checking whether C compiler accepts -Wno-error=missing-field-initializers... yes
 249  [05/25/2017 12:55AM]: checking whether C++ compiler accepts -Werror=unknown-warning-option... no
 250  [05/25/2017 12:55AM]: checking whether C++ compiler accepts -Wno-suggest-attribute=format... yes
 251  [05/25/2017 12:55AM]: checking whether C++ compiler accepts -fno-strict-aliasing... yes
 252  [05/25/2017 12:55AM]: checking whether C++ compiler accepts -Wall... yes
 253  [05/25/2017 12:55AM]: checking whether C++ compiler accepts -Wextra... yes
 254  [05/25/2017 12:55AM]: checking whether C++ compiler accepts -Wundef... yes
 255  [05/25/2017 12:55AM]: checking whether C++ compiler accepts -Wwrite-strings... yes
 256  [05/25/2017 12:55AM]: checking whether C++ compiler accepts -Wpointer-arith... yes
 257  [05/25/2017 12:55AM]: checking whether C++ compiler accepts -Wmissing-declarations... yes
 258  [05/25/2017 12:55AM]: checking whether C++ compiler accepts -Wredundant-decls... yes
 259  [05/25/2017 12:55AM]: checking whether C++ compiler accepts -Wno-unused-parameter... yes
 260  [05/25/2017 12:55AM]: checking whether C++ compiler accepts -Wno-missing-field-initializers... yes
 261  [05/25/2017 12:55AM]: checking whether C++ compiler accepts -Wformat=2... yes
 262  [05/25/2017 12:55AM]: checking whether C++ compiler accepts -Wcast-align... yes
 263  [05/25/2017 12:55AM]: checking whether C++ compiler accepts -Wformat-nonliteral... yes
 264  [05/25/2017 12:55AM]: checking whether C++ compiler accepts -Wformat-security... yes
 265  [05/25/2017 12:55AM]: checking whether C++ compiler accepts -Wsign-compare... yes
 266  [05/25/2017 12:55AM]: checking whether C++ compiler accepts -Wstrict-aliasing... yes
 267  [05/25/2017 12:55AM]: checking whether C++ compiler accepts -Wshadow... yes
 268  [05/25/2017 12:55AM]: checking whether C++ compiler accepts -Winline... yes
 269  [05/25/2017 12:55AM]: checking whether C++ compiler accepts -Wpacked... yes
 270  [05/25/2017 12:55AM]: checking whether C++ compiler accepts -Wmissing-format-attribute... yes
 271  [05/25/2017 12:55AM]: checking whether C++ compiler accepts -Wmissing-noreturn... yes
 272  [05/25/2017 12:55AM]: checking whether C++ compiler accepts -Winit-self... yes
 273  [05/25/2017 12:55AM]: checking whether C++ compiler accepts -Wredundant-decls... (cached) yes
 274  [05/25/2017 12:55AM]: checking whether C++ compiler accepts -Wmissing-include-dirs... yes
 275  [05/25/2017 12:55AM]: checking whether C++ compiler accepts -Wunused-but-set-variable... yes
 276  [05/25/2017 12:55AM]: checking whether C++ compiler accepts -Warray-bounds... yes
 277  [05/25/2017 12:55AM]: checking whether C++ compiler accepts -Wreturn-type... yes
 278  [05/25/2017 12:55AM]: checking whether C++ compiler accepts -Wno-overloaded-virtual... yes
 279  [05/25/2017 12:55AM]: checking whether C++ compiler accepts -Wswitch-enum... yes
 280  [05/25/2017 12:55AM]: checking whether C++ compiler accepts -Wswitch-default... yes
 281  [05/25/2017 12:55AM]: checking whether C++ compiler accepts -Wno-error=unused-parameter... yes
 282  [05/25/2017 12:55AM]: checking whether C++ compiler accepts -Wno-error=missing-field-initializers... yes
 283  [05/25/2017 12:55AM]: checking whether C++ compiler accepts -Wno-error=overloaded-virtual... yes
 284  [05/25/2017 12:55AM]: checking whether C++ compiler accepts -Werror=unknown-warning-option... (cached) no
 285  [05/25/2017 12:55AM]: checking whether the linker accepts -Wl,--no-as-needed... yes
 286  [05/25/2017 12:55AM]: checking whether the linker accepts -Wl,--fatal-warnings... yes
 287  [05/25/2017 12:55AM]: checking whether the linker accepts -Wl,-fatal_warnings... no
 288  [05/25/2017 12:55AM]: checking whether to build with code coverage support... no
 289  [05/25/2017 12:55AM]: checking whether the linker accepts -lgcov... yes
 290  [05/25/2017 12:55AM]: checking for gobject-introspection... yes
 291  [05/25/2017 12:55AM]: checking for gobject-2.0 >= 2.42.0... yes
 292  [05/25/2017 12:55AM]: checking for gobject-introspection-1.0 libffi gthread-2.0 gio-2.0 >= 2.42.0 mozjs-38... yes
 293  [05/25/2017 12:55AM]: checking for gobject-2.0 >= 2.42.0 gio-2.0... yes
 294  [05/25/2017 12:55AM]: checking for gio-unix-2.0 gobject-introspection-1.0 libffi gthread-2.0 gio-2.0 >= 2.42.0 mozjs-38... yes
 295  [05/25/2017 12:55AM]: checking for cairo cairo-gobject gthread-2.0 gio-2.0 >= 2.42.0 mozjs-38... yes
 296  [05/25/2017 12:55AM]: checking for gtk+-3.0 >= 3.14.0... no
 297  [05/25/2017 12:55AM]: checking how to link readline libs... -lreadline
 298  [05/25/2017 12:55AM]: checking readline/readline.h usability... yes
 299  [05/25/2017 12:55AM]: checking readline/readline.h presence... yes
 300  [05/25/2017 12:55AM]: checking for readline/readline.h... yes
 301  [05/25/2017 12:55AM]: checking whether printf() accepts %Id for alternative integer output... no
 302  [05/25/2017 12:55AM]: checking whether the linker accepts -Bsymbolic-functions... yes
 303  [05/25/2017 12:55AM]: checking whether C++ compiler accepts -fno-rtti... yes
 304  [05/25/2017 12:55AM]: checking for dbus-run-session... /usr/bin/dbus-run-session
 305  [05/25/2017 12:55AM]: checking whether C++ compiler accepts --param inline-unit-growth=50... yes
 306  [05/25/2017 12:55AM]: checking that generated files are newer than configure... done
 307  [05/25/2017 12:55AM]: configure: creating ./config.status
 308  [05/25/2017 12:55AM]: config.status: creating Makefile
 309  [05/25/2017 12:55AM]: config.status: creating cjs-1.0.pc
 310  [05/25/2017 12:55AM]: config.status: creating win32/config.h.win32
 311  [05/25/2017 12:55AM]: config.status: creating config.h
 312  [05/25/2017 12:55AM]: config.status: linking /usr/share/gobject-introspection-1.0/tests/gitestmacros.h to installed-tests/gitestmacros.h
 313  [05/25/2017 12:55AM]: config.status: linking /usr/share/gobject-introspection-1.0/tests/regress.c to installed-tests/regress.c
 314  [05/25/2017 12:55AM]: config.status: linking /usr/share/gobject-introspection-1.0/tests/regress.h to installed-tests/regress.h
 315  [05/25/2017 12:55AM]: config.status: linking /usr/share/gobject-introspection-1.0/tests/warnlib.c to installed-tests/warnlib.c
 316  [05/25/2017 12:55AM]: config.status: linking /usr/share/gobject-introspection-1.0/tests/warnlib.h to installed-tests/warnlib.h
 317  [05/25/2017 12:55AM]: config.status: linking /usr/share/gobject-introspection-1.0/tests/gimarshallingtests.c to installed-tests/gimarshallingtests.c
 318  [05/25/2017 12:55AM]: config.status: linking /usr/share/gobject-introspection-1.0/tests/gimarshallingtests.h to installed-tests/gimarshallingtests.h
 319  [05/25/2017 12:55AM]: config.status: executing depfiles commands
 320  [05/25/2017 12:55AM]: config.status: executing libtool commands
 321  [05/25/2017 12:55AM]: 	GJS_CFLAGS:		-I/usr/include/glib-2.0 -I/usr/lib/glib-2.0/include
 322  [05/25/2017 12:55AM]: 	GJS_LIBS:		-lgobject-2.0 -lglib-2.0
 323  [05/25/2017 12:55AM]:   GEN      mock-js-resources.c
 324  [05/25/2017 12:55AM]:   GEN      jsunit-resources.h
 325  [05/25/2017 12:55AM]:   GEN      jsunit-resources.c
 326  [05/25/2017 12:55AM]: git.mk: Generating .gitignore
 327  [05/25/2017 12:55AM]: make[1]: Entering directory /pkg/src/cjs-3.4.1
 328  [05/25/2017 12:55AM]:   CXX      gi/libcjs_la-arg.lo
 329  [05/25/2017 12:55AM]:   CXX      gi/libcjs_la-boxed.lo
 330  [05/25/2017 12:55AM]:   CXX      gi/libcjs_la-closure.lo
 331  [05/25/2017 12:56AM]:   CXX      gi/libcjs_la-enumeration.lo
 332  [05/25/2017 12:56AM]:   CXX      gi/libcjs_la-foreign.lo
 333  [05/25/2017 12:56AM]:   CXX      gi/libcjs_la-fundamental.lo
 334  [05/25/2017 12:56AM]:   CXX      gi/libcjs_la-function.lo
 335  [05/25/2017 12:56AM]:   CXX      gi/libcjs_la-gerror.lo
 336  [05/25/2017 12:56AM]:   CXX      gi/libcjs_la-gtype.lo
 337  [05/25/2017 12:56AM]:   CXX      gi/libcjs_la-interface.lo
 338  [05/25/2017 12:56AM]:   CXX      gi/libcjs_la-ns.lo
 339  [05/25/2017 12:56AM]:   CXX      gi/libcjs_la-object.lo
 340  [05/25/2017 12:56AM]:   CXX      gi/libcjs_la-param.lo
 341  [05/25/2017 12:56AM]:   CXX      gi/libcjs_la-proxyutils.lo
 342  [05/25/2017 12:56AM]:   CXX      gi/libcjs_la-repo.lo
 343  [05/25/2017 12:56AM]:   CXX      gi/libcjs_la-toggle.lo
 344  [05/25/2017 12:56AM]:   CXX      gi/libcjs_la-union.lo
 345  [05/25/2017 12:56AM]:   CXX      gi/libcjs_la-value.lo
 346  [05/25/2017 12:56AM]:   CXX      cjs/libcjs_la-byteArray.lo
 347  [05/25/2017 12:56AM]:   CXX      cjs/libcjs_la-context.lo
 348  [05/25/2017 12:56AM]:   CXX      cjs/libcjs_la-coverage.lo
 349  [05/25/2017 12:56AM]:   CXX      cjs/libcjs_la-importer.lo
 350  [05/25/2017 12:56AM]:   CXX      cjs/libcjs_la-jsapi-constructor-proxy.lo
 351  [05/25/2017 12:56AM]:   CXX      cjs/libcjs_la-jsapi-dynamic-class.lo
 352  [05/25/2017 12:56AM]:   CXX      cjs/libcjs_la-jsapi-private.lo
 353  [05/25/2017 12:56AM]:   CXX      cjs/libcjs_la-jsapi-util.lo
 354  [05/25/2017 12:56AM]:   CXX      cjs/libcjs_la-jsapi-util-error.lo
 355  [05/25/2017 12:56AM]:   CXX      cjs/libcjs_la-jsapi-util-string.lo
 356  [05/25/2017 12:56AM]:   CXX      cjs/libcjs_la-mem.lo
 357  [05/25/2017 12:56AM]:   CXX      cjs/libcjs_la-native.lo
 358  [05/25/2017 12:56AM]:   CXX      cjs/libcjs_la-runtime.lo
 359  [05/25/2017 12:56AM]:   CXX      cjs/libcjs_la-stack.lo
 360  [05/25/2017 12:56AM]:   CXX      modules/libcjs_la-modules.lo
 361  [05/25/2017 12:56AM]:   CXX      util/libcjs_la-error.lo
 362  [05/25/2017 12:56AM]:   CXX      util/libcjs_la-glib.lo
 363  [05/25/2017 12:56AM]:   CXX      util/libcjs_la-hash-x32.lo
 364  [05/25/2017 12:56AM]:   CXX      util/libcjs_la-log.lo
 365  [05/25/2017 12:56AM]:   CXX      util/libcjs_la-misc.lo
 366  [05/25/2017 12:56AM]:   CXX      libgjs-private/libcjs_la-gjs-gdbus-wrapper.lo
 367  [05/25/2017 12:56AM]:   CXX      libgjs-private/libcjs_la-gjs-util.lo
 368  [05/25/2017 12:56AM]:   CXX      modules/libconsole_la-console.lo
 369  [05/25/2017 12:56AM]: ar: `u modifier ignored since `D is the default (see `U)
 370  [05/25/2017 12:56AM]:   CXX      modules/libsystem_la-system.lo
 371  [05/25/2017 12:56AM]:   CC       libmodules_resources_la-modules-resources.lo
 372  [05/25/2017 12:56AM]:   CCLD     libmodules_resources.la
 373  [05/25/2017 12:56AM]:   CXX      modules/libcairoNative_la-cairo-region.lo
 374  [05/25/2017 12:56AM]:   CXX      modules/libcairoNative_la-cairo-context.lo
 375  [05/25/2017 12:56AM]:   CXX      modules/libcairoNative_la-cairo-path.lo
 376  [05/25/2017 12:56AM]:   CXX      modules/libcairoNative_la-cairo-surface.lo
 377  [05/25/2017 12:56AM]:   CXX      modules/libcairoNative_la-cairo-image-surface.lo
 378  [05/25/2017 12:56AM]:   CXX      modules/libcairoNative_la-cairo-ps-surface.lo
 379  [05/25/2017 12:56AM]:   CXX      modules/libcairoNative_la-cairo-pdf-surface.lo
 380  [05/25/2017 12:56AM]:   CXX      modules/libcairoNative_la-cairo-svg-surface.lo
 381  [05/25/2017 12:56AM]:   CXX      modules/libcairoNative_la-cairo-pattern.lo
 382  [05/25/2017 12:56AM]:   CXX      modules/libcairoNative_la-cairo-gradient.lo
 383  [05/25/2017 12:56AM]:   CXX      modules/libcairoNative_la-cairo-linear-gradient.lo
 384  [05/25/2017 12:56AM]:   CXX      modules/libcairoNative_la-cairo-radial-gradient.lo
 385  [05/25/2017 12:57AM]:   CXX      modules/libcairoNative_la-cairo-surface-pattern.lo
 386  [05/25/2017 12:57AM]:   CXX      modules/libcairoNative_la-cairo-solid-pattern.lo
 387  [05/25/2017 12:57AM]:   CXX      modules/libcairoNative_la-cairo.lo
 388  [05/25/2017 12:57AM]:   CXXLD    libcairoNative.la
 389  [05/25/2017 12:57AM]:   CXX      cjs/cjs_console-console.o
 390  [05/25/2017 12:57AM]:   CC       installed-tests/libregress_la-regress.lo
 391  [05/25/2017 12:57AM]:   GISCAN   Regress-1.0.gir
 392  [05/25/2017 12:57AM]: In file included from /usr/include/bits/libc-header-start.h:33:0,
 393  [05/25/2017 12:57AM]:                  from /usr/include/limits.h:26,
 394  [05/25/2017 12:57AM]:                  from /usr/lib/gcc/x86_64-pc-linux-gnu/6.3.1/include-fixed/limits.h:168,
 395  [05/25/2017 12:57AM]:                  from /usr/lib/gcc/x86_64-pc-linux-gnu/6.3.1/include-fixed/syslimits.h:7,
 396  [05/25/2017 12:57AM]:                  from /usr/lib/gcc/x86_64-pc-linux-gnu/6.3.1/include-fixed/limits.h:34,
 397  [05/25/2017 12:57AM]:                  from /usr/lib/glib-2.0/include/glibconfig.h:11,
 398  [05/25/2017 12:57AM]:                  from /usr/include/glib-2.0/glib/gtypes.h:32,
 399  [05/25/2017 12:57AM]:                  from /usr/include/glib-2.0/glib/galloca.h:32,
 400  [05/25/2017 12:57AM]:                  from /usr/include/glib-2.0/glib.h:30,
 401  [05/25/2017 12:57AM]:                  from /usr/include/glib-2.0/gobject/gbinding.h:28,
 402  [05/25/2017 12:57AM]:                  from /usr/include/glib-2.0/glib-object.h:23,
 403  [05/25/2017 12:57AM]:                  from /usr/include/cairo/cairo-gobject.h:44,
 404  [05/25/2017 12:57AM]:                  from /usr/share/gobject-introspection-1.0/tests/regress.h:5,
 405  [05/25/2017 12:57AM]:                  from /tmp/g-ir-cpp-4xiij4l2.c:4:
 406  [05/25/2017 12:57AM]: /usr/include/features.h:373:4: warning: #warning _FORTIFY_SOURCE requires compiling with optimization (-O) [-Wcpp]
 407  [05/25/2017 12:57AM]:  #  warning _FORTIFY_SOURCE requires compiling with optimization (-O)
 408  [05/25/2017 12:57AM]:   CC       installed-tests/libwarnlib_la-warnlib.lo
 409  [05/25/2017 12:57AM]:                  from /usr/include/glib-2.0/gio/gioenums.h:28,
 410  [05/25/2017 12:57AM]:                  from /usr/include/glib-2.0/gio/giotypes.h:28,
 411  [05/25/2017 12:57AM]:                  from /usr/include/glib-2.0/gio/gio.h:26,
 412  [05/25/2017 12:57AM]:                  from /usr/share/gobject-introspection-1.0/tests/warnlib.h:6,
 413  [05/25/2017 12:57AM]:                  from /tmp/g-ir-cpp-3wrxqfhm.c:4:
 414  [05/25/2017 12:57AM]: g-ir-scanner: WarnLib: warning: 9 warnings suppressed (use --warn-all to see them)
 415  [05/25/2017 12:57AM]:   CC       installed-tests/libgimarshallingtests_la-gimarshallingtests.lo
 416  [05/25/2017 12:57AM]:   CCLD     libgimarshallingtests.la
 417  [05/25/2017 12:57AM]:   GISCAN   GIMarshallingTests-1.0.gir
 418  [05/25/2017 12:57AM]:                  from /usr/share/gobject-introspection-1.0/tests/gimarshallingtests.h:5,
 419  [05/25/2017 12:57AM]:                  from /tmp/g-ir-cpp-q5eh4h2u.c:4:
 420  [05/25/2017 12:57AM]:   GISCAN   CjsPrivate-1.0.gir
 421  [05/25/2017 12:57AM]:                  from /pkg/src/cjs-3.4.1/libgjs-private/gjs-gdbus-wrapper.h:26,
 422  [05/25/2017 12:57AM]:                  from /tmp/g-ir-cpp-r6jdehfv.c:4:
 423  [05/25/2017 12:57AM]: make[1]: Leaving directory /pkg/src/cjs-3.4.1
 424  [05/25/2017 12:57AM]: make  libregress.la libwarnlib.la libgimarshallingtests.la gjs-tests minijasmine
 425  [05/25/2017 12:57AM]: make[2]: libwarnlib.la is up to date.
 426  [05/25/2017 12:57AM]: make[2]: libgimarshallingtests.la is up to date.
 427  [05/25/2017 12:57AM]:   CXX      test/gjs_tests-gjs-tests.o
 428  [05/25/2017 12:57AM]:   CXX      test/gjs_tests-gjs-test-utils.o
 429  [05/25/2017 12:57AM]:   CXX      test/gjs_tests-gjs-test-call-args.o
 430  [05/25/2017 12:57AM]:   CXX      test/gjs_tests-gjs-test-coverage.o
 431  [05/25/2017 12:57AM]:   CXX      test/gjs_tests-gjs-test-rooting.o
 432  [05/25/2017 12:57AM]:   CC       gjs_tests-mock-js-resources.o
 433  [05/25/2017 12:57AM]:   GEN      mock-cache-invalidation-before.gresource
 434  [05/25/2017 12:57AM]:   GEN      mock-cache-invalidation-after.gresource
 435  [05/25/2017 12:57AM]:   CXX      installed-tests/minijasmine-minijasmine.o
 436  [05/25/2017 12:57AM]:   CC       minijasmine-jsunit-resources.o
 437  [05/25/2017 12:57AM]: PASS: gjs-tests 1 /gjs/context/exit
 438  [05/25/2017 12:57AM]: PASS: gjs-tests 2 /gjs/context/construct/destroy
 439  [05/25/2017 12:57AM]: PASS: gjs-tests 3 /gjs/context/construct/eval
 440  [05/25/2017 12:57AM]: PASS: gjs-tests 4 /gjs/gobject/js_defined_type
 441  [05/25/2017 12:57AM]: PASS: gjs-tests 5 /gjs/jsutil/strip_shebang/no_shebang
 442  [05/25/2017 12:57AM]: PASS: gjs-tests 6 /gjs/jsutil/strip_shebang/have_shebang
 443  [05/25/2017 12:57AM]: PASS: gjs-tests 7 /gjs/jsutil/strip_shebang/only_shebang
 444  [05/25/2017 12:57AM]: PASS: gjs-tests 8 /gjs/jsapi/util/error/throw
 445  [05/25/2017 12:57AM]: PASS: gjs-tests 9 /gjs/jsapi/util/string/char16_data
 446  [05/25/2017 12:57AM]: PASS: gjs-tests 10 /gjs/jsapi/util/string/to_ucs4
 447  [05/25/2017 12:57AM]: PASS: gjs-tests 11 /gjs/jsapi/util/string/js/string/utf8
 448  [05/25/2017 12:57AM]: PASS: gjs-tests 12 /gjs/jsapi/util/debug_string/valid-utf8
 449  [05/25/2017 12:57AM]: SKIP: gjs-tests 13 /gjs/jsapi/util/debug_string/invalid-utf8 # SKIP SpiderMonkey doesnt validate UTF-8 after encoding it
 450  [05/25/2017 12:57AM]: PASS: gjs-tests 14 /gjs/jsapi/util/debug_string/object-with-complicated-to-string
 451  [05/25/2017 12:57AM]: PASS: gjs-tests 15 /gjs/coverage/file_duplicated_into_output_path
 452  [05/25/2017 12:57AM]: ERROR: gjs-tests - too few tests run (expected 99, got 15)
 453  [05/25/2017 12:57AM]: ERROR: gjs-tests - exited with status 134 (terminated by signal 6?)
 454  [05/25/2017 12:57AM]: FAIL: installed-tests/scripts/testCommandLine.sh 1 - System.exit(0) should exit successfully
 455  [05/25/2017 12:57AM]: FAIL: installed-tests/scripts/testCommandLine.sh 2 - System.exit(42) should exit with the correct exit code
 456  [05/25/2017 12:57AM]: PASS: installed-tests/scripts/testCommandLine.sh 3 - System.exit() should still exit across an FFI boundary
 457  [05/25/2017 12:57AM]: FAIL: installed-tests/scripts/testCommandLine.sh 4 - --help should succeed
 458  [05/25/2017 12:57AM]: FAIL: installed-tests/scripts/testCommandLine.sh 5 - --help should print something
 459  [05/25/2017 12:57AM]: FAIL: installed-tests/scripts/testCommandLine.sh 6 - should succeed when --help is not first arg
 460  [05/25/2017 12:57AM]: FAIL: installed-tests/scripts/testCommandLine.sh 7 - should print something when --help is not first arg
 461  [05/25/2017 12:57AM]: FAIL: installed-tests/scripts/testCommandLine.sh 8 - --help should succeed before a script file
 462  [05/25/2017 12:57AM]: FAIL: installed-tests/scripts/testCommandLine.sh 9 - --help should print something before a script file
 463  [05/25/2017 12:57AM]: FAIL: installed-tests/scripts/testCommandLine.sh 10 - --help should succeed before -c
 464  [05/25/2017 12:57AM]: FAIL: installed-tests/scripts/testCommandLine.sh 11 - --help should print something before -c
 465  [05/25/2017 12:57AM]: FAIL: installed-tests/scripts/testCommandLine.sh 12 - --help after script file should be passed to script
 466  [05/25/2017 12:57AM]: PASS: installed-tests/scripts/testCommandLine.sh 13 - --help after script file should not print anything
 467  [05/25/2017 12:57AM]: FAIL: installed-tests/scripts/testCommandLine.sh 14 - --help after -c should be passed to script
 468  [05/25/2017 12:57AM]: PASS: installed-tests/scripts/testCommandLine.sh 15 - --help after -c should not print anything
 469  [05/25/2017 12:57AM]: FAIL: installed-tests/scripts/testCommandLine.sh 16 - -I after script should succeed but give a warning
 470  [05/25/2017 12:57AM]: FAIL: installed-tests/scripts/testCommandLine.sh 17 - --coverage-prefix after script should succeed but give a warning
 471  [05/25/2017 12:57AM]: FAIL: installed-tests/scripts/testCommandLine.sh 18 - --coverage-output after script should succeed but give a warning
 472  [05/25/2017 12:57AM]: FAIL: installed-tests/scripts/testCommandLine.sh 19 - --version should work
 473  [05/25/2017 12:57AM]: FAIL: installed-tests/scripts/testCommandLine.sh 20 - --version should print something
 474  [05/25/2017 12:57AM]: FAIL: installed-tests/scripts/testCommandLine.sh 21 - --version after -c should be passed to script
 475  [05/25/2017 12:57AM]: PASS: installed-tests/scripts/testCommandLine.sh 22 - --version after -c should not print anything
 476  [05/25/2017 12:57AM]: FAIL: installed-tests/scripts/testWarnings.sh 1 - overwriting method with Signals.addSignalMethods() should warn
 477  [05/25/2017 12:57AM]: FAIL: installed-tests/scripts/testWarnings.sh 2 - passing too many arguments to a GI function should warn
 478  [05/25/2017 12:57AM]: PASS: installed-tests/js/testself.js 1 Test harness internal consistency
 479  [05/25/2017 12:57AM]: PASS: installed-tests/js/testByteArray.js 1 Byte array has length 0 for empty array
 480  [05/25/2017 12:57AM]: PASS: installed-tests/js/testByteArray.js 2 Byte array initially sized to 10 has length 10
 481  [05/25/2017 12:57AM]: PASS: installed-tests/js/testByteArray.js 3 Byte array initially sized to 10 is initialized to zeroes
 482  [05/25/2017 12:57AM]: PASS: installed-tests/js/testByteArray.js 4 Byte array assigns values correctly
 483  [05/25/2017 12:57AM]: PASS: installed-tests/js/testByteArray.js 5 Byte array assignment past end implicitly lengthens the array
 484  [05/25/2017 12:57AM]: PASS: installed-tests/js/testByteArray.js 6 Byte array assignment past end implicitly creates zero bytes
 485  [05/25/2017 12:57AM]: PASS: installed-tests/js/testByteArray.js 7 Byte array changes the length when assigning to length property
 486  [05/25/2017 12:57AM]: PASS: installed-tests/js/testByteArray.js 8 Byte array conversions gives a byte 5 when assigning 5
 487  [05/25/2017 12:57AM]: PASS: installed-tests/js/testByteArray.js 9 Byte array conversions gives a byte 0 when assigning null
 488  [05/25/2017 12:57AM]: PASS: installed-tests/js/testByteArray.js 10 Byte array conversions gives a byte 0 when assigning undefined
 489  [05/25/2017 12:57AM]: PASS: installed-tests/js/testByteArray.js 11 Byte array conversions rounds off when assigning a double
 490  [05/25/2017 12:57AM]: PASS: installed-tests/js/testByteArray.js 12 Byte array can be created from a string
 491  [05/25/2017 12:57AM]: PASS: installed-tests/js/testByteArray.js 13 Byte array can be encoded from a string
 492  [05/25/2017 12:57AM]: PASS: installed-tests/js/testByteArray.js 14 Byte array encodes as UTF-8 by default
 493  [05/25/2017 12:57AM]: PASS: installed-tests/js/testByteArray.js 15 Byte array can be created from an array
 494  [05/25/2017 12:57AM]: PASS: installed-tests/js/testByteArray.js 16 Byte array can be converted to a string of ASCII characters
 495  [05/25/2017 12:57AM]: PASS: installed-tests/js/testClass.js 1 Class framework calls _init constructors
 496  [05/25/2017 12:57AM]: PASS: installed-tests/js/testClass.js 2 Class framework calls parent constructors
 497  [05/25/2017 12:57AM]: PASS: installed-tests/js/testClass.js 3 Class framework sets the right constructor properties
 498  [05/25/2017 12:57AM]: PASS: installed-tests/js/testClass.js 4 Class framework sets up instanceof correctly
 499  [05/25/2017 12:57AM]: PASS: installed-tests/js/testClass.js 5 Class framework reports a sensible value for toString()
 500  [05/25/2017 12:57AM]: PASS: installed-tests/js/testClass.js 6 Class framework allows overriding toString()
 501  [05/25/2017 12:57AM]: PASS: installed-tests/js/testClass.js 7 Class framework is not configurable
 502  [05/25/2017 12:57AM]: PASS: installed-tests/js/testClass.js 8 Class framework allows accessors for properties
 503  [05/25/2017 12:57AM]: PASS: installed-tests/js/testClass.js 9 Class framework raises an exception when creating an abstract class
 504  [05/25/2017 12:57AM]: PASS: installed-tests/js/testClass.js 10 Class framework inherits properties from abstract base classes
 505  [05/25/2017 12:57AM]: PASS: installed-tests/js/testClass.js 11 Class framework inherits constructors from abstract base classes
 506  [05/25/2017 12:57AM]: PASS: installed-tests/js/testClass.js 12 Class framework lets methods call other methods without clobbering __caller__
 507  [05/25/2017 12:57AM]: PASS: installed-tests/js/testClass.js 13 Class framework allows custom return values from constructors
 508  [05/25/2017 12:57AM]: PASS: installed-tests/js/testClass.js 14 Class framework allows symbol-named methods
 509  [05/25/2017 12:57AM]: PASS: installed-tests/js/testCoverage.js 1 Coverage.expressionLinesForAST works with no trailing newline
 510  [05/25/2017 12:57AM]: PASS: installed-tests/js/testCoverage.js 2 Coverage.expressionLinesForAST finds lines on both sides of an assignment expression
 511  [05/25/2017 12:57AM]: PASS: installed-tests/js/testCoverage.js 3 Coverage.expressionLinesForAST finds lines inside functions
 512  [05/25/2017 12:57AM]: PASS: installed-tests/js/testCoverage.js 4 Coverage.expressionLinesForAST finds lines inside anonymous functions
 513  [05/25/2017 12:57AM]: PASS: installed-tests/js/testCoverage.js 5 Coverage.expressionLinesForAST finds lines inside body of function property
 514  [05/25/2017 12:57AM]: PASS: installed-tests/js/testCoverage.js 6 Coverage.expressionLinesForAST finds lines inside arguments of function property
 515  [05/25/2017 12:57AM]: PASS: installed-tests/js/testCoverage.js 7 Coverage.expressionLinesForAST finds lines inside multiline function arguments
 516  [05/25/2017 12:57AM]: PASS: installed-tests/js/testCoverage.js 8 Coverage.expressionLinesForAST finds lines inside function argument that is an object
 517  [05/25/2017 12:57AM]: PASS: installed-tests/js/testCoverage.js 9 Coverage.expressionLinesForAST finds lines inside a while loop
 518  [05/25/2017 12:57AM]: PASS: installed-tests/js/testCoverage.js 10 Coverage.expressionLinesForAST finds lines inside try, catch, and finally
 519  [05/25/2017 12:57AM]: PASS: installed-tests/js/testCoverage.js 11 Coverage.expressionLinesForAST finds lines inside case statements
 520  [05/25/2017 12:57AM]: PASS: installed-tests/js/testCoverage.js 12 Coverage.expressionLinesForAST finds lines inside case statements with character cases
 521  [05/25/2017 12:57AM]: PASS: installed-tests/js/testCoverage.js 13 Coverage.expressionLinesForAST finds lines inside a for loop
 522  [05/25/2017 12:57AM]: PASS: installed-tests/js/testCoverage.js 14 Coverage.expressionLinesForAST finds lines inside if-statement branches
 523  [05/25/2017 12:57AM]: PASS: installed-tests/js/testCoverage.js 15 Coverage.expressionLinesForAST finds all lines of multiline if-conditions
 524  [05/25/2017 12:57AM]: PASS: installed-tests/js/testCoverage.js 16 Coverage.expressionLinesForAST finds lines for object property literals
 525  [05/25/2017 12:57AM]: PASS: installed-tests/js/testCoverage.js 17 Coverage.expressionLinesForAST finds lines for function-valued object properties
 526  [05/25/2017 12:57AM]: PASS: installed-tests/js/testCoverage.js 18 Coverage.expressionLinesForAST finds lines inside object-valued object properties
 527  [05/25/2017 12:57AM]: PASS: installed-tests/js/testCoverage.js 19 Coverage.expressionLinesForAST finds lines inside array-valued object properties
 528  [05/25/2017 12:57AM]: PASS: installed-tests/js/testCoverage.js 20 Coverage.expressionLinesForAST finds lines inside object-valued argument to return statement
 529  [05/25/2017 12:57AM]: PASS: installed-tests/js/testCoverage.js 21 Coverage.expressionLinesForAST finds lines inside object-valued argument to throw statement
 530  [05/25/2017 12:57AM]: PASS: installed-tests/js/testCoverage.js 22 Coverage.functionsForAST works with no trailing newline
 531  [05/25/2017 12:57AM]: PASS: installed-tests/js/testCoverage.js 23 Coverage.functionsForAST finds functions
 532  [05/25/2017 12:57AM]: PASS: installed-tests/js/testCoverage.js 24 Coverage.functionsForAST finds nested functions
 533  [05/25/2017 12:57AM]: PASS: installed-tests/js/testCoverage.js 25 Coverage.functionsForAST finds functions on the same line but with different arguments
 534  [05/25/2017 12:57AM]: PASS: installed-tests/js/testCoverage.js 26 Coverage.functionsForAST finds functions inside an array expression
 535  [05/25/2017 12:57AM]: PASS: installed-tests/js/testCoverage.js 27 Coverage.functionsForAST finds functions inside an arrow expression
 536  [05/25/2017 12:57AM]: PASS: installed-tests/js/testCoverage.js 28 Coverage.functionsForAST finds functions inside a sequence
 537  [05/25/2017 12:57AM]: PASS: installed-tests/js/testCoverage.js 29 Coverage.functionsForAST finds functions inside a unary expression
 538  [05/25/2017 12:57AM]: PASS: installed-tests/js/testCoverage.js 30 Coverage.functionsForAST finds functions inside a binary expression
 539  [05/25/2017 12:57AM]: PASS: installed-tests/js/testCoverage.js 31 Coverage.functionsForAST finds functions inside an assignment expression
 540  [05/25/2017 12:57AM]: PASS: installed-tests/js/testCoverage.js 32 Coverage.functionsForAST finds functions inside a reflexive assignment expression
 541  [05/25/2017 12:57AM]: PASS: installed-tests/js/testCoverage.js 33 Coverage.functionsForAST finds functions inside if-statement conditions
 542  [05/25/2017 12:57AM]: PASS: installed-tests/js/testCoverage.js 34 Coverage.functionsForAST finds functions inside while-statement conditions
 543  [05/25/2017 12:57AM]: PASS: installed-tests/js/testCoverage.js 35 Coverage.functionsForAST finds functions inside for-statement initializer
 544  [05/25/2017 12:57AM]: PASS: installed-tests/js/testCoverage.js 36 Coverage.functionsForAST finds functions inside let-statement in for-statement initializer
 545  [05/25/2017 12:57AM]: PASS: installed-tests/js/testCoverage.js 37 Coverage.functionsForAST finds functions inside var-statement inside for-statement initializer
 546  [05/25/2017 12:57AM]: PASS: installed-tests/js/testCoverage.js 38 Coverage.functionsForAST finds functions inside for-statement condition
 547  [05/25/2017 12:57AM]: PASS: installed-tests/js/testCoverage.js 39 Coverage.functionsForAST finds functions inside for-statement increment
 548  [05/25/2017 12:57AM]: PASS: installed-tests/js/testCoverage.js 40 Coverage.functionsForAST finds functions inside for-in-statement
 549  [05/25/2017 12:57AM]: PASS: installed-tests/js/testCoverage.js 41 Coverage.functionsForAST finds functions inside for-each statement
 550  [05/25/2017 12:57AM]: PASS: installed-tests/js/testCoverage.js 42 Coverage.functionsForAST finds functions inside for-of statement
 551  [05/25/2017 12:57AM]: PASS: installed-tests/js/testCoverage.js 43 Coverage.functionsForAST finds function literals used as an object
 552  [05/25/2017 12:57AM]: PASS: installed-tests/js/testCoverage.js 44 Coverage.functionsForAST finds function literals used as an object in a dynamic property expression
 553  [05/25/2017 12:57AM]: PASS: installed-tests/js/testCoverage.js 45 Coverage.functionsForAST finds functions on either side of a logical expression
 554  [05/25/2017 12:57AM]: PASS: installed-tests/js/testCoverage.js 46 Coverage.functionsForAST finds functions on either side of a conditional expression
 555  [05/25/2017 12:57AM]: PASS: installed-tests/js/testCoverage.js 47 Coverage.functionsForAST finds functions as the argument of a yield statement
 556  [05/25/2017 12:57AM]: PASS: installed-tests/js/testCoverage.js 48 Coverage.functionsForAST finds functions in an array comprehension body
 557  [05/25/2017 12:57AM]: PASS: installed-tests/js/testCoverage.js 49 Coverage.functionsForAST finds functions in an array comprehension block
 558  [05/25/2017 12:57AM]: PASS: installed-tests/js/testCoverage.js 50 Coverage.functionsForAST finds functions in an array comprehension filter
 559  [05/25/2017 12:57AM]: PASS: installed-tests/js/testCoverage.js 51 Coverage.branchesForAST works with no trailing newline
 560  [05/25/2017 12:57AM]: PASS: installed-tests/js/testCoverage.js 52 Coverage.branchesForAST finds both branch exits for a simple branch
 561  [05/25/2017 12:57AM]: PASS: installed-tests/js/testCoverage.js 53 Coverage.branchesForAST finds a single exit for a branch with one consequent
 562  [05/25/2017 12:57AM]: PASS: installed-tests/js/testCoverage.js 54 Coverage.branchesForAST finds multiple exits for nested if-else branches
 563  [05/25/2017 12:57AM]: PASS: installed-tests/js/testCoverage.js 55 Coverage.branchesForAST finds a simple two-exit branch without blocks
 564  [05/25/2017 12:57AM]: PASS: installed-tests/js/testCoverage.js 56 Coverage.branchesForAST does not find a branch if the consequent was empty
 565  [05/25/2017 12:57AM]: PASS: installed-tests/js/testCoverage.js 57 Coverage.branchesForAST finds a single exit if only the alternate exit was defined
 566  [05/25/2017 12:57AM]: PASS: installed-tests/js/testCoverage.js 58 Coverage.branchesForAST finds an implicit branch for while statement
 567  [05/25/2017 12:57AM]: PASS: installed-tests/js/testCoverage.js 59 Coverage.branchesForAST finds an implicit branch for a do-while statement
 568  [05/25/2017 12:57AM]: PASS: installed-tests/js/testCoverage.js 60 Coverage.branchesForAST finds all exits for case statements
 569  [05/25/2017 12:57AM]: PASS: installed-tests/js/testCoverage.js 61 Coverage.branchesForAST finds all exits for case statements with fallthrough
 570  [05/25/2017 12:57AM]: PASS: installed-tests/js/testCoverage.js 62 Coverage.branchesForAST finds no exits for case statements with only no-ops
 571  [05/25/2017 12:57AM]: PASS: installed-tests/js/testCoverage.js 63 Coverage gets the number of lines in the script
 572  [05/25/2017 12:57AM]: PASS: installed-tests/js/testCoverage.js 64 Coverage turns zero expression lines into counters
 573  [05/25/2017 12:57AM]: PASS: installed-tests/js/testCoverage.js 65 Coverage turns a single expression line into counters
 574  [05/25/2017 12:57AM]: PASS: installed-tests/js/testCoverage.js 66 Coverage returns empty array for no branches
 575  [05/25/2017 12:57AM]: PASS: installed-tests/js/testCoverage.js 67 Coverage branch counters gets same number of counters as number of lines plus one
 576  [05/25/2017 12:57AM]: PASS: installed-tests/js/testCoverage.js 68 Coverage branch counters branches on lines for array indices
 577  [05/25/2017 12:57AM]: PASS: installed-tests/js/testCoverage.js 69 Coverage branch counters sets exits for branch
 578  [05/25/2017 12:57AM]: PASS: installed-tests/js/testCoverage.js 70 Coverage branch counters sets last exit to highest exit start line
 579  [05/25/2017 12:57AM]: PASS: installed-tests/js/testCoverage.js 71 Coverage branch counters always has hit initially false
 580  [05/25/2017 12:57AM]: PASS: installed-tests/js/testCoverage.js 72 Coverage branch counters branch tracker sets branch to hit on point execution
 581  [05/25/2017 12:57AM]: PASS: installed-tests/js/testCoverage.js 73 Coverage branch counters branch tracker sets exit to hit on execution
 582  [05/25/2017 12:57AM]: PASS: installed-tests/js/testCoverage.js 74 Coverage branch counters branch tracker finds next branch
 583  [05/25/2017 12:57AM]: PASS: installed-tests/js/testCoverage.js 75 Coverage function key from function with name matches schema
 584  [05/25/2017 12:57AM]: PASS: installed-tests/js/testCoverage.js 76 Coverage function key from function without name is anonymous
 585  [05/25/2017 12:57AM]: PASS: installed-tests/js/testCoverage.js 77 Coverage returns a function counter map for function keys
 586  [05/25/2017 12:57AM]: PASS: installed-tests/js/testCoverage.js 78 Coverage reports an error when two indistinguishable functions are present
 587  [05/25/2017 12:57AM]: PASS: installed-tests/js/testCoverage.js 79 Coverage populates a known functions array
 588  [05/25/2017 12:57AM]: PASS: installed-tests/js/testCoverage.js 80 Coverage converts function counters to an array
 589  [05/25/2017 12:57AM]: PASS: installed-tests/js/testCoverage.js 81 Coverage.incrementFunctionCounters increments for function on same execution start line
 590  [05/25/2017 12:57AM]: PASS: installed-tests/js/testCoverage.js 82 Coverage.incrementFunctionCounters can disambiguate two functions with the same name
 591  [05/25/2017 12:57AM]: PASS: installed-tests/js/testCoverage.js 83 Coverage.incrementFunctionCounters can disambiguate two functions on same line with different params
 592  [05/25/2017 12:57AM]: PASS: installed-tests/js/testCoverage.js 84 Coverage.incrementFunctionCounters can disambiguate two functions on same line by guessing closest params
 593  [05/25/2017 12:57AM]: PASS: installed-tests/js/testCoverage.js 85 Coverage.incrementFunctionCounters increments for function on earlier start line
 594  [05/25/2017 12:57AM]: PASS: installed-tests/js/testCoverage.js 86 Coverage.incrementFunctionCounters throws an error on unexpected function
 595  [05/25/2017 12:57AM]: PASS: installed-tests/js/testCoverage.js 87 Coverage.incrementFunctionCounters throws if line out of range
 596  [05/25/2017 12:57AM]: PASS: installed-tests/js/testCoverage.js 88 Coverage.incrementFunctionCounters increments if in range
 597  [05/25/2017 12:57AM]: PASS: installed-tests/js/testCoverage.js 89 Coverage.incrementFunctionCounters warns if we hit a non-executable line
 598  [05/25/2017 12:57AM]: PASS: installed-tests/js/testCoverage.js 90 Coverage statistics container fetches valid statistics for file
 599  [05/25/2017 12:57AM]: PASS: installed-tests/js/testCoverage.js 91 Coverage statistics container throws for nonexisting file
 600  [05/25/2017 12:57AM]: PASS: installed-tests/js/testCoverage.js 92 Coverage statistics container with cache fetches counters from cache
 601  [05/25/2017 12:57AM]: PASS: installed-tests/js/testCoverage.js 93 Coverage statistics container with cache fetches counters from reflection if missed
 602  [05/25/2017 12:57AM]: PASS: installed-tests/js/testCoverage.js 94 Coverage statistics container with cache cache is not stale if all hit
 603  [05/25/2017 12:57AM]: PASS: installed-tests/js/testCoverage.js 95 Coverage statistics container with cache cache is stale if missed
 604  [05/25/2017 12:57AM]: PASS: installed-tests/js/testCoverage.js 96 Coverage statistics container coverage counters from cache have same executable lines as reflection
 605  [05/25/2017 12:57AM]: PASS: installed-tests/js/testCoverage.js 97 Coverage statistics container coverage counters from cache have same branch exits as reflection
 606  [05/25/2017 12:57AM]: PASS: installed-tests/js/testCoverage.js 98 Coverage statistics container coverage counters from cache have same branch points as reflection
 607  [05/25/2017 12:57AM]: PASS: installed-tests/js/testCoverage.js 99 Coverage statistics container coverage counters from cache have same function keys as reflection
 608  [05/25/2017 12:57AM]: PASS: installed-tests/js/testExceptions.js 1 Exceptions are thrown from property setter
 609  [05/25/2017 12:57AM]: PASS: installed-tests/js/testExceptions.js 2 Exceptions are thrown from property getter
 610  [05/25/2017 12:57AM]: ERROR: installed-tests/js/testExceptions.js - too few tests run (expected 17, got 2)
 611  [05/25/2017 12:57AM]: ERROR: installed-tests/js/testExceptions.js - exited with status 133 (terminated by signal 5?)
 612  [05/25/2017 12:57AM]: PASS: installed-tests/js/testEverythingBasic.js 1 Life, the Universe and Everything includes booleans
 613  [05/25/2017 12:57AM]: PASS: installed-tests/js/testEverythingBasic.js 2 Life, the Universe and Everything includes 8-bit integers
 614  [05/25/2017 12:57AM]: PASS: installed-tests/js/testEverythingBasic.js 3 Life, the Universe and Everything includes unsigned 8-bit integers
 615  [05/25/2017 12:57AM]: PASS: installed-tests/js/testEverythingBasic.js 4 Life, the Universe and Everything includes 16-bit integers
 616  [05/25/2017 12:57AM]: PASS: installed-tests/js/testEverythingBasic.js 5 Life, the Universe and Everything includes unsigned 16-bit integers
 617  [05/25/2017 12:57AM]: PASS: installed-tests/js/testEverythingBasic.js 6 Life, the Universe and Everything includes 32-bit integers
 618  [05/25/2017 12:57AM]: PASS: installed-tests/js/testEverythingBasic.js 7 Life, the Universe and Everything includes unsigned 32-bit integers
 619  [05/25/2017 12:57AM]: PASS: installed-tests/js/testEverythingBasic.js 8 Life, the Universe and Everything includes 64-bit integers
 620  [05/25/2017 12:57AM]: PASS: installed-tests/js/testEverythingBasic.js 9 Life, the Universe and Everything includes unsigned 64-bit integers
 621  [05/25/2017 12:57AM]: PASS: installed-tests/js/testEverythingBasic.js 10 Life, the Universe and Everything includes shorts
 622  [05/25/2017 12:57AM]: PASS: installed-tests/js/testEverythingBasic.js 11 Life, the Universe and Everything includes ints
 623  [05/25/2017 12:57AM]: PASS: installed-tests/js/testEverythingBasic.js 12 Life, the Universe and Everything includes longs
 624  [05/25/2017 12:57AM]: PASS: installed-tests/js/testEverythingBasic.js 13 Life, the Universe and Everything includes ssizes
 625  [05/25/2017 12:57AM]: PASS: installed-tests/js/testEverythingBasic.js 14 Life, the Universe and Everything includes floats
 626  [05/25/2017 12:57AM]: PASS: installed-tests/js/testEverythingBasic.js 15 Life, the Universe and Everything includes doubles
 627  [05/25/2017 12:57AM]: PASS: installed-tests/js/testEverythingBasic.js 16 Life, the Universe and Everything includes ushorts
 628  [05/25/2017 12:57AM]: PASS: installed-tests/js/testEverythingBasic.js 17 Life, the Universe and Everything includes uints
 629  [05/25/2017 12:57AM]: PASS: installed-tests/js/testEverythingBasic.js 18 Life, the Universe and Everything includes ulongs
 630  [05/25/2017 12:57AM]: PASS: installed-tests/js/testEverythingBasic.js 19 Life, the Universe and Everything includes sizes
 631  [05/25/2017 12:57AM]: PASS: installed-tests/js/testEverythingBasic.js 20 Life, the Universe and Everything includes wide characters
 632  [05/25/2017 12:57AM]: PASS: installed-tests/js/testEverythingBasic.js 21 Life, the Universe and Everything includes time_t
 633  [05/25/2017 12:57AM]: PASS: installed-tests/js/testEverythingBasic.js 22 Life, the Universe and Everything Limits marshals max value of unsigned 8-bit integers
 634  [05/25/2017 12:57AM]: PASS: installed-tests/js/testEverythingBasic.js 23 Life, the Universe and Everything Limits marshals min value of signed 8-bit integers
 635  [05/25/2017 12:57AM]: PASS: installed-tests/js/testEverythingBasic.js 24 Life, the Universe and Everything Limits marshals max value of signed 8-bit integers
 636  [05/25/2017 12:57AM]: PASS: installed-tests/js/testEverythingBasic.js 25 Life, the Universe and Everything Limits marshals max value of unsigned 16-bit integers
 637  [05/25/2017 12:57AM]: PASS: installed-tests/js/testEverythingBasic.js 26 Life, the Universe and Everything Limits marshals min value of signed 16-bit integers
 638  [05/25/2017 12:57AM]: PASS: installed-tests/js/testEverythingBasic.js 27 Life, the Universe and Everything Limits marshals max value of signed 16-bit integers
 639  [05/25/2017 12:57AM]: PASS: installed-tests/js/testEverythingBasic.js 28 Life, the Universe and Everything Limits marshals max value of unsigned 32-bit integers
 640  [05/25/2017 12:57AM]: PASS: installed-tests/js/testEverythingBasic.js 29 Life, the Universe and Everything Limits marshals min value of signed 32-bit integers
 641  [05/25/2017 12:57AM]: PASS: installed-tests/js/testEverythingBasic.js 30 Life, the Universe and Everything Limits marshals max value of signed 32-bit integers
 642  [05/25/2017 12:57AM]: SKIP: installed-tests/js/testEverythingBasic.js 31 Life, the Universe and Everything Limits marshals max value of unsigned 64-bit integers # SKIP This test doesnt work
 643  [05/25/2017 12:57AM]: PASS: installed-tests/js/testEverythingBasic.js 32 Life, the Universe and Everything Limits marshals min value of signed 64-bit integers
 644  [05/25/2017 12:57AM]: SKIP: installed-tests/js/testEverythingBasic.js 33 Life, the Universe and Everything Limits marshals max value of signed 64-bit integers # SKIP This test doesnt work
 645  [05/25/2017 12:57AM]: ERROR: installed-tests/js/testEverythingBasic.js - too few tests run (expected 132, got 33)
 646  [05/25/2017 12:57AM]: ERROR: installed-tests/js/testEverythingBasic.js - exited with status 133 (terminated by signal 5?)
 647  [05/25/2017 12:57AM]: PASS: installed-tests/js/testEverythingEncapsulated.js 1 Introspected structs simple sets fields correctly
 648  [05/25/2017 12:57AM]: PASS: installed-tests/js/testEverythingEncapsulated.js 2 Introspected structs simple can clone
 649  [05/25/2017 12:57AM]: PASS: installed-tests/js/testEverythingEncapsulated.js 3 Introspected structs nested sets fields correctly
 650  [05/25/2017 12:57AM]: PASS: installed-tests/js/testEverythingEncapsulated.js 4 Introspected structs nested can clone
 651  [05/25/2017 12:57AM]: PASS: installed-tests/js/testEverythingEncapsulated.js 5 Introspected structs constructors copies an object from a hash of field values
 652  [05/25/2017 12:57AM]: PASS: installed-tests/js/testEverythingEncapsulated.js 6 Introspected structs constructors catches bad field names
 653  [05/25/2017 12:57AM]: PASS: installed-tests/js/testEverythingEncapsulated.js 7 Introspected structs constructors copies an object from another object of the same type
 654  [05/25/2017 12:57AM]: PASS: installed-tests/js/testEverythingEncapsulated.js 8 Introspected structs containing fixed array
 655  [05/25/2017 12:57AM]: PASS: installed-tests/js/testEverythingEncapsulated.js 9 Introspected boxed types sets fields correctly
 656  [05/25/2017 12:57AM]: PASS: installed-tests/js/testEverythingEncapsulated.js 10 Introspected boxed types copy constructors copies an object from a hash of field values
 657  [05/25/2017 12:57AM]: PASS: installed-tests/js/testEverythingEncapsulated.js 11 Introspected boxed types copy constructors catches bad field names
 658  [05/25/2017 12:57AM]: PASS: installed-tests/js/testEverythingEncapsulated.js 12 Introspected boxed types copy constructors copies an object from another object of the same type
 659  [05/25/2017 12:57AM]: PASS: installed-tests/js/testEverythingEncapsulated.js 13 Introspected boxed types nested reads fields and nested fields
 660  [05/25/2017 12:57AM]: PASS: installed-tests/js/testEverythingEncapsulated.js 14 Introspected boxed types nested assigns nested struct field from an instance
 661  [05/25/2017 12:57AM]: PASS: installed-tests/js/testEverythingEncapsulated.js 15 Introspected boxed types nested assigns nested struct field directly from a hash of field values
 662  [05/25/2017 12:57AM]: PASS: installed-tests/js/testEverythingEncapsulated.js 16 Introspected boxed types constructs with a nested hash of field values
 663  [05/25/2017 12:57AM]: PASS: installed-tests/js/testEverythingEncapsulated.js 17 Introspected boxed types constructs using a custom constructor
 664  [05/25/2017 12:57AM]: PASS: installed-tests/js/testEverythingEncapsulated.js 18 Introspected boxed types constructs using a custom constructor in backwards compatibility mode
 665  [05/25/2017 12:57AM]: PASS: installed-tests/js/testEverythingEncapsulated.js 19 Introspected GObject can access fields with simple types
 666  [05/25/2017 12:57AM]: PASS: installed-tests/js/testEverythingEncapsulated.js 20 Introspected GObject cannot access fields with complex types (GI limitation)
 667  [05/25/2017 12:57AM]: PASS: installed-tests/js/testEverythingEncapsulated.js 21 Introspected GObject silently does not set read-only fields
 668  [05/25/2017 12:57AM]: PASS: installed-tests/js/testEverythingEncapsulated.js 22 Introspected GObject throws an error in strict mode when setting a read-only field
 669  [05/25/2017 12:57AM]: PASS: installed-tests/js/testEverythingEncapsulated.js 23 Introspected GObject has normal Object methods
 670  [05/25/2017 12:57AM]: PASS: installed-tests/js/testEverythingEncapsulated.js 24 Introspected function length skips over instance parameters of methods
 671  [05/25/2017 12:57AM]: PASS: installed-tests/js/testEverythingEncapsulated.js 25 Introspected function length skips over out and GError parameters
 672  [05/25/2017 12:57AM]: PASS: installed-tests/js/testEverythingEncapsulated.js 26 Introspected function length does not skip over inout parameters
 673  [05/25/2017 12:57AM]: SKIP: installed-tests/js/testEverythingEncapsulated.js 27 Introspected function length skips over parameters annotated with skip # SKIP Not implemented yet
 674  [05/25/2017 12:57AM]: PASS: installed-tests/js/testEverythingEncapsulated.js 28 Introspected function length gives number of arguments for static methods
 675  [05/25/2017 12:57AM]: PASS: installed-tests/js/testEverythingEncapsulated.js 29 Introspected function length skips over destroy-notify and user-data parameters
 676  [05/25/2017 12:57AM]: PASS: installed-tests/js/testFormat.js 1 imports.format escapes % with another % character
 677  [05/25/2017 12:57AM]: PASS: installed-tests/js/testFormat.js 2 imports.format formats a single string argument
 678  [05/25/2017 12:57AM]: PASS: installed-tests/js/testFormat.js 3 imports.format formats two string arguments
 679  [05/25/2017 12:57AM]: PASS: installed-tests/js/testFormat.js 4 imports.format formats two swapped string arguments
 680  [05/25/2017 12:57AM]: PASS: installed-tests/js/testFormat.js 5 imports.format formats a number in base 10
 681  [05/25/2017 12:57AM]: PASS: installed-tests/js/testFormat.js 6 imports.format formats a number in base 16
 682  [05/25/2017 12:57AM]: PASS: installed-tests/js/testFormat.js 7 imports.format formats a floating point number with no precision
 683  [05/25/2017 12:57AM]: PASS: installed-tests/js/testFormat.js 8 imports.format formats a floating point number with precision 2
 684  [05/25/2017 12:57AM]: PASS: installed-tests/js/testFormat.js 9 imports.format pads with zeroes
 685  [05/25/2017 12:57AM]: PASS: installed-tests/js/testFormat.js 10 imports.format pads with spaces
 686  [05/25/2017 12:57AM]: PASS: installed-tests/js/testFormat.js 11 imports.format throws an error when given incorrect modifiers for the conversion type
 687  [05/25/2017 12:57AM]: PASS: installed-tests/js/testFormat.js 12 imports.format throws an error when incorrectly instructed to swap arguments
 688  [05/25/2017 12:57AM]: PASS: installed-tests/js/testFundamental.js 1 Fundamental type support constructs a subtype of a fundamental type
 689  [05/25/2017 12:57AM]: PASS: installed-tests/js/testFundamental.js 2 Fundamental type support constructs a subtype of a hidden (no introspection data) fundamental type
 690  [05/25/2017 12:57AM]: PASS: installed-tests/js/testGettext.js 1 Gettext module setlocale returns a locale
 691  [05/25/2017 12:57AM]: PASS: installed-tests/js/testGIMarshalling.js 1 C array can be passed to a function
 692  [05/25/2017 12:57AM]: PASS: installed-tests/js/testGIMarshalling.js 2 C array can be passed to a function with its length parameter before it
 693  [05/25/2017 12:57AM]: PASS: installed-tests/js/testGIMarshalling.js 3 C array can be passed to a function with zero terminator
 694  [05/25/2017 12:57AM]: PASS: installed-tests/js/testGIMarshalling.js 4 C array can be passed to a function in the style of gtk_init()
 695  [05/25/2017 12:57AM]: PASS: installed-tests/js/testGIMarshalling.js 5 C array can be returned with zero terminator
 696  [05/25/2017 12:57AM]: PASS: installed-tests/js/testGIMarshalling.js 6 C array can be returned
 697  [05/25/2017 12:57AM]: PASS: installed-tests/js/testGIMarshalling.js 7 C array can be returned along with other arguments
 698  [05/25/2017 12:57AM]: PASS: installed-tests/js/testGIMarshalling.js 8 C array can be an out argument
 699  [05/25/2017 12:57AM]: PASS: installed-tests/js/testGIMarshalling.js 9 C array can be an out argument along with other arguments
 700  [05/25/2017 12:57AM]: PASS: installed-tests/js/testGIMarshalling.js 10 C array can be an in-out argument
 701  [05/25/2017 12:57AM]: PASS: installed-tests/js/testGIMarshalling.js 11 C array can be an in-out argument along with other arguments
 702  [05/25/2017 12:57AM]: PASS: installed-tests/js/testGIMarshalling.js 12 C array copies correctly on transfer full
 703  [05/25/2017 12:57AM]: PASS: installed-tests/js/testGIMarshalling.js 13 C array of structs can be passed to a function
 704  [05/25/2017 12:57AM]: PASS: installed-tests/js/testGIMarshalling.js 14 C array of structs can be returned with zero terminator
 705  [05/25/2017 12:57AM]: PASS: installed-tests/js/testGIMarshalling.js 15 C array of booleans is coerced to true/false when passed to a function
 706  [05/25/2017 12:57AM]: PASS: installed-tests/js/testGIMarshalling.js 16 C array of booleans can be an out argument
 707  [05/25/2017 12:57AM]: PASS: installed-tests/js/testGIMarshalling.js 17 C array of unichars can be passed to a function
 708  [05/25/2017 12:57AM]: PASS: installed-tests/js/testGIMarshalling.js 18 C array of unichars can be an out argument
 709  [05/25/2017 12:57AM]: PASS: installed-tests/js/testGIMarshalling.js 19 C array of unichars can be returned with zero terminator
 710  [05/25/2017 12:57AM]: PASS: installed-tests/js/testGIMarshalling.js 20 C array of unichars can be implicitly converted from a number array
 711  [05/25/2017 12:57AM]: PASS: installed-tests/js/testGIMarshalling.js 21 C array of strings can be passed to a function
 712  [05/25/2017 12:57AM]: PASS: installed-tests/js/testGIMarshalling.js 22 C array of enums can be passed to a function
 713  [05/25/2017 12:57AM]: PASS: installed-tests/js/testGIMarshalling.js 23 C array of bytes can be an in argument with length
 714  [05/25/2017 12:57AM]: PASS: installed-tests/js/testGIMarshalling.js 24 C array of bytes can be implicitly converted from a string
 715  [05/25/2017 12:57AM]: PASS: installed-tests/js/testGIMarshalling.js 25 C array of 64-bit ints can be passed to a function
 716  [05/25/2017 12:57AM]: PASS: installed-tests/js/testGIMarshalling.js 26 C array of 64-bit ints can be an in argument with length
 717  [05/25/2017 12:57AM]: PASS: installed-tests/js/testGIMarshalling.js 27 GArray of integers can be passed in with transfer none
 718  [05/25/2017 12:57AM]: PASS: installed-tests/js/testGIMarshalling.js 28 GArray of integers can be returned with transfer none
 719  [05/25/2017 12:57AM]: PASS: installed-tests/js/testGIMarshalling.js 29 GArray of strings can be passed in with transfer none
 720  [05/25/2017 12:57AM]: PASS: installed-tests/js/testGIMarshalling.js 30 GArray of strings can be passed as return with transfer none
 721  [05/25/2017 12:57AM]: PASS: installed-tests/js/testGIMarshalling.js 31 GArray of strings can be passed as return with transfer container
 722  [05/25/2017 12:57AM]: PASS: installed-tests/js/testGIMarshalling.js 32 GArray of strings can be passed as return with transfer full
 723  [05/25/2017 12:57AM]: PASS: installed-tests/js/testGIMarshalling.js 33 GArray of strings can be passed as out with transfer none
 724  [05/25/2017 12:57AM]: PASS: installed-tests/js/testGIMarshalling.js 34 GArray of strings can be passed as out with transfer container
 725  [05/25/2017 12:57AM]: PASS: installed-tests/js/testGIMarshalling.js 35 GArray of strings can be passed as out with transfer full
 726  [05/25/2017 12:57AM]: PASS: installed-tests/js/testGIMarshalling.js 36 GArray of booleans can be passed in with transfer none
 727  [05/25/2017 12:57AM]: PASS: installed-tests/js/testGIMarshalling.js 37 GArray of unichars can be passed in with transfer none
 728  [05/25/2017 12:57AM]: PASS: installed-tests/js/testGIMarshalling.js 38 GArray of unichars can be implicitly converted from a number array
 729  [05/25/2017 12:57AM]: PASS: installed-tests/js/testGIMarshalling.js 39 GByteArray can be passed in with transfer none
 730  [05/25/2017 12:57AM]: PASS: installed-tests/js/testGIMarshalling.js 40 GByteArray can be returned with transfer full
 731  [05/25/2017 12:57AM]: PASS: installed-tests/js/testGIMarshalling.js 41 GByteArray can be implicitly converted from a normal array
 732  [05/25/2017 12:57AM]: PASS: installed-tests/js/testGIMarshalling.js 42 GBytes can be created from an array and passed in
 733  [05/25/2017 12:57AM]: PASS: installed-tests/js/testGIMarshalling.js 43 GBytes can be created by returning from a function and passed in
 734  [05/25/2017 12:57AM]: PASS: installed-tests/js/testGIMarshalling.js 44 GBytes can be implicitly converted from a ByteArray
 735  [05/25/2017 12:57AM]: PASS: installed-tests/js/testGIMarshalling.js 45 GBytes can be created from a string and is encoded in UTF-8
 736  [05/25/2017 12:57AM]: PASS: installed-tests/js/testGIMarshalling.js 46 GBytes turns into a GByteArray on assignment
 737  [05/25/2017 12:57AM]: PASS: installed-tests/js/testGIMarshalling.js 47 GBytes cannot be passed to a function expecting a byte array
 738  [05/25/2017 12:57AM]: PASS: installed-tests/js/testGIMarshalling.js 48 GPtrArray can be passed to a function with transfer none
 739  [05/25/2017 12:57AM]: PASS: installed-tests/js/testGIMarshalling.js 49 GPtrArray can be passed as return with transfer none
 740  [05/25/2017 12:57AM]: PASS: installed-tests/js/testGIMarshalling.js 50 GPtrArray can be passed as return with transfer container
 741  [05/25/2017 12:57AM]: PASS: installed-tests/js/testGIMarshalling.js 51 GPtrArray can be passed as return with transfer full
 742  [05/25/2017 12:57AM]: PASS: installed-tests/js/testGIMarshalling.js 52 GPtrArray can be passed as out with transfer none
 743  [05/25/2017 12:57AM]: PASS: installed-tests/js/testGIMarshalling.js 53 GPtrArray can be passed as out with transfer container
 744  [05/25/2017 12:57AM]: PASS: installed-tests/js/testGIMarshalling.js 54 GPtrArray can be passed as out with transfer full
 745  [05/25/2017 12:57AM]: PASS: installed-tests/js/testGIMarshalling.js 55 GHashTable can be passed in with integer value type
 746  [05/25/2017 12:57AM]: PASS: installed-tests/js/testGIMarshalling.js 56 GHashTable can be passed in with string value type
 747  [05/25/2017 12:57AM]: PASS: installed-tests/js/testGIMarshalling.js 57 GHashTable can be passed in with float value type
 748  [05/25/2017 12:57AM]: PASS: installed-tests/js/testGIMarshalling.js 58 GHashTable can be passed in with double value type
 749  [05/25/2017 12:57AM]: PASS: installed-tests/js/testGIMarshalling.js 59 GHashTable can be passed in with int64 value type
 750  [05/25/2017 12:57AM]: PASS: installed-tests/js/testGIMarshalling.js 60 GHashTable can be passed in with uint64 value type
 751  [05/25/2017 12:57AM]: PASS: installed-tests/js/testGIMarshalling.js 61 GHashTable can be returned with integer value type
 752  [05/25/2017 12:57AM]: PASS: installed-tests/js/testGIMarshalling.js 62 GHashTable can be passed as return with transfer none
 753  [05/25/2017 12:57AM]: PASS: installed-tests/js/testGIMarshalling.js 63 GHashTable can be passed as return with transfer container
 754  [05/25/2017 12:57AM]: PASS: installed-tests/js/testGIMarshalling.js 64 GHashTable can be passed as return with transfer full
 755  [05/25/2017 12:57AM]: PASS: installed-tests/js/testGIMarshalling.js 65 GHashTable can be passed as out with transfer none
 756  [05/25/2017 12:57AM]: PASS: installed-tests/js/testGIMarshalling.js 66 GHashTable can be passed as out with transfer container
 757  [05/25/2017 12:57AM]: PASS: installed-tests/js/testGIMarshalling.js 67 GHashTable can be passed as out with transfer full
 758  [05/25/2017 12:57AM]: PASS: installed-tests/js/testGIMarshalling.js 68 GHashTable can be passed as inout with transfer none
 759  [05/25/2017 12:57AM]: SKIP: installed-tests/js/testGIMarshalling.js 69 GHashTable can be passed as inout with transfer container # SKIP Container transfer for in parameters not supported
 760  [05/25/2017 12:57AM]: SKIP: installed-tests/js/testGIMarshalling.js 70 GHashTable can be passed as inout with transfer full # SKIP https://bugzilla.gnome.org/show_bug.cgi?id=773763
 761  [05/25/2017 12:57AM]: PASS: installed-tests/js/testGIMarshalling.js 71 GValue can be passed into a function and packed
 762  [05/25/2017 12:57AM]: PASS: installed-tests/js/testGIMarshalling.js 72 GValue array can be passed into a function and packed
 763  [05/25/2017 12:57AM]: SKIP: installed-tests/js/testGIMarshalling.js 73 GValue enum can be passed into a function and packed # SKIP GJS doesnt support native enum types
 764  [05/25/2017 12:57AM]: PASS: installed-tests/js/testGIMarshalling.js 74 GValue can be returned and unpacked
 765  [05/25/2017 12:57AM]: PASS: installed-tests/js/testGIMarshalling.js 75 GValue can be passed as an out argument and unpacked
 766  [05/25/2017 12:57AM]: PASS: installed-tests/js/testGIMarshalling.js 76 GValue array can be passed as an out argument and unpacked
 767  [05/25/2017 12:57AM]: PASS: installed-tests/js/testGIMarshalling.js 77 GValue can have its type inferred from primitive values
 768  [05/25/2017 12:57AM]: PASS: installed-tests/js/testGIMarshalling.js 78 GValue type objects can be converted from primitive-like types
 769  [05/25/2017 12:57AM]: PASS: installed-tests/js/testGIMarshalling.js 79 GValue can have its type inferred as a GObject type
 770  [05/25/2017 12:57AM]: PASS: installed-tests/js/testGIMarshalling.js 80 GValue can have its type inferred as a superclass
 771  [05/25/2017 12:57AM]: PASS: installed-tests/js/testGIMarshalling.js 81 GValue can have its type inferred as an interface that it implements
 772  [05/25/2017 12:57AM]: PASS: installed-tests/js/testGIMarshalling.js 82 GValue can have its type inferred as a boxed type
 773  [05/25/2017 12:57AM]: PASS: installed-tests/js/testGIMarshalling.js 83 GValue can have its type inferred as GVariant
 774  [05/25/2017 12:57AM]: PASS: installed-tests/js/testGIMarshalling.js 84 GValue can have its type inferred as a union type
 775  [05/25/2017 12:57AM]: PASS: installed-tests/js/testGIMarshalling.js 85 GValue can have its type inferred as a GParamSpec
 776  [05/25/2017 12:57AM]: SKIP: installed-tests/js/testGIMarshalling.js 86 GValue can have its type inferred as a foreign struct # SKIP Errors out with not a subclass of GObject_Boxed
 777  [05/25/2017 12:57AM]: PASS: installed-tests/js/testGIMarshalling.js 87 GType can be passed into a function
 778  [05/25/2017 12:57AM]: PASS: installed-tests/js/testGIMarshalling.js 88 GType can be returned
 779  [05/25/2017 12:57AM]: PASS: installed-tests/js/testGIMarshalling.js 89 GType can be passed as an out argument
 780  [05/25/2017 12:57AM]: PASS: installed-tests/js/testGIMarshalling.js 90 GType can be passed as an inout argument
 781  [05/25/2017 12:57AM]: PASS: installed-tests/js/testGIMarshalling.js 91 GType can be implicitly converted from a JS type
 782  [05/25/2017 12:57AM]: PASS: installed-tests/js/testGIMarshalling.js 92 Callback marshals a return value
 783  [05/25/2017 12:57AM]: PASS: installed-tests/js/testGIMarshalling.js 93 Callback marshals one out parameter
 784  [05/25/2017 12:57AM]: PASS: installed-tests/js/testGIMarshalling.js 94 Callback marshals multiple out parameters
 785  [05/25/2017 12:57AM]: PASS: installed-tests/js/testGIMarshalling.js 95 Callback marshals a return value and one out parameter
 786  [05/25/2017 12:57AM]: PASS: installed-tests/js/testGIMarshalling.js 96 Callback marshals a return value and multiple out parameters
 787  [05/25/2017 12:57AM]: SKIP: installed-tests/js/testGIMarshalling.js 97 Callback marshals an array out parameter # SKIP Function not added to gobject-introspection test suite yet
 788  [05/25/2017 12:57AM]: PASS: installed-tests/js/testGIMarshalling.js 98 Virtual function marshals a return value
 789  [05/25/2017 12:57AM]: PASS: installed-tests/js/testGIMarshalling.js 99 Virtual function marshals one out parameter
 790  [05/25/2017 12:57AM]: PASS: installed-tests/js/testGIMarshalling.js 100 Virtual function marshals multiple out parameters
 791  [05/25/2017 12:57AM]: PASS: installed-tests/js/testGIMarshalling.js 101 Virtual function marshals a return value and one out parameter
 792  [05/25/2017 12:57AM]: PASS: installed-tests/js/testGIMarshalling.js 102 Virtual function marshals a return value and multiple out parameters
 793  [05/25/2017 12:57AM]: PASS: installed-tests/js/testGIMarshalling.js 103 Virtual function marshals an array out parameter
 794  [05/25/2017 12:57AM]: PASS: installed-tests/js/testGIMarshalling.js 104 Interface can be returned
 795  [05/25/2017 12:57AM]: PASS: installed-tests/js/testGIMarshalling.js 105 GObject properties can handle GValues
 796  [05/25/2017 12:57AM]: PASS: installed-tests/js/testGLib.js 1 GVariant constructor constructs a string variant
 797  [05/25/2017 12:57AM]: PASS: installed-tests/js/testGLib.js 2 GVariant constructor constructs a string variant (backwards compatible API)
 798  [05/25/2017 12:57AM]: PASS: installed-tests/js/testGLib.js 3 GVariant constructor constructs a struct variant
 799  [05/25/2017 12:57AM]: PASS: installed-tests/js/testGLib.js 4 GVariant constructor constructs a maybe variant
 800  [05/25/2017 12:57AM]: ERROR: installed-tests/js/testGObjectClass.js - Bail out! JS_EvaluateScript() failed
 801  [05/25/2017 12:57AM]: PASS: installed-tests/js/testGObjectInterface.js 1 GObject interface class can implement a Lang.Interface
 802  [05/25/2017 12:57AM]: PASS: installed-tests/js/testGObjectInterface.js 2 GObject interface throws when an interface requires a GObject interface but not GObject.Object
 803  [05/25/2017 12:57AM]: PASS: installed-tests/js/testGObjectInterface.js 3 GObject interface can be implemented by a GObject class along with a JS interface
 804  [05/25/2017 12:57AM]: PASS: installed-tests/js/testGObjectInterface.js 4 GObject interface is an instance of the interface classes
 805  [05/25/2017 12:57AM]: PASS: installed-tests/js/testGObjectInterface.js 5 GObject interface cannot be instantiated
 806  [05/25/2017 12:57AM]: PASS: installed-tests/js/testGObjectInterface.js 6 GObject interface reports its type name
 807  [05/25/2017 12:57AM]: PASS: installed-tests/js/testGObjectInterface.js 7 GObject interface can be implemented by a GObject class
 808  [05/25/2017 12:57AM]: PASS: installed-tests/js/testGObjectInterface.js 8 GObject interface is implemented by a GObject class with the correct class object
 809  [05/25/2017 12:57AM]: PASS: installed-tests/js/testGObjectInterface.js 9 GObject interface can be implemented by a class also implementing a Lang.Interface
 810  [05/25/2017 12:57AM]: PASS: installed-tests/js/testGObjectInterface.js 10 GObject interface can have its required function implemented
 811  [05/25/2017 12:57AM]: PASS: installed-tests/js/testGObjectInterface.js 11 GObject interface must have its required function implemented
 812  [05/25/2017 12:57AM]: PASS: installed-tests/js/testGObjectInterface.js 12 GObject interface doesnt have to have its optional function implemented
 813  [05/25/2017 12:57AM]: PASS: installed-tests/js/testGObjectInterface.js 13 GObject interface can have its optional function deferred to by the implementation
 814  [05/25/2017 12:57AM]: PASS: installed-tests/js/testGObjectInterface.js 14 GObject interface can have its function chained up to
 815  [05/25/2017 12:57AM]: PASS: installed-tests/js/testGObjectInterface.js 15 GObject interface can require another interface
 816  [05/25/2017 12:57AM]: PASS: installed-tests/js/testGObjectInterface.js 16 GObject interface can chain up to another interface
 817  [05/25/2017 12:57AM]: PASS: installed-tests/js/testGObjectInterface.js 17 GObject interface defers to the last interfaces optional function
 818  [05/25/2017 12:57AM]: PASS: installed-tests/js/testGObjectInterface.js 18 GObject interface must be implemented by a class that implements all required interfaces
 819  [05/25/2017 12:57AM]: PASS: installed-tests/js/testGObjectInterface.js 19 GObject interface must be implemented by a class that implements required interfaces in correct order
 820  [05/25/2017 12:57AM]: PASS: installed-tests/js/testGObjectInterface.js 20 GObject interface can require an interface from C
 821  [05/25/2017 12:57AM]: PASS: installed-tests/js/testGObjectInterface.js 21 GObject interface can define signals on the implementing class
 822  [05/25/2017 12:57AM]: PASS: installed-tests/js/testGObjectInterface.js 22 GObject interface can define properties on the implementing class
 823  [05/25/2017 12:57AM]: PASS: installed-tests/js/testGObjectInterface.js 23 GObject interface must have its properties overridden
 824  [05/25/2017 12:57AM]: PASS: installed-tests/js/testGObjectInterface.js 24 GObject interface gets the correct type for its metaclass
 825  [05/25/2017 12:57AM]: PASS: installed-tests/js/testGObjectInterface.js 25 GObject interface can be implemented by a class as well as its parent class
 826  [05/25/2017 12:57AM]: PASS: installed-tests/js/testGObjectInterface.js 26 GObject interface can be reimplemented by a subclass of a class that already implements it
 827  [05/25/2017 12:57AM]: PASS: installed-tests/js/testGTypeClass.js 1 Looking up param specs works
 828  [05/25/2017 12:57AM]: PASS: installed-tests/js/testGTypeClass.js 2 Looking up param specs gives the correct name
 829  [05/25/2017 12:57AM]: PASS: installed-tests/js/testGTypeClass.js 3 Looking up param specs gives the default value if present
 830  [05/25/2017 12:57AM]: PASS: installed-tests/js/testGTypeClass.js 4 GType object has a name
 831  [05/25/2017 12:57AM]: PASS: installed-tests/js/testGTypeClass.js 5 GType object has a read-only name
 832  [05/25/2017 12:57AM]: PASS: installed-tests/js/testGTypeClass.js 6 GType object has an undeletable name
 833  [05/25/2017 12:57AM]: PASS: installed-tests/js/testGTypeClass.js 7 GType object has a string representation
 834  [05/25/2017 12:57AM]: PASS: installed-tests/js/testGTypeClass.js 8 GType prototype object has no name
 835  [05/25/2017 12:57AM]: PASS: installed-tests/js/testGTypeClass.js 9 GType prototype object has a string representation
 836  [05/25/2017 12:57AM]: PASS: installed-tests/js/testImporter.js 1 GI importer can import GI modules
 837  [05/25/2017 12:57AM]: PASS: installed-tests/js/testImporter.js 2 GI importer on failure throws an exception when the overrides file cant be imported
 838  [05/25/2017 12:57AM]: PASS: installed-tests/js/testImporter.js 3 GI importer on failure throws an exception when the overrides import throws one
 839  [05/25/2017 12:57AM]: PASS: installed-tests/js/testImporter.js 4 GI importer on failure throws an exception when the overrides _init throws one
 840  [05/25/2017 12:57AM]: PASS: installed-tests/js/testImporter.js 5 GI importer on failure throws an exception when the overrides _init isnt a function
 841  [05/25/2017 12:57AM]: PASS: installed-tests/js/testImporter.js 6 Importer exists
 842  [05/25/2017 12:57AM]: PASS: installed-tests/js/testImporter.js 7 Importer has a toString representation
 843  [05/25/2017 12:57AM]: PASS: installed-tests/js/testImporter.js 8 Importer throws an import error when trying to import a nonexistent module
 844  [05/25/2017 12:57AM]: PASS: installed-tests/js/testImporter.js 9 Importer throws an error when evaluating the module file throws an error
 845  [05/25/2017 12:57AM]: PASS: installed-tests/js/testImporter.js 10 Importer can import a module
 846  [05/25/2017 12:57AM]: PASS: installed-tests/js/testImporter.js 11 Importer makes deleting the import a no-op
 847  [05/25/2017 12:57AM]: PASS: installed-tests/js/testImporter.js 12 Importer gives the same object when importing a second time
 848  [05/25/2017 12:57AM]: PASS: installed-tests/js/testImporter.js 13 Importer can import a submodule
 849  [05/25/2017 12:57AM]: PASS: installed-tests/js/testImporter.js 14 Importer imports modules with a toString representation
 850  [05/25/2017 12:57AM]: PASS: installed-tests/js/testImporter.js 15 Importer does not share the same object for a module on a different path
 851  [05/25/2017 12:57AM]: PASS: installed-tests/js/testImporter.js 16 Importer gives the same object when importing a submodule a second time
 852  [05/25/2017 12:57AM]: PASS: installed-tests/js/testImporter.js 17 Importer has no meta properties on the toplevel importer
 853  [05/25/2017 12:57AM]: PASS: installed-tests/js/testImporter.js 18 Importer sets the names of imported modules
 854  [05/25/2017 12:57AM]: PASS: installed-tests/js/testImporter.js 19 Importer gives a module the importer object as parent module
 855  [05/25/2017 12:57AM]: PASS: installed-tests/js/testImporter.js 20 Importer gives a submodule the module as parent module
 856  [05/25/2017 12:57AM]: PASS: installed-tests/js/testImporter.js 21 Importer does not make a separate copy of a module imported in two places
 857  [05/25/2017 12:57AM]: PASS: installed-tests/js/testImporter.js 22 Importer evaluates an __init__.js file in an imported directory
 858  [05/25/2017 12:57AM]: PASS: installed-tests/js/testImporter.js 23 Importer accesses a class defined in an __init__.js file
 859  [05/25/2017 12:57AM]: PASS: installed-tests/js/testImporter.js 24 Importer can import a file encoded in UTF-8
 860  [05/25/2017 12:57AM]: PASS: installed-tests/js/testImporter.js 25 Importer enumerating modules gets all of them
 861  [05/25/2017 12:57AM]: PASS: installed-tests/js/testImporter.js 26 Importer enumerating modules includes modules that throw on import
 862  [05/25/2017 12:57AM]: PASS: installed-tests/js/testImporter.js 27 Importer enumerating modules does not include meta properties
 863  [05/25/2017 12:57AM]: PASS: installed-tests/js/testInterface.js 1 An interface is an instance of Lang.Interface
 864  [05/25/2017 12:57AM]: PASS: installed-tests/js/testInterface.js 2 An interface cannot be instantiated
 865  [05/25/2017 12:57AM]: PASS: installed-tests/js/testInterface.js 3 An interface can be implemented by a class
 866  [05/25/2017 12:57AM]: PASS: installed-tests/js/testInterface.js 4 An interface can be implemented by a classs superclass
 867  [05/25/2017 12:57AM]: PASS: installed-tests/js/testInterface.js 5 An interface doesnt disturb a classs constructor
 868  [05/25/2017 12:57AM]: PASS: installed-tests/js/testInterface.js 6 An interface can have its required method implemented
 869  [05/25/2017 12:57AM]: PASS: installed-tests/js/testInterface.js 7 An interface must have a name
 870  [05/25/2017 12:57AM]: PASS: installed-tests/js/testInterface.js 8 An interface must have its required methods implemented
 871  [05/25/2017 12:57AM]: PASS: installed-tests/js/testInterface.js 9 An interface does not have to have its optional methods implemented
 872  [05/25/2017 12:57AM]: PASS: installed-tests/js/testInterface.js 10 An interface can have its optional method deferred to by the implementation
 873  [05/25/2017 12:57AM]: PASS: installed-tests/js/testInterface.js 11 An interface can be chained up to by a class
 874  [05/25/2017 12:57AM]: PASS: installed-tests/js/testInterface.js 12 An interface can include arguments when being chained up to by a class
 875  [05/25/2017 12:57AM]: PASS: installed-tests/js/testInterface.js 13 An interface can have its property getter deferred to
 876  [05/25/2017 12:57AM]: PASS: installed-tests/js/testInterface.js 14 An interface can have its property setter deferred to
 877  [05/25/2017 12:57AM]: PASS: installed-tests/js/testInterface.js 15 An interface can have its property getter overridden
 878  [05/25/2017 12:57AM]: PASS: installed-tests/js/testInterface.js 16 An interface can have its property setter overridden
 879  [05/25/2017 12:57AM]: PASS: installed-tests/js/testInterface.js 17 An interface can require another interface
 880  [05/25/2017 12:57AM]: PASS: installed-tests/js/testInterface.js 18 An interface can have empty requires
 881  [05/25/2017 12:57AM]: PASS: installed-tests/js/testInterface.js 19 An interface can chain up to another interface
 882  [05/25/2017 12:57AM]: PASS: installed-tests/js/testInterface.js 20 An interface can be chained up to with a generic
 883  [05/25/2017 12:57AM]: PASS: installed-tests/js/testInterface.js 21 An interface can chain up to another interface with a generic
 884  [05/25/2017 12:57AM]: PASS: installed-tests/js/testInterface.js 22 An interface has its optional function defer to that of the last interface
 885  [05/25/2017 12:57AM]: PASS: installed-tests/js/testInterface.js 23 An interface must have all its required interfaces implemented
 886  [05/25/2017 12:57AM]: PASS: installed-tests/js/testInterface.js 24 An interface must have all its required interfaces implemented in the correct order
 887  [05/25/2017 12:57AM]: PASS: installed-tests/js/testInterface.js 25 An interface can have its implementation on a parent class
 888  [05/25/2017 12:57AM]: PASS: installed-tests/js/testInterface.js 26 An interface can require its implementor to be a subclass of some class
 889  [05/25/2017 12:57AM]: PASS: installed-tests/js/testInterface.js 27 An interface must be implemented by an object which subclasses the required class
 890  [05/25/2017 12:57AM]: PASS: installed-tests/js/testInterface.js 28 An interface can have methods that call others of its methods
 891  [05/25/2017 12:57AM]: PASS: installed-tests/js/testInterface.js 29 An interface is implemented by a subclass of a class that implements it
 892  [05/25/2017 12:57AM]: PASS: installed-tests/js/testInterface.js 30 An interface can be reimplemented by a subclass of a class that implements it
 893  [05/25/2017 12:57AM]: PASS: installed-tests/js/testInterface.js 31 An interface tells what it is with toString()
 894  [05/25/2017 12:57AM]: PASS: installed-tests/js/testLang.js 1 Lang module counts properties with Lang.countProperties()
 895  [05/25/2017 12:57AM]: PASS: installed-tests/js/testLang.js 2 Lang module copies properties from one object to another with Lang.copyProperties()
 896  [05/25/2017 12:57AM]: PASS: installed-tests/js/testLang.js 3 Lang module copies properties without an underscore with Lang.copyPublicProperties()
 897  [05/25/2017 12:57AM]: PASS: installed-tests/js/testLang.js 4 Lang module copies property getters and setters
 898  [05/25/2017 12:57AM]: PASS: installed-tests/js/testLang.js 5 Lang module bind() calls the bound function with the supplied this-object
 899  [05/25/2017 12:57AM]: PASS: installed-tests/js/testLang.js 6 Lang module bind() throws an error when no function supplied
 900  [05/25/2017 12:57AM]: PASS: installed-tests/js/testLang.js 7 Lang module bind() throws an error when this-object undefined
 901  [05/25/2017 12:57AM]: PASS: installed-tests/js/testLang.js 8 Lang module bind() supplies extra arguments to the function
 902  [05/25/2017 12:57AM]: PASS: installed-tests/js/testLang.js 9 Lang module bind() appends the extra arguments to any arguments passed
 903  [05/25/2017 12:57AM]: PASS: installed-tests/js/testLocale.js 1 JS_SetLocaleCallbacks Intl API was compiled into SpiderMonkey
 904  [05/25/2017 12:57AM]: PASS: installed-tests/js/testLocale.js 2 JS_SetLocaleCallbacks toLocaleDateString() works
 905  [05/25/2017 12:57AM]: PASS: installed-tests/js/testLocale.js 3 JS_SetLocaleCallbacks toLocaleLowerCase() works
 906  [05/25/2017 12:57AM]: PASS: installed-tests/js/testLocale.js 4 JS_SetLocaleCallbacks toLocaleLowerCase() works for Unicode
 907  [05/25/2017 12:57AM]: PASS: installed-tests/js/testLocale.js 5 JS_SetLocaleCallbacks toLocaleUpperCase() works
 908  [05/25/2017 12:57AM]: PASS: installed-tests/js/testLocale.js 6 JS_SetLocaleCallbacks toLocaleUpperCase() works for Unicode
 909  [05/25/2017 12:57AM]: PASS: installed-tests/js/testLocale.js 7 JS_SetLocaleCallbacks localeCompare() works
 910  [05/25/2017 12:57AM]: PASS: installed-tests/js/testMainloop.js 1 Mainloop.timeout_add() runs a timeout function
 911  [05/25/2017 12:57AM]: PASS: installed-tests/js/testMainloop.js 2 Mainloop.timeout_add() runs a timeout function until it returns false
 912  [05/25/2017 12:57AM]: PASS: installed-tests/js/testMainloop.js 3 Mainloop.timeout_add() runs a timeout function after an initial timeout
 913  [05/25/2017 12:57AM]: PASS: installed-tests/js/testMainloop.js 4 Mainloop.idle_add() runs an idle function
 914  [05/25/2017 12:57AM]: PASS: installed-tests/js/testMainloop.js 5 Mainloop.idle_add() continues to run idle functions that return true
 915  [05/25/2017 12:57AM]: PASS: installed-tests/js/testMainloop.js 6 Mainloop.idle_add() does not run idle functions if removed
 916  [05/25/2017 12:57AM]: PASS: installed-tests/js/testMainloop.js 7 Mainloop.idle_add() can remove idle functions while they are being invoked
 917  [05/25/2017 12:57AM]: PASS: installed-tests/js/testMainloop.js 8 Mainloop.idle_add() does not leak idle callbacks
 918  [05/25/2017 12:57AM]: PASS: installed-tests/js/testMetaClass.js 1 A metaclass has its constructor called each time a class is created with it
 919  [05/25/2017 12:57AM]: PASS: installed-tests/js/testMetaClass.js 2 A metaclass is an instance of Lang.Class
 920  [05/25/2017 12:57AM]: PASS: installed-tests/js/testMetaClass.js 3 A metaclass produces instances that are instances of itself and Lang.Class
 921  [05/25/2017 12:57AM]: PASS: installed-tests/js/testMetaClass.js 4 A metaclass can dynamically define properties in its constructor
 922  [05/25/2017 12:57AM]: PASS: installed-tests/js/testMetaClass.js 5 A metaclass instance gets all the properties from its class and metaclass
 923  [05/25/2017 12:57AM]: PASS: installed-tests/js/testMetaClass.js 6 A metaclass instance gets dynamically defined properties from metaclass
 924  [05/25/2017 12:57AM]: PASS: installed-tests/js/testMetaClass.js 7 A metaclass can be instantiated with Lang.Class but still get the appropriate metaclass
 925  [05/25/2017 12:57AM]: PASS: installed-tests/js/testNamespace.js 1 GI repository namespace supplies a name
 926  [05/25/2017 12:57AM]: PASS: installed-tests/js/testParamSpec.js 1 GObject.ParamSpec.string has the correct name strings
 927  [05/25/2017 12:57AM]: PASS: installed-tests/js/testParamSpec.js 2 GObject.ParamSpec.string has the correct flags
 928  [05/25/2017 12:57AM]: PASS: installed-tests/js/testParamSpec.js 3 GObject.ParamSpec.string has the correct default value
 929  [05/25/2017 12:57AM]: PASS: installed-tests/js/testParamSpec.js 4 GObject.ParamSpec.int has the correct name strings
 930  [05/25/2017 12:57AM]: PASS: installed-tests/js/testParamSpec.js 5 GObject.ParamSpec.int has the correct flags
 931  [05/25/2017 12:57AM]: PASS: installed-tests/js/testParamSpec.js 6 GObject.ParamSpec.int has the correct default value
 932  [05/25/2017 12:57AM]: PASS: installed-tests/js/testParamSpec.js 7 GObject.ParamSpec.uint has the correct name strings
 933  [05/25/2017 12:57AM]: PASS: installed-tests/js/testParamSpec.js 8 GObject.ParamSpec.uint has the correct flags
 934  [05/25/2017 12:57AM]: PASS: installed-tests/js/testParamSpec.js 9 GObject.ParamSpec.uint has the correct default value
 935  [05/25/2017 12:57AM]: PASS: installed-tests/js/testParamSpec.js 10 GObject.ParamSpec.int64 has the correct name strings
 936  [05/25/2017 12:57AM]: PASS: installed-tests/js/testParamSpec.js 11 GObject.ParamSpec.int64 has the correct flags
 937  [05/25/2017 12:57AM]: PASS: installed-tests/js/testParamSpec.js 12 GObject.ParamSpec.int64 has the correct default value
 938  [05/25/2017 12:57AM]: PASS: installed-tests/js/testParamSpec.js 13 GObject.ParamSpec.uint64 has the correct name strings
 939  [05/25/2017 12:57AM]: PASS: installed-tests/js/testParamSpec.js 14 GObject.ParamSpec.uint64 has the correct flags
 940  [05/25/2017 12:57AM]: PASS: installed-tests/js/testParamSpec.js 15 GObject.ParamSpec.uint64 has the correct default value
 941  [05/25/2017 12:57AM]: PASS: installed-tests/js/testParamSpec.js 16 GObject.ParamSpec.enum has the correct name strings
 942  [05/25/2017 12:57AM]: PASS: installed-tests/js/testParamSpec.js 17 GObject.ParamSpec.enum has the correct flags
 943  [05/25/2017 12:57AM]: PASS: installed-tests/js/testParamSpec.js 18 GObject.ParamSpec.enum has the correct default value
 944  [05/25/2017 12:57AM]: PASS: installed-tests/js/testParamSpec.js 19 GObject.ParamSpec.flags has the correct name strings
 945  [05/25/2017 12:57AM]: PASS: installed-tests/js/testParamSpec.js 20 GObject.ParamSpec.flags has the correct flags
 946  [05/25/2017 12:57AM]: PASS: installed-tests/js/testParamSpec.js 21 GObject.ParamSpec.flags has the correct default value
 947  [05/25/2017 12:57AM]: PASS: installed-tests/js/testParamSpec.js 22 GObject.ParamSpec.object has the correct name strings
 948  [05/25/2017 12:57AM]: PASS: installed-tests/js/testParamSpec.js 23 GObject.ParamSpec.object has the correct flags
 949  [05/25/2017 12:57AM]: PASS: installed-tests/js/testParamSpec.js 24 GObject.ParamSpec.object has the correct default value
 950  [05/25/2017 12:57AM]: PASS: installed-tests/js/testSignals.js 1 Object with signals calls a signal handler when a signal is emitted
 951  [05/25/2017 12:57AM]: PASS: installed-tests/js/testSignals.js 2 Object with signals does not call a signal handler after the signal is disconnected
 952  [05/25/2017 12:57AM]: PASS: installed-tests/js/testSignals.js 3 Object with signals can disconnect a signal handler during signal emission
 953  [05/25/2017 12:57AM]: PASS: installed-tests/js/testSignals.js 4 Object with signals distinguishes multiple signals
 954  [05/25/2017 12:57AM]: ERROR: installed-tests/js/testSignals.js - too few tests run (expected 12, got 4)
 955  [05/25/2017 12:57AM]: ERROR: installed-tests/js/testSignals.js - exited with status 133 (terminated by signal 5?)
 956  [05/25/2017 12:57AM]: PASS: installed-tests/js/testSystem.js 1 System.addressOf() gives different results for different objects
 957  [05/25/2017 12:57AM]: FAIL: installed-tests/js/testSystem.js 2 System.version gives a plausible number
 958  [05/25/2017 12:57AM]: PASS: installed-tests/js/testSystem.js 3 System.refcount() gives the correct number
 959  [05/25/2017 12:57AM]: PASS: installed-tests/js/testSystem.js 4 System.gc() does not crash the application
 960  [05/25/2017 12:57AM]: ERROR: installed-tests/js/testSystem.js - exited with status 1
 961  [05/25/2017 12:57AM]: PASS: installed-tests/js/testTweener.js 1 Tweener runs a simple tween
 962  [05/25/2017 12:57AM]: PASS: installed-tests/js/testTweener.js 2 Tweener calls callbacks during the tween
 963  [05/25/2017 12:57AM]: PASS: installed-tests/js/testTweener.js 3 Tweener can pause tweens
 964  [05/25/2017 12:57AM]: PASS: installed-tests/js/testTweener.js 4 Tweener can remove tweens
 965  [05/25/2017 12:57AM]: PASS: installed-tests/js/testTweener.js 5 Tweener overrides a tween with another one acting on the same object and property at the same time
 966  [05/25/2017 12:57AM]: PASS: installed-tests/js/testTweener.js 6 Tweener does not override a tween with another one acting not at the same time
 967  [05/25/2017 12:57AM]: PASS: installed-tests/js/testTweener.js 7 Tweener can pause and resume all tweens
 968  [05/25/2017 12:57AM]: PASS: installed-tests/js/testTweener.js 8 Tweener can remove all tweens
 969  [05/25/2017 12:57AM]: PASS: installed-tests/js/testTweener.js 9 Tweener runs a tween with a time of 0 immediately
 970  [05/25/2017 12:57AM]: PASS: installed-tests/js/testTweener.js 10 Tweener can call a callback a certain number of times
 971  [05/25/2017 12:57AM]: PASS: installed-tests/js/testTweener.js 11 Tweener can count the number of tweens on an object
 972  [05/25/2017 12:57AM]: PASS: installed-tests/js/testTweener.js 12 Tweener can register special properties
 973  [05/25/2017 12:57AM]: PASS: installed-tests/js/testTweener.js 13 Tweener can register special modifiers for properties
 974  [05/25/2017 12:57AM]: PASS: installed-tests/js/testTweener.js 14 Tweener can split properties into more than one special property
 975  [05/25/2017 12:57AM]: PASS: installed-tests/js/testTweener.js 15 Tweener calls an overwrite callback when a tween is replaced
 976  [05/25/2017 12:57AM]: PASS: installed-tests/js/testTweener.js 16 Tweener can still overwrite a tween after it has started
 977  [05/25/2017 12:57AM]: PASS: installed-tests/js/testGDBus.js 1 Exported DBus object can call a remote method
 978  [05/25/2017 12:57AM]: ERROR: installed-tests/js/testGDBus.js - too few tests run (expected 18, got 1)
 979  [05/25/2017 12:57AM]: ERROR: installed-tests/js/testGDBus.js - exited with status 133 (terminated by signal 5?)
 980  [05/25/2017 12:57AM]: ERROR: installed-tests/js/testCairo.js - Bail out! JS_EvaluateScript() failed
 981  [05/25/2017 12:57AM]: ============================================================================
 982  [05/25/2017 12:57AM]: Testsuite summary for cjs 3.4.1
 983  [05/25/2017 12:57AM]: Please report to https://github.com/linuxmint/cjs/issues/new
 984  [05/25/2017 12:57AM]: make[3]: *** [Makefile:2814: test-suite.log] Error 1
 985  [05/25/2017 12:57AM]: make[2]: *** [Makefile:2922: check-TESTS] Error 2
 986  [05/25/2017 12:57AM]: make[1]: *** [Makefile:3139: check-am] Error 2
 987  [05/25/2017 12:57AM]: make: *** [Makefile:3141: check] Error 2
 988  [05/25/2017 12:57AM]: ==> Entering fakeroot environment...
 989  [05/25/2017 12:57AM]:  /usr/bin/mkdir -p /pkg/pkg/cjs/usr/lib
 990  [05/25/2017 12:57AM]:  /bin/sh ./libtool   --mode=install /usr/bin/install -c   libcjs.la /pkg/pkg/cjs/usr/lib
 991  [05/25/2017 12:57AM]: libtool: install: /usr/bin/install -c .libs/libcjs.so.0.0.0 /pkg/pkg/cjs/usr/lib/libcjs.so.0.0.0
 992  [05/25/2017 12:57AM]: libtool: install: (cd /pkg/pkg/cjs/usr/lib && { ln -s -f libcjs.so.0.0.0 libcjs.so.0 || { rm -f libcjs.so.0 && ln -s libcjs.so.0.0.0 libcjs.so.0; }; })
 993  [05/25/2017 12:57AM]: libtool: install: (cd /pkg/pkg/cjs/usr/lib && { ln -s -f libcjs.so.0.0.0 libcjs.so || { rm -f libcjs.so && ln -s libcjs.so.0.0.0 libcjs.so; }; })
 994  [05/25/2017 12:57AM]: libtool: install: /usr/bin/install -c .libs/libcjs.lai /pkg/pkg/cjs/usr/lib/libcjs.la
 995  [05/25/2017 12:57AM]: libtool: warning: remember to run libtool --finish /usr/lib
 996  [05/25/2017 12:57AM]:  /usr/bin/mkdir -p /pkg/pkg/cjs/usr/bin
 997  [05/25/2017 12:57AM]:   /bin/sh ./libtool   --mode=install /usr/bin/install -c cjs-console /pkg/pkg/cjs/usr/bin
 998  [05/25/2017 12:57AM]: libtool: warning: libcjs.la has not been installed in /usr/lib
 999  [05/25/2017 12:57AM]: libtool: install: /usr/bin/install -c .libs/cjs-console /pkg/pkg/cjs/usr/bin/cjs-console
1000  [05/25/2017 12:57AM]: (cd /pkg/pkg/cjs/usr/bin && ln -s -f cjs-console cjs)
1001  [05/25/2017 12:57AM]:  /usr/bin/mkdir -p /pkg/pkg/cjs/usr/include/cjs-1.0
1002  [05/25/2017 12:57AM]:  /usr/bin/mkdir -p /pkg/pkg/cjs/usr/include/cjs-1.0/cjs
1003  [05/25/2017 12:57AM]:  /usr/bin/install -c -m 644  cjs/context.h cjs/coverage.h cjs/gjs.h cjs/macros.h /pkg/pkg/cjs/usr/include/cjs-1.0/cjs
1004  [05/25/2017 12:57AM]:  /usr/bin/mkdir -p /pkg/pkg/cjs/usr/include/cjs-1.0/util
1005  [05/25/2017 12:57AM]:  /usr/bin/install -c -m 644  util/error.h /pkg/pkg/cjs/usr/include/cjs-1.0/util
1006  [05/25/2017 12:57AM]:  /usr/bin/mkdir -p /pkg/pkg/cjs/usr/lib/pkgconfig
1007  [05/25/2017 12:57AM]:  /usr/bin/install -c -m 644 cjs-1.0.pc /pkg/pkg/cjs/usr/lib/pkgconfig
1008  [05/25/2017 12:57AM]:  /usr/bin/mkdir -p /pkg/pkg/cjs/usr/lib/cjs/girepository-1.0
1009  [05/25/2017 12:57AM]:  /usr/bin/install -c -m 644 CjsPrivate-1.0.typelib /pkg/pkg/cjs/usr/lib/cjs/girepository-1.0
1010  [05/25/2017 12:57AM]:   -> Removing libtool files...
1011  [05/25/2017 12:57AM]:   -> Removing static library files...
1012  [05/25/2017 12:57AM]:   -> Stripping unneeded symbols from binaries and libraries...
1013  [05/25/2017 12:57AM]:   -> Compressing man and info pages...
1014  [05/25/2017 12:57AM]: ==> Checking for packaging issue...
1015  [05/25/2017 12:57AM]: ==> Creating package cjs...
1016  [05/25/2017 12:57AM]:   -> Generating .PKGINFO file...
1017  [05/25/2017 12:57AM]:   -> Generating .BUILDINFO file...
1018  [05/25/2017 12:57AM]:   -> Generating .MTREE file...
1019  [05/25/2017 12:57AM]: ==> Leaving fakeroot environment.
1020  [05/25/2017 12:57AM]: ==> Finished making: cjs 3.4.1-1 (Thu May 25 05:57:31 UTC 2017)
1021  [05/25/2017 12:57AM]: [\^/\^/^\^/^\^/\^/\^/^\^/^\^/]  Getting packages that would be generated by PKGBUILD...  [\^/\^/^\^/^\^/\^/\^/^\^/^\^/]
1022  [05/25/2017 12:57AM]: [\^/\^/^\^/^\^/\^/\^/^\^/^\^/]  cjs-3.4.1-1-i686
1023  [05/25/2017 12:57AM]: cjs-3.4.1-1-x86_64  [\^/\^/^\^/^\^/\^/\^/^\^/^\^/]
1024  [05/25/2017 12:57AM]: [\^/\^/^\^/^\^/\^/\^/^\^/^\^/]  CREATING 32-BIT BUILD ENVIRONMENT  [\^/\^/^\^/^\^/\^/\^/^\^/^\^/]
1025  [05/25/2017 12:57AM]: ==> Creating install root at /32build/root
1026  [05/25/2017 12:57AM]: ==> Installing packages to /32build/root
1027  [05/25/2017 12:57AM]: :: There are 25 members in group base-devel:
1028  [05/25/2017 12:57AM]:    1) autoconf  2) automake  3) binutils  4) bison  5) fakeroot  6) file  7) findutils  8) flex  9) gawk  10) gcc  11) gettext  12) grep  13) groff  14) gzip  15) libtool  16) m4  17) make  18) pacman  19) patch  20) pkg-config  21) sed  22) sudo  23) texinfo  24) util-linux  25) which
1029  [05/25/2017 12:57AM]: Enter a selection (default=all): warning: skipping target: sudo
1030  [05/25/2017 12:57AM]: Packages (104) acl-2.2.52-3  archlinux-keyring-20170320-1  attr-2.4.47-2  bash-4.4.012-2  bzip2-1.0.6-6  ca-certificates-20170307-1  ca-certificates-cacert-20140824-4  ca-certificates-mozilla-3.30.2-1  ca-certificates-utils-20170307-1  coreutils-8.27-1  cracklib-2.9.6-1  curl-7.54.0-3  db-5.3.28-3  diffutils-3.5-1  e2fsprogs-1.43.4-1  expat-2.2.0-2  filesystem-2017.03-2  gc-7.6.0-1  gcc-libs-6.3.1-2  gdbm-1.13-1  glib2-2.52.2+1+gb8bd46bc8-1  glibc-2.25-1  gmp-6.1.2-1  gnupg-2.1.21-1  gnutls-3.5.12-1  gpgme-1.9.0-3  guile-2.2.2-1  iana-etc-20170512-1  icu-59.1-1  keyutils-1.5.10-1  krb5-1.15-1  less-487-1  libarchive-3.3.1-5  libassuan-2.4.3-1  libatomic_ops-7.4.6-1  libcap-2.25-1  libffi-3.2.1-2  libgcrypt-1.7.6-1  libgpg-error-1.27-1  libidn-1.33-1  libksba-1.3.4-2  libldap-2.4.44-4  libmpc-1.0.3-2  libnghttp2-1.22.0-1  libpsl-0.17.0-2  libsasl-2.1.26-11  libsecret-0.18.5+14+g9980655-1  libssh2-1.8.0-2  libsystemd-232-8  libtasn1-4.10-1  libtirpc-1.0.1-3  libunistring-0.9.7-1  libutil-linux-2.29.2-2  linux-api-headers-4.10.1-1  lz4-1:1.7.5-1  mpfr-3.1.5.p2-1  ncurses-6.0+20170429-1  nettle-3.3-1  npth-1.4-1  openssl-1.1.0.e-1  p11-kit-0.23.5-1  pacman-mirrorlist-20170427-1  pam-1.3.0-1  pambase-20130928-1  pcre-8.40-1  perl-5.24.1-1  perl-error-0.17024-1  pinentry-1.0.0-1  python-3.6.1-1  readline-7.0.003-1  shadow-4.4-3  sqlite-3.18.0-1  tar-1.29-2  tzdata-2017b-1  xz-5.2.3-1  zlib-1:1.2.11-1  autoconf-2.69-4  automake-1.15-2  binutils-2.28.0-2  bison-3.0.4-2  fakeroot-1.21-2  file-5.30-1  findutils-4.6.0-2  flex-2.6.4-1  gawk-4.1.4-2  gcc-6.3.1-2  gettext-0.19.8.1-2  git-2.13.0-1  grep-3.0-1  groff-1.22.3-7  gzip-1.8-2  libtool-2.4.6-7  m4-1.4.18-1  make-4.2.1-2  pacman-5.0.1-5  patch-2.7.5-1  pkg-config-0.29.2-1  reflector-2017-2  sed-4.4-1  sudo-1.8.20-1  texinfo-6.3-1  util-linux-2.29.2-2  wget-1.19.1-2  which-2.21-2
1031  [05/25/2017 12:57AM]: Total Installed Size:  700.40 MiB
1032  [05/25/2017 12:58AM]: installing linux-api-headers...
1033  [05/25/2017 12:58AM]: Optional dependencies for bash
1034  [05/25/2017 12:58AM]:     bash-completion: for tab completion
1035  [05/25/2017 12:58AM]: Optional dependencies for openssl
1036  [05/25/2017 12:58AM]:     ca-certificates [pending]
1037  [05/25/2017 12:58AM]: Optional dependencies for util-linux
1038  [05/25/2017 12:58AM]:     python: python bindings to libmount [pending]
1039  [05/25/2017 12:58AM]: Optional dependencies for glib2
1040  [05/25/2017 12:58AM]:     python: for gdbus-codegen and gtester-report [pending]
1041  [05/25/2017 12:58AM]:     libelf: gresource inspection tool
1042  [05/25/2017 12:58AM]: Optional dependencies for gettext
1043  [05/25/2017 12:58AM]:     git: for autopoint infrastructure updates [pending]
1044  [05/25/2017 12:58AM]: Optional dependencies for groff
1045  [05/25/2017 12:58AM]:     netpbm: for use together with man -H command interaction in browsers
1046  [05/25/2017 12:58AM]:     psutils: for use together with man -H command interaction in browsers
1047  [05/25/2017 12:58AM]: installing ca-certificates-utils...
1048  [05/25/2017 12:58AM]: installing ca-certificates-mozilla...
1049  [05/25/2017 12:58AM]: installing ca-certificates-cacert...
1050  [05/25/2017 12:58AM]: installing ca-certificates...
1051  [05/25/2017 12:58AM]: Optional dependencies for libsecret
1052  [05/25/2017 12:58AM]:     gnome-keyring: key storage service (or use any other service implementing org.freedesktop.secrets)
1053  [05/25/2017 12:58AM]: Optional dependencies for pinentry
1054  [05/25/2017 12:58AM]: Optional dependencies for gnutls
1055  [05/25/2017 12:58AM]:     guile: for use with Guile bindings [installed]
1056  [05/25/2017 12:58AM]: Optional dependencies for gnupg
1057  [05/25/2017 12:58AM]:     libldap: gpg2keys_ldap [installed]
1058  [05/25/2017 12:58AM]:     libusb-compat: scdaemon
1059  [05/25/2017 12:58AM]: installing pacman-mirrorlist...
1060  [05/25/2017 12:58AM]: installing archlinux-keyring...
1061  [05/25/2017 12:58AM]: Optional dependencies for patch
1062  [05/25/2017 12:58AM]:     ed: for patch -e functionality
1063  [05/25/2017 12:58AM]: Optional dependencies for wget
1064  [05/25/2017 12:58AM]:     ca-certificates: HTTPS downloads [installed]
1065  [05/25/2017 12:58AM]: Optional dependencies for git
1066  [05/25/2017 12:58AM]:     perl-term-readkey: git svn
1067  [05/25/2017 12:58AM]:     perl-mime-tools: git send-email
1068  [05/25/2017 12:58AM]:     perl-net-smtp-ssl: git send-email TLS support
1069  [05/25/2017 12:58AM]:     perl-authen-sasl: git send-email TLS support
1070  [05/25/2017 12:58AM]:     python2: various helper scripts
1071  [05/25/2017 12:58AM]:     gnome-keyring: GNOME keyring credential helper
1072  [05/25/2017 12:58AM]: Optional dependencies for python
1073  [05/25/2017 12:58AM]:     mpdecimal: for decimal
1074  [05/25/2017 12:58AM]:     xz: for lzma [installed]
1075  [05/25/2017 12:58AM]: Optional dependencies for reflector
1076  [05/25/2017 12:58AM]:     rsync: rate rsync mirrors
1077  [05/25/2017 12:58AM]: (2/2) Rebuilding certificate stores...
1078  [05/25/2017 12:58AM]: Initializing machine ID from random generator.
1079  [05/25/2017 12:58AM]: Failed to chown() cgroup /sys/fs/cgroup/systemd/docker/394dfbcbc2194036df87a98d239cd50ef51ad01ef9265d020d7e921ab7634212: No such file or directory
1080  [05/25/2017 12:58AM]: Attempted to remove disk file system, and we cant allow that.
1081  [05/25/2017 12:58AM]: [\^/\^/^\^/^\^/\^/\^/^\^/^\^/]  UPDATING 32BIT SOURCE CHECKSUMS  [\^/\^/^\^/^\^/\^/\^/^\^/^\^/]
1082  [05/25/2017 12:58AM]: 
1083   0     0    0     0    0     0      0      0 --:--:-- --:--:-- --:--:--     0
1084 100   120    0   120    0     0    993      0 --:--:-- --:--:-- --:--:--  1000
1085  [05/25/2017 12:58AM]: 
1086 100  415k  100  415k    0     0  1385k      0 --:--:-- --:--:-- --:--:-- 1385k
1087  [05/25/2017 12:58AM]: ==> Making package: cjs 3.4.1-1 (Thu May 25 05:58:44 UTC 2017)
1088  [05/25/2017 12:58AM]: Packages (45) damageproto-1.2.1-3  dbus-1.10.18-1  fixesproto-5.0+9+g4292ec1-1  fontconfig-2.12.1-4  freetype2-2.8-2  graphite-1:1.3.10-1  harfbuzz-1.4.6-1  kbproto-1.0.7-1  libdrm-2.4.80-1  libedit-20170329_3.1-1  libelf-0.168-1  libglvnd-0.2.999+g4ba53457-2  libomxil-bellagio-0.9.3-1  libpciaccess-0.13.5-1  libpng-1.6.29-1  libtxc_dxtn-1.0.1-6  libunwind-1.2-1  libx11-1.6.5-1  libxau-1.0.8-2  libxcb-1.12-1  libxdamage-1.1.4-2  libxdmcp-1.1.2-1  libxext-1.3.3-1  libxfixes-5.0.3-1  libxml2-2.9.4+16+g07418011-2  libxrender-0.9.10-1  libxshmfence-1.2-1  libxxf86vm-1.1.4-1  llvm-libs-4.0.0-2  lm_sensors-3.4.0-2  lzo-2.10-1  mesa-17.1.0-1  nspr-4.14-1  pixman-0.34.0-1  renderproto-0.11.1-3  sysfsutils-2.1.0-9  wayland-1.13.0-1  xcb-proto-1.12-3  xextproto-7.3.0-1  xf86vidmodeproto-2.3.1-3  xproto-7.0.31-1  cairo-1.14.8-1  dbus-glib-0.108-1  gobject-introspection-runtime-1.52.1-1  js38-38.8.0-3
1089  [05/25/2017 12:58AM]: Total Download Size:    42.13 MiB
1090  [05/25/2017 12:58AM]: Total Installed Size:  177.65 MiB
1091  [05/25/2017 12:58AM]: downloading libelf-0.168-1-i686.pkg.tar.xz...
1092  [05/25/2017 12:58AM]: downloading libedit-20170329_3.1-1-i686.pkg.tar.xz...
1093  [05/25/2017 12:58AM]: downloading sysfsutils-2.1.0-9-i686.pkg.tar.xz...
1094  [05/25/2017 12:58AM]: downloading lzo-2.10-1-i686.pkg.tar.xz...
1095  [05/25/2017 12:58AM]: downloading nspr-4.14-1-i686.pkg.tar.xz...
1096  [05/25/2017 12:58AM]: downloading libpng-1.6.29-1-i686.pkg.tar.xz...
1097  [05/25/2017 12:58AM]: downloading xcb-proto-1.12-3-any.pkg.tar.xz...
1098  [05/25/2017 12:58AM]: downloading xproto-7.0.31-1-any.pkg.tar.xz...
1099  [05/25/2017 12:58AM]: downloading libxdmcp-1.1.2-1-i686.pkg.tar.xz...
1100  [05/25/2017 12:58AM]: downloading libxau-1.0.8-2-i686.pkg.tar.xz...
1101  [05/25/2017 12:58AM]: downloading libxcb-1.12-1-i686.pkg.tar.xz...
1102  [05/25/2017 12:58AM]: downloading renderproto-0.11.1-3-any.pkg.tar.xz...
1103  [05/25/2017 12:58AM]: downloading libxrender-0.9.10-1-i686.pkg.tar.xz...
1104  [05/25/2017 12:58AM]: downloading xextproto-7.3.0-1-any.pkg.tar.xz...
1105  [05/25/2017 12:58AM]: downloading graphite-1:1.3.10-1-i686.pkg.tar.xz...
1106  [05/25/2017 12:58AM]: downloading harfbuzz-1.4.6-1-i686.pkg.tar.xz...
1107  [05/25/2017 12:58AM]: downloading freetype2-2.8-2-i686.pkg.tar.xz...
1108  [05/25/2017 12:58AM]: downloading fontconfig-2.12.1-4-i686.pkg.tar.xz...
1109  [05/25/2017 12:58AM]: downloading libpciaccess-0.13.5-1-i686.pkg.tar.xz...
1110  [05/25/2017 12:58AM]: downloading libxml2-2.9.4+16+g07418011-2-i686.pkg.tar.xz...
1111  [05/25/2017 12:58AM]: downloading wayland-1.13.0-1-i686.pkg.tar.xz...
1112  [05/25/2017 12:58AM]: downloading xf86vidmodeproto-2.3.1-3-any.pkg.tar.xz...
1113  [05/25/2017 12:58AM]: downloading libxxf86vm-1.1.4-1-i686.pkg.tar.xz...
1114  [05/25/2017 12:58AM]: downloading fixesproto-5.0+9+g4292ec1-1-any.pkg.tar.xz...
1115  [05/25/2017 12:58AM]: downloading libxfixes-5.0.3-1-i686.pkg.tar.xz...
1116  [05/25/2017 12:58AM]: downloading damageproto-1.2.1-3-any.pkg.tar.xz...
1117  [05/25/2017 12:58AM]: downloading libxdamage-1.1.4-2-i686.pkg.tar.xz...
1118  [05/25/2017 12:58AM]: downloading libxshmfence-1.2-1-i686.pkg.tar.xz...
1119  [05/25/2017 12:58AM]: downloading libomxil-bellagio-0.9.3-1-i686.pkg.tar.xz...
1120  [05/25/2017 12:58AM]: downloading libtxc_dxtn-1.0.1-6-i686.pkg.tar.xz...
1121  [05/25/2017 12:58AM]: downloading llvm-libs-4.0.0-2-i686.pkg.tar.xz...
1122  [05/25/2017 12:58AM]: downloading lm_sensors-3.4.0-2-i686.pkg.tar.xz...
1123  [05/25/2017 12:59AM]: downloading libglvnd-0.2.999+g4ba53457-2-i686.pkg.tar.xz...
1124  [05/25/2017 12:59AM]: downloading gobject-introspection-runtime-1.52.1-1-i686.pkg.tar.xz...
1125  [05/25/2017 12:59AM]: downloading dbus-glib-0.108-1-i686.pkg.tar.xz...
1126  [05/25/2017 12:59AM]: Total Download Size:    19.23 MiB
1127  [05/25/2017 12:59AM]: Total Installed Size:  143.12 MiB
1128  [05/25/2017 12:59AM]: downloading glib2-docs-2.52.2+1+gb8bd46bc8-1-i686.pkg.tar.xz...
1129  [05/25/2017 12:59AM]: downloading perl-xml-parser-2.44-3-i686.pkg.tar.xz...
1130  [05/25/2017 12:59AM]: downloading intltool-0.51.0-2-any.pkg.tar.xz...
1131  [05/25/2017 12:59AM]: downloading yelp-xsl-3.20.1-2-any.pkg.tar.xz...
1132  [05/25/2017 12:59AM]: downloading libxslt-1.1.29+42+gac341cbd-1-i686.pkg.tar.xz...
1133  [05/25/2017 12:59AM]: downloading python2-2.7.13-2-i686.pkg.tar.xz...
1134  [05/25/2017 12:59AM]: downloading itstool-2.0.2+5+g676f3f7-2-any.pkg.tar.xz...
1135  [05/25/2017 12:59AM]: downloading yelp-tools-3.18.0+1+g193c2bd-1-any.pkg.tar.xz...
1136  [05/25/2017 12:59AM]: downloading docbook-xml-4.5-6-any.pkg.tar.xz...
1137  [05/25/2017 12:59AM]: downloading docbook-xsl-1.79.1-2-any.pkg.tar.xz...
1138  [05/25/2017 12:59AM]: downloading boost-libs-1.63.0-2-i686.pkg.tar.xz...
1139  [05/25/2017 12:59AM]: downloading source-highlight-3.1.8-11-i686.pkg.tar.xz...
1140  [05/25/2017 12:59AM]: downloading gtk-doc-1.25+33+g567353f-1-any.pkg.tar.xz...
1141  [05/25/2017 12:59AM]: downloading gnome-common-3.18.0-2-any.pkg.tar.xz...
1142  [05/25/2017 12:59AM]: downloading python-markupsafe-1.0-1-i686.pkg.tar.xz...
1143  [05/25/2017 12:59AM]: downloading python-beaker-1.8.1-2-any.pkg.tar.xz...
1144  [05/25/2017 12:59AM]: downloading python-pyparsing-2.2.0-1-any.pkg.tar.xz...
1145  [05/25/2017 12:59AM]: downloading python-six-1.10.0-3-any.pkg.tar.xz...
1146  [05/25/2017 12:59AM]: downloading python-packaging-16.8-2-any.pkg.tar.xz...
1147  [05/25/2017 12:59AM]: downloading python-appdirs-1.4.3-1-any.pkg.tar.xz...
1148  [05/25/2017 12:59AM]: downloading python-setuptools-1:35.0.2-1-any.pkg.tar.xz...
1149  [05/25/2017 12:59AM]: downloading python-mako-1.0.6-2-any.pkg.tar.xz...
1150  [05/25/2017 12:59AM]: downloading gobject-introspection-1.52.1-1-i686.pkg.tar.xz...
1151  [05/25/2017 12:59AM]: downloading autoconf-archive-1:2017.03.21-1-any.pkg.tar.xz...
1152  [05/25/2017 12:59AM]: bsdtar: Failed to set default locale
1153  [05/25/2017 12:59AM]: perl: warning: Setting locale failed.
1154  [05/25/2017 12:59AM]: perl: warning: Please check that your locale settings:
1155  [05/25/2017 12:59AM]:     are supported and installed on your system.
1156  [05/25/2017 12:59AM]: perl: warning: Falling back to the standard locale (C).
1157  [05/25/2017 01:00AM]: checking whether the gcc linker (/usr/bin/ld -m elf_i386) supports shared libraries... yes
1158  [05/25/2017 01:00AM]: checking for ld used by g++... /usr/bin/ld -m elf_i386
1159  [05/25/2017 01:00AM]: checking if the linker (/usr/bin/ld -m elf_i386) is GNU ld... yes
1160  [05/25/2017 01:01AM]:                  from /usr/lib/gcc/i686-pc-linux-gnu/6.3.1/include-fixed/limits.h:168,
1161  [05/25/2017 01:01AM]:                  from /usr/lib/gcc/i686-pc-linux-gnu/6.3.1/include-fixed/syslimits.h:7,
1162  [05/25/2017 01:01AM]:                  from /usr/lib/gcc/i686-pc-linux-gnu/6.3.1/include-fixed/limits.h:34,
1163  [05/25/2017 01:01AM]:                  from /tmp/g-ir-cpp-k5j0raic.c:4:
1164  [05/25/2017 01:01AM]: ./libtool: line 4471: warning: setlocale: LC_CTYPE: cannot change locale (en_US.UTF-8): No such file or directory
1165  [05/25/2017 01:01AM]: ./libtool: line 4471: warning: setlocale: LC_COLLATE: cannot change locale (en_US.UTF-8): No such file or directory
1166  [05/25/2017 01:01AM]: ./libtool: line 4471: warning: setlocale: LC_MESSAGES: cannot change locale (en_US.UTF-8): No such file or directory
1167  [05/25/2017 01:01AM]:                  from /tmp/g-ir-cpp-kkzitvqr.c:4:
1168  [05/25/2017 01:01AM]:                  from /tmp/g-ir-cpp-duyug8zp.c:4:
1169  [05/25/2017 01:01AM]:                  from /tmp/g-ir-cpp-4oj43ezd.c:4:
1170  [05/25/2017 01:02AM]: ==> Finished making: cjs 3.4.1-1 (Thu May 25 06:02:01 UTC 2017)