Build Record

Build Number: 6653

Transaction: 2959
Package: nodejs-lts
Version: 6.11.0-1
Start: 06/09/2017 11:11PM
Finish: 06/09/2017 11:22PM
Result: failed

Build Log

  1 [06/09/2017 11:11PM]: [\^/\^/^\^/^\^/\^/\^/^\^/^\^/]  SETTING UP ENVIRONMENT  [\^/\^/^\^/^\^/\^/\^/^\^/^\^/]
  2  [06/09/2017 11:11PM]: [\^/\^/^\^/^\^/\^/\^/^\^/^\^/]  ADDING UPSTREAM PGP KEYS TO KEYRING  [\^/\^/^\^/^\^/\^/\^/^\^/^\^/]
  3  [06/09/2017 11:11PM]: gpg: WARNING: unsafe ownership on homedir /tmp/antbs/.gnupg
  4  [06/09/2017 11:11PM]: gpg: keybox /tmp/antbs/.gnupg/pubring.kbx created
  5  [06/09/2017 11:11PM]: gpg: /tmp/antbs/.gnupg/trustdb.gpg: trustdb created
  6  [06/09/2017 11:11PM]: gpg: key 23EFEFE93C4CFFFE: public key Italo A. Casas <[email protected]> imported
  7  [06/09/2017 11:11PM]: gpg: key B63B535A4C206CA9: public key Evan Lucas <[email protected]> imported
  8  [06/09/2017 11:11PM]: gpg: key E73BC641CC11F4C8: public key Myles Borins <[email protected]> imported
  9  [06/09/2017 11:11PM]: gpg: key C273792F7D83545D: public key Rod Vagg <[email protected]> imported
 10  [06/09/2017 11:11PM]: gpg: key C97EC7A07EDE3FC1: public key keybase.io/jasnell <[email protected]> imported
 11  [06/09/2017 11:11PM]: gpg: key 09FE44734EB7990E: public key Jeremiah Senkpiel <[email protected]> imported
 12  [06/09/2017 11:11PM]: gpg: key 7434390BDBE9B9C5: public key Colin Ihrig <[email protected]> imported
 13  [06/09/2017 11:11PM]: gpg: key 61B7B526D98F0353: public key Mozilla Software Releases <[email protected]> imported
 14  [06/09/2017 11:11PM]: gpg: key 61B7B526D98F0353: Mozilla Software Releases <[email protected]> not changed
 15  [06/09/2017 11:11PM]: gpg: no ultimately trusted keys found
 16  [06/09/2017 11:11PM]: gpg: Total number processed: 9
 17  [06/09/2017 11:11PM]: gpg:               imported: 8
 18  [06/09/2017 11:11PM]: gpg:              unchanged: 1
 19  [06/09/2017 11:11PM]: [\^/\^/^\^/^\^/\^/\^/^\^/^\^/]  SYNCING REPO DATABASES  [\^/\^/^\^/^\^/\^/\^/^\^/^\^/]
 20  [06/09/2017 11:11PM]: :: Synchronizing package databases...
 21  [06/09/2017 11:11PM]: downloading antergos-staging.db...
 22  [06/09/2017 11:11PM]: downloading antergos.db...
 23  [06/09/2017 11:11PM]: downloading core.db...
 24  [06/09/2017 11:11PM]: downloading community.db...
 25  [06/09/2017 11:11PM]: :: Starting full system upgrade...
 26  [06/09/2017 11:11PM]: looking for conflicting packages...
 27  [06/09/2017 11:11PM]: Packages (4) gnupg-2.1.21-2  gnutls-3.5.13-1  npth-1.5-1  sqlite-3.19.3-1
 28  [06/09/2017 11:11PM]: Total Installed Size:  22.04 MiB
 29  [06/09/2017 11:11PM]: Net Upgrade Size:      -0.32 MiB
 30  [06/09/2017 11:11PM]: :: Proceed with installation? [Y/n]
 31  [06/09/2017 11:11PM]: checking package integrity...
 32  [06/09/2017 11:11PM]: checking for file conflicts...
 33  [06/09/2017 11:11PM]: :: Processing package changes...
 34  [06/09/2017 11:11PM]: Created symlink /etc/systemd/user/sockets.target.wants/dirmngr.socket → /usr/lib/systemd/user/dirmngr.socket.
 35  [06/09/2017 11:11PM]: Created symlink /etc/systemd/user/sockets.target.wants/gpg-agent.socket → /usr/lib/systemd/user/gpg-agent.socket.
 36  [06/09/2017 11:11PM]: Created symlink /etc/systemd/user/sockets.target.wants/gpg-agent-browser.socket → /usr/lib/systemd/user/gpg-agent-browser.socket.
 37  [06/09/2017 11:11PM]: Created symlink /etc/systemd/user/sockets.target.wants/gpg-agent-extra.socket → /usr/lib/systemd/user/gpg-agent-extra.socket.
 38  [06/09/2017 11:11PM]: Created symlink /etc/systemd/user/sockets.target.wants/gpg-agent-ssh.socket → /usr/lib/systemd/user/gpg-agent-ssh.socket.
 39  [06/09/2017 11:11PM]: :: Running post-transaction hooks...
 40  [06/09/2017 11:11PM]: (1/2) Arming ConditionNeedsUpdate...
 41  [06/09/2017 11:11PM]: (2/2) Updating the info directory file...
 42  [06/09/2017 11:11PM]: [\^/\^/^\^/^\^/\^/\^/^\^/^\^/]  TRYING BUILD  [\^/\^/^\^/^\^/\^/\^/^\^/^\^/]
 43  [06/09/2017 11:11PM]: [\^/\^/^\^/^\^/\^/\^/^\^/^\^/]  UPDATING SOURCE CHECKSUMS  [\^/\^/^\^/^\^/\^/\^/^\^/^\^/]
 44  [06/09/2017 11:11PM]: ==> Making package: nodejs-lts 6.11.0-1 (Sat Jun 10 04:11:21 UTC 2017)
 45  [06/09/2017 11:11PM]: ==> Checking runtime dependencies...
 46  [06/09/2017 11:11PM]: ==> Installing missing dependencies...
 47  [06/09/2017 11:11PM]: Packages (3) c-ares-1.12.0-1  http-parser-2.7.1-1  libuv-1.12.0-1
 48  [06/09/2017 11:11PM]: Total Installed Size:  0.64 MiB
 49  [06/09/2017 11:11PM]: Packages (2) procps-ng-3.3.12-1  python2-2.7.13-2
 50  [06/09/2017 11:11PM]: Total Installed Size:  72.54 MiB
 51  [06/09/2017 11:11PM]: Optional dependencies for python2
 52  [06/09/2017 11:11PM]:   -> Downloading node-v6.11.0.tar.xz...
 53  [06/09/2017 11:11PM]:   % Total    % Received % Xferd  Average Speed   Time    Time     Time  Current
 54  [06/09/2017 11:11PM]:                                  Dload  Upload   Total   Spent    Left  Speed
 55  [06/09/2017 11:11PM]: 
 56   0     0    0     0    0     0      0      0 --:--:-- --:--:-- --:--:--     0
 57   0 15.0M    0 39358    0     0   185k      0  0:01:23 --:--:--  0:01:23  184k
 58 100 15.0M  100 15.0M    0     0  29.8M      0 --:--:-- --:--:-- --:--:-- 29.8M
 59  [06/09/2017 11:11PM]:   -> Downloading SHASUMS256.txt.sig...
 60  [06/09/2017 11:11PM]: 
 61   0     0    0     0    0     0      0      0 --:--:-- --:--:-- --:--:--     0
 62 100   287    0   287    0     0   2085      0 --:--:-- --:--:-- --:--:--  2094
 63  [06/09/2017 11:11PM]: ==> Validating source files with sha256sums...
 64  [06/09/2017 11:11PM]:     node-v6.11.0.tar.xz ... Passed
 65  [06/09/2017 11:11PM]:     SHASUMS256.txt ... Skipped
 66  [06/09/2017 11:11PM]:     SHASUMS256.txt.sig ... Skipped
 67  [06/09/2017 11:11PM]: ==> Verifying source file signatures with gpg...
 68  [06/09/2017 11:11PM]:     SHASUMS256.txt ... Passed
 69  [06/09/2017 11:11PM]:   -> Extracting node-v6.11.0.tar.xz with bsdtar
 70  [06/09/2017 11:11PM]: creating ./icu_config.gypi
 71  [06/09/2017 11:11PM]: { target_defaults: { cflags: [],
 72  [06/09/2017 11:11PM]:                        default_configuration: Release,
 73  [06/09/2017 11:11PM]:                        defines: [],
 74  [06/09/2017 11:11PM]:                        include_dirs: [],
 75  [06/09/2017 11:11PM]:                        libraries: [ -lz,
 76  [06/09/2017 11:11PM]:                                       -lhttp_parser,
 77  [06/09/2017 11:11PM]:                                       -luv,
 78  [06/09/2017 11:11PM]:                                       -lcares,
 79  [06/09/2017 11:11PM]:                                       -lcrypto,
 80  [06/09/2017 11:11PM]:                                       -lssl,
 81  [06/09/2017 11:11PM]:                                       -licui18n,
 82  [06/09/2017 11:11PM]:                                       -licuuc,
 83  [06/09/2017 11:11PM]:                                       -licudata]},
 84  [06/09/2017 11:11PM]:   variables: { asan: 0,
 85  [06/09/2017 11:11PM]:                  coverage: false,
 86  [06/09/2017 11:11PM]:                  debug_devtools: node,
 87  [06/09/2017 11:11PM]:                  force_dynamic_crt: 0,
 88  [06/09/2017 11:11PM]:                  host_arch: x64,
 89  [06/09/2017 11:11PM]:                  icu_gyp_path: tools/icu/icu-system.gyp,
 90  [06/09/2017 11:11PM]:                  icu_small: false,
 91  [06/09/2017 11:11PM]:                  node_byteorder: little,
 92  [06/09/2017 11:11PM]:                  node_enable_d8: false,
 93  [06/09/2017 11:11PM]:                  node_enable_v8_vtunejit: false,
 94  [06/09/2017 11:11PM]:                  node_install_npm: true,
 95  [06/09/2017 11:11PM]:                  node_module_version: 48,
 96  [06/09/2017 11:11PM]:                  node_no_browser_globals: false,
 97  [06/09/2017 11:11PM]:                  node_prefix: /usr,
 98  [06/09/2017 11:11PM]:                  node_release_urlbase: ,
 99  [06/09/2017 11:11PM]:                  node_shared: false,
100  [06/09/2017 11:11PM]:                  node_shared_cares: true,
101  [06/09/2017 11:11PM]:                  node_shared_http_parser: true,
102  [06/09/2017 11:11PM]:                  node_shared_libuv: true,
103  [06/09/2017 11:11PM]:                  node_shared_openssl: true,
104  [06/09/2017 11:11PM]:                  node_shared_zlib: true,
105  [06/09/2017 11:11PM]:                  node_tag: ,
106  [06/09/2017 11:11PM]:                  node_use_bundled_v8: true,
107  [06/09/2017 11:11PM]:                  node_use_dtrace: false,
108  [06/09/2017 11:11PM]:                  node_use_etw: false,
109  [06/09/2017 11:11PM]:                  node_use_lttng: false,
110  [06/09/2017 11:11PM]:                  node_use_openssl: true,
111  [06/09/2017 11:11PM]:                  node_use_perfctr: false,
112  [06/09/2017 11:11PM]:                  node_use_v8_platform: true,
113  [06/09/2017 11:11PM]:                  openssl_fips: ,
114  [06/09/2017 11:11PM]:                  openssl_no_asm: 0,
115  [06/09/2017 11:11PM]:                  shlib_suffix: so.48,
116  [06/09/2017 11:11PM]:                  target_arch: x64,
117  [06/09/2017 11:11PM]:                  uv_parent_path: /deps/uv/,
118  [06/09/2017 11:11PM]:                  uv_use_dtrace: false,
119  [06/09/2017 11:11PM]:                  v8_enable_gdbjit: 0,
120  [06/09/2017 11:11PM]:                  v8_enable_i18n_support: 1,
121  [06/09/2017 11:11PM]:                  v8_inspector: true,
122  [06/09/2017 11:11PM]:                  v8_no_strict_aliasing: 1,
123  [06/09/2017 11:11PM]:                  v8_optimized_debug: 0,
124  [06/09/2017 11:11PM]:                  v8_random_seed: 0,
125  [06/09/2017 11:11PM]:                  v8_use_snapshot: true,
126  [06/09/2017 11:11PM]:                  want_separate_host_toolset: 0}}
127  [06/09/2017 11:11PM]: make -C out BUILDTYPE=Release V=1
128  [06/09/2017 11:11PM]: make[1]: Entering directory /pkg/src/node-v6.11.0/out
129  [06/09/2017 11:11PM]:   g++  -I../deps/gtest -I../deps/gtest/include  -pthread -Wall -Wextra -Wno-unused-parameter -m64 -Wno-missing-field-initializers -O3 -fno-omit-frame-pointer -fno-rtti -fno-exceptions -std=gnu++0x -MMD -MF /pkg/src/node-v6.11.0/out/Release/.deps//pkg/src/node-v6.11.0/out/Release/obj.target/gtest/deps/gtest/src/gtest-death-test.o.d.raw -D_FORTIFY_SOURCE=2 -march=x86-64 -mtune=generic -O2 -pipe -fstack-protector-strong -c -o /pkg/src/node-v6.11.0/out/Release/obj.target/gtest/deps/gtest/src/gtest-death-test.o ../deps/gtest/src/gtest-death-test.cc
130  [06/09/2017 11:11PM]:   g++  -I../deps/gtest -I../deps/gtest/include  -pthread -Wall -Wextra -Wno-unused-parameter -m64 -Wno-missing-field-initializers -O3 -fno-omit-frame-pointer -fno-rtti -fno-exceptions -std=gnu++0x -MMD -MF /pkg/src/node-v6.11.0/out/Release/.deps//pkg/src/node-v6.11.0/out/Release/obj.target/gtest/deps/gtest/src/gtest-filepath.o.d.raw -D_FORTIFY_SOURCE=2 -march=x86-64 -mtune=generic -O2 -pipe -fstack-protector-strong -c -o /pkg/src/node-v6.11.0/out/Release/obj.target/gtest/deps/gtest/src/gtest-filepath.o ../deps/gtest/src/gtest-filepath.cc
131  [06/09/2017 11:11PM]:   g++  -I../deps/gtest -I../deps/gtest/include  -pthread -Wall -Wextra -Wno-unused-parameter -m64 -Wno-missing-field-initializers -O3 -fno-omit-frame-pointer -fno-rtti -fno-exceptions -std=gnu++0x -MMD -MF /pkg/src/node-v6.11.0/out/Release/.deps//pkg/src/node-v6.11.0/out/Release/obj.target/gtest/deps/gtest/src/gtest-port.o.d.raw -D_FORTIFY_SOURCE=2 -march=x86-64 -mtune=generic -O2 -pipe -fstack-protector-strong -c -o /pkg/src/node-v6.11.0/out/Release/obj.target/gtest/deps/gtest/src/gtest-port.o ../deps/gtest/src/gtest-port.cc
132  [06/09/2017 11:11PM]:   g++  -I../deps/gtest -I../deps/gtest/include  -pthread -Wall -Wextra -Wno-unused-parameter -m64 -Wno-missing-field-initializers -O3 -fno-omit-frame-pointer -fno-rtti -fno-exceptions -std=gnu++0x -MMD -MF /pkg/src/node-v6.11.0/out/Release/.deps//pkg/src/node-v6.11.0/out/Release/obj.target/gtest/deps/gtest/src/gtest-printers.o.d.raw -D_FORTIFY_SOURCE=2 -march=x86-64 -mtune=generic -O2 -pipe -fstack-protector-strong -c -o /pkg/src/node-v6.11.0/out/Release/obj.target/gtest/deps/gtest/src/gtest-printers.o ../deps/gtest/src/gtest-printers.cc
133  [06/09/2017 11:11PM]:   g++  -I../deps/gtest -I../deps/gtest/include  -pthread -Wall -Wextra -Wno-unused-parameter -m64 -Wno-missing-field-initializers -O3 -fno-omit-frame-pointer -fno-rtti -fno-exceptions -std=gnu++0x -MMD -MF /pkg/src/node-v6.11.0/out/Release/.deps//pkg/src/node-v6.11.0/out/Release/obj.target/gtest/deps/gtest/src/gtest-test-part.o.d.raw -D_FORTIFY_SOURCE=2 -march=x86-64 -mtune=generic -O2 -pipe -fstack-protector-strong -c -o /pkg/src/node-v6.11.0/out/Release/obj.target/gtest/deps/gtest/src/gtest-test-part.o ../deps/gtest/src/gtest-test-part.cc
134  [06/09/2017 11:11PM]:   g++  -I../deps/gtest -I../deps/gtest/include  -pthread -Wall -Wextra -Wno-unused-parameter -m64 -Wno-missing-field-initializers -O3 -fno-omit-frame-pointer -fno-rtti -fno-exceptions -std=gnu++0x -MMD -MF /pkg/src/node-v6.11.0/out/Release/.deps//pkg/src/node-v6.11.0/out/Release/obj.target/gtest/deps/gtest/src/gtest-typed-test.o.d.raw -D_FORTIFY_SOURCE=2 -march=x86-64 -mtune=generic -O2 -pipe -fstack-protector-strong -c -o /pkg/src/node-v6.11.0/out/Release/obj.target/gtest/deps/gtest/src/gtest-typed-test.o ../deps/gtest/src/gtest-typed-test.cc
135  [06/09/2017 11:11PM]:   g++  -I../deps/gtest -I../deps/gtest/include  -pthread -Wall -Wextra -Wno-unused-parameter -m64 -Wno-missing-field-initializers -O3 -fno-omit-frame-pointer -fno-rtti -fno-exceptions -std=gnu++0x -MMD -MF /pkg/src/node-v6.11.0/out/Release/.deps//pkg/src/node-v6.11.0/out/Release/obj.target/gtest/deps/gtest/src/gtest.o.d.raw -D_FORTIFY_SOURCE=2 -march=x86-64 -mtune=generic -O2 -pipe -fstack-protector-strong -c -o /pkg/src/node-v6.11.0/out/Release/obj.target/gtest/deps/gtest/src/gtest.o ../deps/gtest/src/gtest.cc
136  [06/09/2017 11:12PM]:   g++  -I../deps/gtest -I../deps/gtest/include  -pthread -Wall -Wextra -Wno-unused-parameter -m64 -Wno-missing-field-initializers -O3 -fno-omit-frame-pointer -fno-rtti -fno-exceptions -std=gnu++0x -MMD -MF /pkg/src/node-v6.11.0/out/Release/.deps//pkg/src/node-v6.11.0/out/Release/obj.target/gtest/deps/gtest/src/gtest_main.o.d.raw -D_FORTIFY_SOURCE=2 -march=x86-64 -mtune=generic -O2 -pipe -fstack-protector-strong -c -o /pkg/src/node-v6.11.0/out/Release/obj.target/gtest/deps/gtest/src/gtest_main.o ../deps/gtest/src/gtest_main.cc
137  [06/09/2017 11:12PM]:   rm -f /pkg/src/node-v6.11.0/out/Release/obj.target/deps/gtest/libgtest.a && ar crsT /pkg/src/node-v6.11.0/out/Release/obj.target/deps/gtest/libgtest.a /pkg/src/node-v6.11.0/out/Release/obj.target/gtest/deps/gtest/src/gtest-death-test.o /pkg/src/node-v6.11.0/out/Release/obj.target/gtest/deps/gtest/src/gtest-filepath.o /pkg/src/node-v6.11.0/out/Release/obj.target/gtest/deps/gtest/src/gtest-port.o /pkg/src/node-v6.11.0/out/Release/obj.target/gtest/deps/gtest/src/gtest-printers.o /pkg/src/node-v6.11.0/out/Release/obj.target/gtest/deps/gtest/src/gtest-test-part.o /pkg/src/node-v6.11.0/out/Release/obj.target/gtest/deps/gtest/src/gtest-typed-test.o /pkg/src/node-v6.11.0/out/Release/obj.target/gtest/deps/gtest/src/gtest.o /pkg/src/node-v6.11.0/out/Release/obj.target/gtest/deps/gtest/src/gtest_main.o
138  [06/09/2017 11:12PM]:   g++ -DV8_TARGET_ARCH_X64 -DENABLE_DISASSEMBLER -DV8_I18N_SUPPORT -I../deps/v8  -pthread -Wall -Wextra -Wno-unused-parameter -m64 -fno-strict-aliasing -m64 -fdata-sections -ffunction-sections -O3 -O3 -fno-omit-frame-pointer -fno-rtti -fno-exceptions -std=gnu++0x -MMD -MF /pkg/src/node-v6.11.0/out/Release/.deps//pkg/src/node-v6.11.0/out/Release/obj.target/v8_libplatform/deps/v8/src/libplatform/default-platform.o.d.raw -D_FORTIFY_SOURCE=2 -march=x86-64 -mtune=generic -O2 -pipe -fstack-protector-strong -c -o /pkg/src/node-v6.11.0/out/Release/obj.target/v8_libplatform/deps/v8/src/libplatform/default-platform.o ../deps/v8/src/libplatform/default-platform.cc
139  [06/09/2017 11:12PM]:   g++ -DV8_TARGET_ARCH_X64 -DENABLE_DISASSEMBLER -DV8_I18N_SUPPORT -I../deps/v8  -pthread -Wall -Wextra -Wno-unused-parameter -m64 -fno-strict-aliasing -m64 -fdata-sections -ffunction-sections -O3 -O3 -fno-omit-frame-pointer -fno-rtti -fno-exceptions -std=gnu++0x -MMD -MF /pkg/src/node-v6.11.0/out/Release/.deps//pkg/src/node-v6.11.0/out/Release/obj.target/v8_libplatform/deps/v8/src/libplatform/task-queue.o.d.raw -D_FORTIFY_SOURCE=2 -march=x86-64 -mtune=generic -O2 -pipe -fstack-protector-strong -c -o /pkg/src/node-v6.11.0/out/Release/obj.target/v8_libplatform/deps/v8/src/libplatform/task-queue.o ../deps/v8/src/libplatform/task-queue.cc
140  [06/09/2017 11:12PM]:   g++ -DV8_TARGET_ARCH_X64 -DENABLE_DISASSEMBLER -DV8_I18N_SUPPORT -I../deps/v8  -pthread -Wall -Wextra -Wno-unused-parameter -m64 -fno-strict-aliasing -m64 -fdata-sections -ffunction-sections -O3 -O3 -fno-omit-frame-pointer -fno-rtti -fno-exceptions -std=gnu++0x -MMD -MF /pkg/src/node-v6.11.0/out/Release/.deps//pkg/src/node-v6.11.0/out/Release/obj.target/v8_libplatform/deps/v8/src/libplatform/worker-thread.o.d.raw -D_FORTIFY_SOURCE=2 -march=x86-64 -mtune=generic -O2 -pipe -fstack-protector-strong -c -o /pkg/src/node-v6.11.0/out/Release/obj.target/v8_libplatform/deps/v8/src/libplatform/worker-thread.o ../deps/v8/src/libplatform/worker-thread.cc
141  [06/09/2017 11:12PM]:   rm -f /pkg/src/node-v6.11.0/out/Release/obj.target/deps/v8/tools/gyp/libv8_libplatform.a && ar crsT /pkg/src/node-v6.11.0/out/Release/obj.target/deps/v8/tools/gyp/libv8_libplatform.a /pkg/src/node-v6.11.0/out/Release/obj.target/v8_libplatform/deps/v8/src/libplatform/default-platform.o /pkg/src/node-v6.11.0/out/Release/obj.target/v8_libplatform/deps/v8/src/libplatform/task-queue.o /pkg/src/node-v6.11.0/out/Release/obj.target/v8_libplatform/deps/v8/src/libplatform/worker-thread.o
142  [06/09/2017 11:12PM]:   touch /pkg/src/node-v6.11.0/out/Release/obj.target/tools/icu/icui18n.stamp
143  [06/09/2017 11:12PM]:   touch /pkg/src/node-v6.11.0/out/Release/obj.target/tools/icu/icuuc.stamp
144  [06/09/2017 11:12PM]:   g++ -DV8_TARGET_ARCH_X64 -DENABLE_DISASSEMBLER -DV8_I18N_SUPPORT -DV8_IMMINENT_DEPRECATION_WARNINGS -DICU_UTIL_DATA_IMPL=ICU_UTIL_DATA_STATIC -I../deps/v8 -I../deps  -pthread -Wall -Wextra -Wno-unused-parameter -m64 -fno-strict-aliasing -m64 -fdata-sections -ffunction-sections -O3 -O3 -fno-omit-frame-pointer -fno-rtti -fno-exceptions -std=gnu++0x -MMD -MF /pkg/src/node-v6.11.0/out/Release/.deps//pkg/src/node-v6.11.0/out/Release/obj.target/v8_base/deps/v8/src/accessors.o.d.raw -D_FORTIFY_SOURCE=2 -march=x86-64 -mtune=generic -O2 -pipe -fstack-protector-strong -c -o /pkg/src/node-v6.11.0/out/Release/obj.target/v8_base/deps/v8/src/accessors.o ../deps/v8/src/accessors.cc
145  [06/09/2017 11:12PM]: In file included from ../deps/v8/src/heap/spaces.h:16:0,
146  [06/09/2017 11:12PM]:                  from ../deps/v8/src/heap/heap.h:20,
147  [06/09/2017 11:12PM]:                  from ../deps/v8/src/contexts.h:8,
148  [06/09/2017 11:12PM]:                  from ../deps/v8/src/api.h:9,
149  [06/09/2017 11:12PM]:                  from ../deps/v8/src/accessors.cc:7:
150  [06/09/2017 11:12PM]: ../deps/v8/src/objects.h: In member function uint32_t v8::internal::HashTable<Derived, Shape, Key>::Hash(Key):
151  [06/09/2017 11:12PM]: ../deps/v8/src/objects.h:3267:46: warning: invalid use of incomplete type class v8::internal::Heap
152  [06/09/2017 11:12PM]:        return Shape::SeededHash(key, GetHeap()->HashSeed());
153  [06/09/2017 11:12PM]:                                               ^~
154  [06/09/2017 11:12PM]: In file included from ../deps/v8/src/accessors.h:8:0,
155  [06/09/2017 11:12PM]:                  from ../deps/v8/src/accessors.cc:5:
156  [06/09/2017 11:12PM]: ../deps/v8/include/v8.h:148:7: note: forward declaration of class v8::internal::Heap
157  [06/09/2017 11:12PM]: ../deps/v8/src/objects.h: In member function uint32_t v8::internal::HashTable<Derived, Shape, Key>::HashForObject(Key, v8::internal::Object*):
158  [06/09/2017 11:12PM]: ../deps/v8/src/objects.h:3275:55: warning: invalid use of incomplete type class v8::internal::Heap
159  [06/09/2017 11:12PM]:        return Shape::SeededHashForObject(key, GetHeap()->HashSeed(), object);
160  [06/09/2017 11:12PM]:                                                        ^~
161  [06/09/2017 11:12PM]:   g++ -DV8_TARGET_ARCH_X64 -DENABLE_DISASSEMBLER -DV8_I18N_SUPPORT -DV8_IMMINENT_DEPRECATION_WARNINGS -DICU_UTIL_DATA_IMPL=ICU_UTIL_DATA_STATIC -I../deps/v8 -I../deps  -pthread -Wall -Wextra -Wno-unused-parameter -m64 -fno-strict-aliasing -m64 -fdata-sections -ffunction-sections -O3 -O3 -fno-omit-frame-pointer -fno-rtti -fno-exceptions -std=gnu++0x -MMD -MF /pkg/src/node-v6.11.0/out/Release/.deps//pkg/src/node-v6.11.0/out/Release/obj.target/v8_base/deps/v8/src/address-map.o.d.raw -D_FORTIFY_SOURCE=2 -march=x86-64 -mtune=generic -O2 -pipe -fstack-protector-strong -c -o /pkg/src/node-v6.11.0/out/Release/obj.target/v8_base/deps/v8/src/address-map.o ../deps/v8/src/address-map.cc
162  [06/09/2017 11:12PM]: In file included from ../deps/v8/src/address-map.h:10:0,
163  [06/09/2017 11:12PM]:                  from ../deps/v8/src/address-map.cc:5:
164  [06/09/2017 11:12PM]: In file included from ../deps/v8/src/allocation.h:8:0,
165  [06/09/2017 11:12PM]:                  from ../deps/v8/src/hashmap.h:8,
166  [06/09/2017 11:12PM]:                  from ../deps/v8/src/address-map.h:9,
167  [06/09/2017 11:12PM]: ../deps/v8/src/globals.h:393:7: note: forward declaration of class v8::internal::Heap
168  [06/09/2017 11:12PM]:   g++ -DV8_TARGET_ARCH_X64 -DENABLE_DISASSEMBLER -DV8_I18N_SUPPORT -DV8_IMMINENT_DEPRECATION_WARNINGS -DICU_UTIL_DATA_IMPL=ICU_UTIL_DATA_STATIC -I../deps/v8 -I../deps  -pthread -Wall -Wextra -Wno-unused-parameter -m64 -fno-strict-aliasing -m64 -fdata-sections -ffunction-sections -O3 -O3 -fno-omit-frame-pointer -fno-rtti -fno-exceptions -std=gnu++0x -MMD -MF /pkg/src/node-v6.11.0/out/Release/.deps//pkg/src/node-v6.11.0/out/Release/obj.target/v8_base/deps/v8/src/allocation.o.d.raw -D_FORTIFY_SOURCE=2 -march=x86-64 -mtune=generic -O2 -pipe -fstack-protector-strong -c -o /pkg/src/node-v6.11.0/out/Release/obj.target/v8_base/deps/v8/src/allocation.o ../deps/v8/src/allocation.cc
169  [06/09/2017 11:12PM]:   g++ -DV8_TARGET_ARCH_X64 -DENABLE_DISASSEMBLER -DV8_I18N_SUPPORT -DV8_IMMINENT_DEPRECATION_WARNINGS -DICU_UTIL_DATA_IMPL=ICU_UTIL_DATA_STATIC -I../deps/v8 -I../deps  -pthread -Wall -Wextra -Wno-unused-parameter -m64 -fno-strict-aliasing -m64 -fdata-sections -ffunction-sections -O3 -O3 -fno-omit-frame-pointer -fno-rtti -fno-exceptions -std=gnu++0x -MMD -MF /pkg/src/node-v6.11.0/out/Release/.deps//pkg/src/node-v6.11.0/out/Release/obj.target/v8_base/deps/v8/src/allocation-site-scopes.o.d.raw -D_FORTIFY_SOURCE=2 -march=x86-64 -mtune=generic -O2 -pipe -fstack-protector-strong -c -o /pkg/src/node-v6.11.0/out/Release/obj.target/v8_base/deps/v8/src/allocation-site-scopes.o ../deps/v8/src/allocation-site-scopes.cc
170  [06/09/2017 11:12PM]:                  from ../deps/v8/src/isolate.h:18,
171  [06/09/2017 11:12PM]:                  from ../deps/v8/src/assembler.h:40,
172  [06/09/2017 11:12PM]:                  from ../deps/v8/src/ast/ast.h:8,
173  [06/09/2017 11:12PM]:                  from ../deps/v8/src/allocation-site-scopes.h:8,
174  [06/09/2017 11:12PM]:                  from ../deps/v8/src/allocation-site-scopes.cc:5:
175  [06/09/2017 11:12PM]:                  from ../deps/v8/src/assembler.h:38,
176  [06/09/2017 11:12PM]:   g++ -DV8_TARGET_ARCH_X64 -DENABLE_DISASSEMBLER -DV8_I18N_SUPPORT -DV8_IMMINENT_DEPRECATION_WARNINGS -DICU_UTIL_DATA_IMPL=ICU_UTIL_DATA_STATIC -I../deps/v8 -I../deps  -pthread -Wall -Wextra -Wno-unused-parameter -m64 -fno-strict-aliasing -m64 -fdata-sections -ffunction-sections -O3 -O3 -fno-omit-frame-pointer -fno-rtti -fno-exceptions -std=gnu++0x -MMD -MF /pkg/src/node-v6.11.0/out/Release/.deps//pkg/src/node-v6.11.0/out/Release/obj.target/v8_base/deps/v8/src/api-experimental.o.d.raw -D_FORTIFY_SOURCE=2 -march=x86-64 -mtune=generic -O2 -pipe -fstack-protector-strong -c -o /pkg/src/node-v6.11.0/out/Release/obj.target/v8_base/deps/v8/src/api-experimental.o ../deps/v8/src/api-experimental.cc
177  [06/09/2017 11:12PM]:                  from ../deps/v8/src/api-experimental.cc:13:
178  [06/09/2017 11:12PM]: In file included from ../deps/v8/src/handles.h:8:0,
179  [06/09/2017 11:12PM]:                  from ../deps/v8/src/api-experimental.h:8,
180  [06/09/2017 11:12PM]:                  from ../deps/v8/src/api-experimental.cc:9:
181  [06/09/2017 11:12PM]:   g++ -DV8_TARGET_ARCH_X64 -DENABLE_DISASSEMBLER -DV8_I18N_SUPPORT -DV8_IMMINENT_DEPRECATION_WARNINGS -DICU_UTIL_DATA_IMPL=ICU_UTIL_DATA_STATIC -I../deps/v8 -I../deps  -pthread -Wall -Wextra -Wno-unused-parameter -m64 -fno-strict-aliasing -m64 -fdata-sections -ffunction-sections -O3 -O3 -fno-omit-frame-pointer -fno-rtti -fno-exceptions -std=gnu++0x -MMD -MF /pkg/src/node-v6.11.0/out/Release/.deps//pkg/src/node-v6.11.0/out/Release/obj.target/v8_base/deps/v8/src/api.o.d.raw -D_FORTIFY_SOURCE=2 -march=x86-64 -mtune=generic -O2 -pipe -fstack-protector-strong -c -o /pkg/src/node-v6.11.0/out/Release/obj.target/v8_base/deps/v8/src/api.o ../deps/v8/src/api.cc
182  [06/09/2017 11:12PM]:                  from ../deps/v8/src/api.cc:5:
183  [06/09/2017 11:12PM]: In file included from ../deps/v8/include/v8-testing.h:8:0,
184  [06/09/2017 11:12PM]:                  from ../deps/v8/src/api.h:8,
185  [06/09/2017 11:12PM]: In file included from ../deps/v8/src/api.cc:5:0:
186  [06/09/2017 11:12PM]: ../deps/v8/src/api.h: In instantiation of v8::internal::Handle<v8::internal::Object> v8::FromCData(v8::internal::Isolate*, T) [with T = std::nullptr_t]:
187  [06/09/2017 11:12PM]: ../deps/v8/src/api.cc:1582:3:   required from here
188  [06/09/2017 11:12PM]: ../deps/v8/src/api.h:106:39: warning: parameter obj set but not used [-Wunused-but-set-parameter]
189  [06/09/2017 11:12PM]:      v8::internal::Isolate* isolate, T obj) {
190  [06/09/2017 11:12PM]:                                        ^~~
191  [06/09/2017 11:12PM]:   g++ -DV8_TARGET_ARCH_X64 -DENABLE_DISASSEMBLER -DV8_I18N_SUPPORT -DV8_IMMINENT_DEPRECATION_WARNINGS -DICU_UTIL_DATA_IMPL=ICU_UTIL_DATA_STATIC -I../deps/v8 -I../deps  -pthread -Wall -Wextra -Wno-unused-parameter -m64 -fno-strict-aliasing -m64 -fdata-sections -ffunction-sections -O3 -O3 -fno-omit-frame-pointer -fno-rtti -fno-exceptions -std=gnu++0x -MMD -MF /pkg/src/node-v6.11.0/out/Release/.deps//pkg/src/node-v6.11.0/out/Release/obj.target/v8_base/deps/v8/src/api-arguments.o.d.raw -D_FORTIFY_SOURCE=2 -march=x86-64 -mtune=generic -O2 -pipe -fstack-protector-strong -c -o /pkg/src/node-v6.11.0/out/Release/obj.target/v8_base/deps/v8/src/api-arguments.o ../deps/v8/src/api-arguments.cc
192  [06/09/2017 11:12PM]:                  from ../deps/v8/src/api-arguments.h:8,
193  [06/09/2017 11:12PM]:                  from ../deps/v8/src/api-arguments.cc:5:
194  [06/09/2017 11:12PM]:   g++ -DV8_TARGET_ARCH_X64 -DENABLE_DISASSEMBLER -DV8_I18N_SUPPORT -DV8_IMMINENT_DEPRECATION_WARNINGS -DICU_UTIL_DATA_IMPL=ICU_UTIL_DATA_STATIC -I../deps/v8 -I../deps  -pthread -Wall -Wextra -Wno-unused-parameter -m64 -fno-strict-aliasing -m64 -fdata-sections -ffunction-sections -O3 -O3 -fno-omit-frame-pointer -fno-rtti -fno-exceptions -std=gnu++0x -MMD -MF /pkg/src/node-v6.11.0/out/Release/.deps//pkg/src/node-v6.11.0/out/Release/obj.target/v8_base/deps/v8/src/api-natives.o.d.raw -D_FORTIFY_SOURCE=2 -march=x86-64 -mtune=generic -O2 -pipe -fstack-protector-strong -c -o /pkg/src/node-v6.11.0/out/Release/obj.target/v8_base/deps/v8/src/api-natives.o ../deps/v8/src/api-natives.cc
195  [06/09/2017 11:12PM]:                  from ../deps/v8/src/api-natives.cc:7:
196  [06/09/2017 11:12PM]:                  from ../deps/v8/src/api-natives.h:8,
197  [06/09/2017 11:12PM]:                  from ../deps/v8/src/api-natives.cc:5:
198  [06/09/2017 11:12PM]:   g++ -DV8_TARGET_ARCH_X64 -DENABLE_DISASSEMBLER -DV8_I18N_SUPPORT -DV8_IMMINENT_DEPRECATION_WARNINGS -DICU_UTIL_DATA_IMPL=ICU_UTIL_DATA_STATIC -I../deps/v8 -I../deps  -pthread -Wall -Wextra -Wno-unused-parameter -m64 -fno-strict-aliasing -m64 -fdata-sections -ffunction-sections -O3 -O3 -fno-omit-frame-pointer -fno-rtti -fno-exceptions -std=gnu++0x -MMD -MF /pkg/src/node-v6.11.0/out/Release/.deps//pkg/src/node-v6.11.0/out/Release/obj.target/v8_base/deps/v8/src/arguments.o.d.raw -D_FORTIFY_SOURCE=2 -march=x86-64 -mtune=generic -O2 -pipe -fstack-protector-strong -c -o /pkg/src/node-v6.11.0/out/Release/obj.target/v8_base/deps/v8/src/arguments.o ../deps/v8/src/arguments.cc
199  [06/09/2017 11:12PM]:                  from ../deps/v8/src/contexts-inl.h:8,
200  [06/09/2017 11:12PM]:                  from ../deps/v8/src/objects-inl.h:17,
201  [06/09/2017 11:12PM]:                  from ../deps/v8/src/arguments.h:9,
202  [06/09/2017 11:12PM]:                  from ../deps/v8/src/arguments.cc:5:
203  [06/09/2017 11:12PM]:                  from ../deps/v8/src/arguments.h:8,
204  [06/09/2017 11:12PM]:   g++ -DV8_TARGET_ARCH_X64 -DENABLE_DISASSEMBLER -DV8_I18N_SUPPORT -DV8_IMMINENT_DEPRECATION_WARNINGS -DICU_UTIL_DATA_IMPL=ICU_UTIL_DATA_STATIC -I../deps/v8 -I../deps  -pthread -Wall -Wextra -Wno-unused-parameter -m64 -fno-strict-aliasing -m64 -fdata-sections -ffunction-sections -O3 -O3 -fno-omit-frame-pointer -fno-rtti -fno-exceptions -std=gnu++0x -MMD -MF /pkg/src/node-v6.11.0/out/Release/.deps//pkg/src/node-v6.11.0/out/Release/obj.target/v8_base/deps/v8/src/assembler.o.d.raw -D_FORTIFY_SOURCE=2 -march=x86-64 -mtune=generic -O2 -pipe -fstack-protector-strong -c -o /pkg/src/node-v6.11.0/out/Release/obj.target/v8_base/deps/v8/src/assembler.o ../deps/v8/src/assembler.cc
205  [06/09/2017 11:12PM]:                  from ../deps/v8/src/assembler.cc:35:
206  [06/09/2017 11:12PM]:   g++ -DV8_TARGET_ARCH_X64 -DENABLE_DISASSEMBLER -DV8_I18N_SUPPORT -DV8_IMMINENT_DEPRECATION_WARNINGS -DICU_UTIL_DATA_IMPL=ICU_UTIL_DATA_STATIC -I../deps/v8 -I../deps  -pthread -Wall -Wextra -Wno-unused-parameter -m64 -fno-strict-aliasing -m64 -fdata-sections -ffunction-sections -O3 -O3 -fno-omit-frame-pointer -fno-rtti -fno-exceptions -std=gnu++0x -MMD -MF /pkg/src/node-v6.11.0/out/Release/.deps//pkg/src/node-v6.11.0/out/Release/obj.target/v8_base/deps/v8/src/assert-scope.o.d.raw -D_FORTIFY_SOURCE=2 -march=x86-64 -mtune=generic -O2 -pipe -fstack-protector-strong -c -o /pkg/src/node-v6.11.0/out/Release/obj.target/v8_base/deps/v8/src/assert-scope.o ../deps/v8/src/assert-scope.cc
207  [06/09/2017 11:12PM]:                  from ../deps/v8/src/debug/debug.h:9,
208  [06/09/2017 11:12PM]:                  from ../deps/v8/src/assert-scope.cc:9:
209  [06/09/2017 11:12PM]:                  from ../deps/v8/src/debug/debug.h:8,
210  [06/09/2017 11:12PM]:   g++ -DV8_TARGET_ARCH_X64 -DENABLE_DISASSEMBLER -DV8_I18N_SUPPORT -DV8_IMMINENT_DEPRECATION_WARNINGS -DICU_UTIL_DATA_IMPL=ICU_UTIL_DATA_STATIC -I../deps/v8 -I../deps  -pthread -Wall -Wextra -Wno-unused-parameter -m64 -fno-strict-aliasing -m64 -fdata-sections -ffunction-sections -O3 -O3 -fno-omit-frame-pointer -fno-rtti -fno-exceptions -std=gnu++0x -MMD -MF /pkg/src/node-v6.11.0/out/Release/.deps//pkg/src/node-v6.11.0/out/Release/obj.target/v8_base/deps/v8/src/ast/ast-expression-rewriter.o.d.raw -D_FORTIFY_SOURCE=2 -march=x86-64 -mtune=generic -O2 -pipe -fstack-protector-strong -c -o /pkg/src/node-v6.11.0/out/Release/obj.target/v8_base/deps/v8/src/ast/ast-expression-rewriter.o ../deps/v8/src/ast/ast-expression-rewriter.cc
211  [06/09/2017 11:12PM]:                  from ../deps/v8/src/ast/ast-expression-rewriter.cc:5:
212  [06/09/2017 11:12PM]:   g++ -DV8_TARGET_ARCH_X64 -DENABLE_DISASSEMBLER -DV8_I18N_SUPPORT -DV8_IMMINENT_DEPRECATION_WARNINGS -DICU_UTIL_DATA_IMPL=ICU_UTIL_DATA_STATIC -I../deps/v8 -I../deps  -pthread -Wall -Wextra -Wno-unused-parameter -m64 -fno-strict-aliasing -m64 -fdata-sections -ffunction-sections -O3 -O3 -fno-omit-frame-pointer -fno-rtti -fno-exceptions -std=gnu++0x -MMD -MF /pkg/src/node-v6.11.0/out/Release/.deps//pkg/src/node-v6.11.0/out/Release/obj.target/v8_base/deps/v8/src/ast/ast-expression-visitor.o.d.raw -D_FORTIFY_SOURCE=2 -march=x86-64 -mtune=generic -O2 -pipe -fstack-protector-strong -c -o /pkg/src/node-v6.11.0/out/Release/obj.target/v8_base/deps/v8/src/ast/ast-expression-visitor.o ../deps/v8/src/ast/ast-expression-visitor.cc
213  [06/09/2017 11:12PM]:                  from ../deps/v8/src/ast/ast-expression-visitor.h:9,
214  [06/09/2017 11:12PM]:                  from ../deps/v8/src/ast/ast-expression-visitor.cc:7:
215  [06/09/2017 11:12PM]: In file included from ../deps/v8/src/v8.h:8:0,
216  [06/09/2017 11:12PM]:                  from ../deps/v8/src/ast/ast-expression-visitor.cc:5:
217  [06/09/2017 11:12PM]:   g++ -DV8_TARGET_ARCH_X64 -DENABLE_DISASSEMBLER -DV8_I18N_SUPPORT -DV8_IMMINENT_DEPRECATION_WARNINGS -DICU_UTIL_DATA_IMPL=ICU_UTIL_DATA_STATIC -I../deps/v8 -I../deps  -pthread -Wall -Wextra -Wno-unused-parameter -m64 -fno-strict-aliasing -m64 -fdata-sections -ffunction-sections -O3 -O3 -fno-omit-frame-pointer -fno-rtti -fno-exceptions -std=gnu++0x -MMD -MF /pkg/src/node-v6.11.0/out/Release/.deps//pkg/src/node-v6.11.0/out/Release/obj.target/v8_base/deps/v8/src/ast/ast-literal-reindexer.o.d.raw -D_FORTIFY_SOURCE=2 -march=x86-64 -mtune=generic -O2 -pipe -fstack-protector-strong -c -o /pkg/src/node-v6.11.0/out/Release/obj.target/v8_base/deps/v8/src/ast/ast-literal-reindexer.o ../deps/v8/src/ast/ast-literal-reindexer.cc
218  [06/09/2017 11:12PM]:                  from ../deps/v8/src/ast/ast-literal-reindexer.h:8,
219  [06/09/2017 11:12PM]:                  from ../deps/v8/src/ast/ast-literal-reindexer.cc:5:
220  [06/09/2017 11:12PM]:   g++ -DV8_TARGET_ARCH_X64 -DENABLE_DISASSEMBLER -DV8_I18N_SUPPORT -DV8_IMMINENT_DEPRECATION_WARNINGS -DICU_UTIL_DATA_IMPL=ICU_UTIL_DATA_STATIC -I../deps/v8 -I../deps  -pthread -Wall -Wextra -Wno-unused-parameter -m64 -fno-strict-aliasing -m64 -fdata-sections -ffunction-sections -O3 -O3 -fno-omit-frame-pointer -fno-rtti -fno-exceptions -std=gnu++0x -MMD -MF /pkg/src/node-v6.11.0/out/Release/.deps//pkg/src/node-v6.11.0/out/Release/obj.target/v8_base/deps/v8/src/ast/ast-numbering.o.d.raw -D_FORTIFY_SOURCE=2 -march=x86-64 -mtune=generic -O2 -pipe -fstack-protector-strong -c -o /pkg/src/node-v6.11.0/out/Release/obj.target/v8_base/deps/v8/src/ast/ast-numbering.o ../deps/v8/src/ast/ast-numbering.cc
221  [06/09/2017 11:12PM]:                  from ../deps/v8/src/ast/ast-numbering.cc:7:
222  [06/09/2017 11:12PM]:   g++ -DV8_TARGET_ARCH_X64 -DENABLE_DISASSEMBLER -DV8_I18N_SUPPORT -DV8_IMMINENT_DEPRECATION_WARNINGS -DICU_UTIL_DATA_IMPL=ICU_UTIL_DATA_STATIC -I../deps/v8 -I../deps  -pthread -Wall -Wextra -Wno-unused-parameter -m64 -fno-strict-aliasing -m64 -fdata-sections -ffunction-sections -O3 -O3 -fno-omit-frame-pointer -fno-rtti -fno-exceptions -std=gnu++0x -MMD -MF /pkg/src/node-v6.11.0/out/Release/.deps//pkg/src/node-v6.11.0/out/Release/obj.target/v8_base/deps/v8/src/ast/ast-value-factory.o.d.raw -D_FORTIFY_SOURCE=2 -march=x86-64 -mtune=generic -O2 -pipe -fstack-protector-strong -c -o /pkg/src/node-v6.11.0/out/Release/obj.target/v8_base/deps/v8/src/ast/ast-value-factory.o ../deps/v8/src/ast/ast-value-factory.cc
223  [06/09/2017 11:12PM]:                  from ../deps/v8/src/ast/ast-value-factory.h:31,
224  [06/09/2017 11:12PM]:                  from ../deps/v8/src/ast/ast-value-factory.cc:28:
225  [06/09/2017 11:12PM]:   g++ -DV8_TARGET_ARCH_X64 -DENABLE_DISASSEMBLER -DV8_I18N_SUPPORT -DV8_IMMINENT_DEPRECATION_WARNINGS -DICU_UTIL_DATA_IMPL=ICU_UTIL_DATA_STATIC -I../deps/v8 -I../deps  -pthread -Wall -Wextra -Wno-unused-parameter -m64 -fno-strict-aliasing -m64 -fdata-sections -ffunction-sections -O3 -O3 -fno-omit-frame-pointer -fno-rtti -fno-exceptions -std=gnu++0x -MMD -MF /pkg/src/node-v6.11.0/out/Release/.deps//pkg/src/node-v6.11.0/out/Release/obj.target/v8_base/deps/v8/src/ast/ast.o.d.raw -D_FORTIFY_SOURCE=2 -march=x86-64 -mtune=generic -O2 -pipe -fstack-protector-strong -c -o /pkg/src/node-v6.11.0/out/Release/obj.target/v8_base/deps/v8/src/ast/ast.o ../deps/v8/src/ast/ast.cc
226  [06/09/2017 11:12PM]:                  from ../deps/v8/src/ast/ast.cc:5:
227  [06/09/2017 11:13PM]:   g++ -DV8_TARGET_ARCH_X64 -DENABLE_DISASSEMBLER -DV8_I18N_SUPPORT -DV8_IMMINENT_DEPRECATION_WARNINGS -DICU_UTIL_DATA_IMPL=ICU_UTIL_DATA_STATIC -I../deps/v8 -I../deps  -pthread -Wall -Wextra -Wno-unused-parameter -m64 -fno-strict-aliasing -m64 -fdata-sections -ffunction-sections -O3 -O3 -fno-omit-frame-pointer -fno-rtti -fno-exceptions -std=gnu++0x -MMD -MF /pkg/src/node-v6.11.0/out/Release/.deps//pkg/src/node-v6.11.0/out/Release/obj.target/v8_base/deps/v8/src/ast/modules.o.d.raw -D_FORTIFY_SOURCE=2 -march=x86-64 -mtune=generic -O2 -pipe -fstack-protector-strong -c -o /pkg/src/node-v6.11.0/out/Release/obj.target/v8_base/deps/v8/src/ast/modules.o ../deps/v8/src/ast/modules.cc
228  [06/09/2017 11:13PM]:                  from ../deps/v8/src/ast/modules.cc:7:
229  [06/09/2017 11:13PM]: In file included from ../deps/v8/src/zone.h:12:0,
230  [06/09/2017 11:13PM]:                  from ../deps/v8/src/ast/modules.h:8,
231  [06/09/2017 11:13PM]:                  from ../deps/v8/src/ast/modules.cc:5:
232  [06/09/2017 11:13PM]:   g++ -DV8_TARGET_ARCH_X64 -DENABLE_DISASSEMBLER -DV8_I18N_SUPPORT -DV8_IMMINENT_DEPRECATION_WARNINGS -DICU_UTIL_DATA_IMPL=ICU_UTIL_DATA_STATIC -I../deps/v8 -I../deps  -pthread -Wall -Wextra -Wno-unused-parameter -m64 -fno-strict-aliasing -m64 -fdata-sections -ffunction-sections -O3 -O3 -fno-omit-frame-pointer -fno-rtti -fno-exceptions -std=gnu++0x -MMD -MF /pkg/src/node-v6.11.0/out/Release/.deps//pkg/src/node-v6.11.0/out/Release/obj.target/v8_base/deps/v8/src/ast/prettyprinter.o.d.raw -D_FORTIFY_SOURCE=2 -march=x86-64 -mtune=generic -O2 -pipe -fstack-protector-strong -c -o /pkg/src/node-v6.11.0/out/Release/obj.target/v8_base/deps/v8/src/ast/prettyprinter.o ../deps/v8/src/ast/prettyprinter.cc
233  [06/09/2017 11:13PM]:                  from ../deps/v8/src/ast/prettyprinter.h:9,
234  [06/09/2017 11:13PM]:                  from ../deps/v8/src/ast/prettyprinter.cc:5:
235  [06/09/2017 11:13PM]:                  from ../deps/v8/src/ast/prettyprinter.h:8,
236  [06/09/2017 11:13PM]:   g++ -DV8_TARGET_ARCH_X64 -DENABLE_DISASSEMBLER -DV8_I18N_SUPPORT -DV8_IMMINENT_DEPRECATION_WARNINGS -DICU_UTIL_DATA_IMPL=ICU_UTIL_DATA_STATIC -I../deps/v8 -I../deps  -pthread -Wall -Wextra -Wno-unused-parameter -m64 -fno-strict-aliasing -m64 -fdata-sections -ffunction-sections -O3 -O3 -fno-omit-frame-pointer -fno-rtti -fno-exceptions -std=gnu++0x -MMD -MF /pkg/src/node-v6.11.0/out/Release/.deps//pkg/src/node-v6.11.0/out/Release/obj.target/v8_base/deps/v8/src/ast/scopeinfo.o.d.raw -D_FORTIFY_SOURCE=2 -march=x86-64 -mtune=generic -O2 -pipe -fstack-protector-strong -c -o /pkg/src/node-v6.11.0/out/Release/obj.target/v8_base/deps/v8/src/ast/scopeinfo.o ../deps/v8/src/ast/scopeinfo.cc
237  [06/09/2017 11:13PM]:                  from ../deps/v8/src/ast/variables.h:8,
238  [06/09/2017 11:13PM]:                  from ../deps/v8/src/ast/scopeinfo.h:10,
239  [06/09/2017 11:13PM]:                  from ../deps/v8/src/ast/scopeinfo.cc:5:
240  [06/09/2017 11:13PM]:                  from ../deps/v8/src/ast/scopeinfo.h:8,
241  [06/09/2017 11:13PM]:   g++ -DV8_TARGET_ARCH_X64 -DENABLE_DISASSEMBLER -DV8_I18N_SUPPORT -DV8_IMMINENT_DEPRECATION_WARNINGS -DICU_UTIL_DATA_IMPL=ICU_UTIL_DATA_STATIC -I../deps/v8 -I../deps  -pthread -Wall -Wextra -Wno-unused-parameter -m64 -fno-strict-aliasing -m64 -fdata-sections -ffunction-sections -O3 -O3 -fno-omit-frame-pointer -fno-rtti -fno-exceptions -std=gnu++0x -MMD -MF /pkg/src/node-v6.11.0/out/Release/.deps//pkg/src/node-v6.11.0/out/Release/obj.target/v8_base/deps/v8/src/ast/scopes.o.d.raw -D_FORTIFY_SOURCE=2 -march=x86-64 -mtune=generic -O2 -pipe -fstack-protector-strong -c -o /pkg/src/node-v6.11.0/out/Release/obj.target/v8_base/deps/v8/src/ast/scopes.o ../deps/v8/src/ast/scopes.cc
242  [06/09/2017 11:13PM]:                  from ../deps/v8/src/ast/scopes.h:8,
243  [06/09/2017 11:13PM]:                  from ../deps/v8/src/ast/scopes.cc:5:
244  [06/09/2017 11:13PM]:   g++ -DV8_TARGET_ARCH_X64 -DENABLE_DISASSEMBLER -DV8_I18N_SUPPORT -DV8_IMMINENT_DEPRECATION_WARNINGS -DICU_UTIL_DATA_IMPL=ICU_UTIL_DATA_STATIC -I../deps/v8 -I../deps  -pthread -Wall -Wextra -Wno-unused-parameter -m64 -fno-strict-aliasing -m64 -fdata-sections -ffunction-sections -O3 -O3 -fno-omit-frame-pointer -fno-rtti -fno-exceptions -std=gnu++0x -MMD -MF /pkg/src/node-v6.11.0/out/Release/.deps//pkg/src/node-v6.11.0/out/Release/obj.target/v8_base/deps/v8/src/ast/variables.o.d.raw -D_FORTIFY_SOURCE=2 -march=x86-64 -mtune=generic -O2 -pipe -fstack-protector-strong -c -o /pkg/src/node-v6.11.0/out/Release/obj.target/v8_base/deps/v8/src/ast/variables.o ../deps/v8/src/ast/variables.cc
245  [06/09/2017 11:13PM]:                  from ../deps/v8/src/ast/variables.cc:5:
246  [06/09/2017 11:13PM]:   g++ -DV8_TARGET_ARCH_X64 -DENABLE_DISASSEMBLER -DV8_I18N_SUPPORT -DV8_IMMINENT_DEPRECATION_WARNINGS -DICU_UTIL_DATA_IMPL=ICU_UTIL_DATA_STATIC -I../deps/v8 -I../deps  -pthread -Wall -Wextra -Wno-unused-parameter -m64 -fno-strict-aliasing -m64 -fdata-sections -ffunction-sections -O3 -O3 -fno-omit-frame-pointer -fno-rtti -fno-exceptions -std=gnu++0x -MMD -MF /pkg/src/node-v6.11.0/out/Release/.deps//pkg/src/node-v6.11.0/out/Release/obj.target/v8_base/deps/v8/src/background-parsing-task.o.d.raw -D_FORTIFY_SOURCE=2 -march=x86-64 -mtune=generic -O2 -pipe -fstack-protector-strong -c -o /pkg/src/node-v6.11.0/out/Release/obj.target/v8_base/deps/v8/src/background-parsing-task.o ../deps/v8/src/background-parsing-task.cc
247  [06/09/2017 11:13PM]:                  from ../deps/v8/src/compiler.h:9,
248  [06/09/2017 11:13PM]:                  from ../deps/v8/src/background-parsing-task.h:11,
249  [06/09/2017 11:13PM]:                  from ../deps/v8/src/background-parsing-task.cc:5:
250  [06/09/2017 11:13PM]:                  from ../deps/v8/src/compiler.h:8,
251  [06/09/2017 11:13PM]:   g++ -DV8_TARGET_ARCH_X64 -DENABLE_DISASSEMBLER -DV8_I18N_SUPPORT -DV8_IMMINENT_DEPRECATION_WARNINGS -DICU_UTIL_DATA_IMPL=ICU_UTIL_DATA_STATIC -I../deps/v8 -I../deps  -pthread -Wall -Wextra -Wno-unused-parameter -m64 -fno-strict-aliasing -m64 -fdata-sections -ffunction-sections -O3 -O3 -fno-omit-frame-pointer -fno-rtti -fno-exceptions -std=gnu++0x -MMD -MF /pkg/src/node-v6.11.0/out/Release/.deps//pkg/src/node-v6.11.0/out/Release/obj.target/v8_base/deps/v8/src/bailout-reason.o.d.raw -D_FORTIFY_SOURCE=2 -march=x86-64 -mtune=generic -O2 -pipe -fstack-protector-strong -c -o /pkg/src/node-v6.11.0/out/Release/obj.target/v8_base/deps/v8/src/bailout-reason.o ../deps/v8/src/bailout-reason.cc
252  [06/09/2017 11:13PM]:   g++ -DV8_TARGET_ARCH_X64 -DENABLE_DISASSEMBLER -DV8_I18N_SUPPORT -DV8_IMMINENT_DEPRECATION_WARNINGS -DICU_UTIL_DATA_IMPL=ICU_UTIL_DATA_STATIC -I../deps/v8 -I../deps  -pthread -Wall -Wextra -Wno-unused-parameter -m64 -fno-strict-aliasing -m64 -fdata-sections -ffunction-sections -O3 -O3 -fno-omit-frame-pointer -fno-rtti -fno-exceptions -std=gnu++0x -MMD -MF /pkg/src/node-v6.11.0/out/Release/.deps//pkg/src/node-v6.11.0/out/Release/obj.target/v8_base/deps/v8/src/basic-block-profiler.o.d.raw -D_FORTIFY_SOURCE=2 -march=x86-64 -mtune=generic -O2 -pipe -fstack-protector-strong -c -o /pkg/src/node-v6.11.0/out/Release/obj.target/v8_base/deps/v8/src/basic-block-profiler.o ../deps/v8/src/basic-block-profiler.cc
253  [06/09/2017 11:13PM]:   g++ -DV8_TARGET_ARCH_X64 -DENABLE_DISASSEMBLER -DV8_I18N_SUPPORT -DV8_IMMINENT_DEPRECATION_WARNINGS -DICU_UTIL_DATA_IMPL=ICU_UTIL_DATA_STATIC -I../deps/v8 -I../deps  -pthread -Wall -Wextra -Wno-unused-parameter -m64 -fno-strict-aliasing -m64 -fdata-sections -ffunction-sections -O3 -O3 -fno-omit-frame-pointer -fno-rtti -fno-exceptions -std=gnu++0x -MMD -MF /pkg/src/node-v6.11.0/out/Release/.deps//pkg/src/node-v6.11.0/out/Release/obj.target/v8_base/deps/v8/src/bignum-dtoa.o.d.raw -D_FORTIFY_SOURCE=2 -march=x86-64 -mtune=generic -O2 -pipe -fstack-protector-strong -c -o /pkg/src/node-v6.11.0/out/Release/obj.target/v8_base/deps/v8/src/bignum-dtoa.o ../deps/v8/src/bignum-dtoa.cc
254  [06/09/2017 11:13PM]:   g++ -DV8_TARGET_ARCH_X64 -DENABLE_DISASSEMBLER -DV8_I18N_SUPPORT -DV8_IMMINENT_DEPRECATION_WARNINGS -DICU_UTIL_DATA_IMPL=ICU_UTIL_DATA_STATIC -I../deps/v8 -I../deps  -pthread -Wall -Wextra -Wno-unused-parameter -m64 -fno-strict-aliasing -m64 -fdata-sections -ffunction-sections -O3 -O3 -fno-omit-frame-pointer -fno-rtti -fno-exceptions -std=gnu++0x -MMD -MF /pkg/src/node-v6.11.0/out/Release/.deps//pkg/src/node-v6.11.0/out/Release/obj.target/v8_base/deps/v8/src/bignum.o.d.raw -D_FORTIFY_SOURCE=2 -march=x86-64 -mtune=generic -O2 -pipe -fstack-protector-strong -c -o /pkg/src/node-v6.11.0/out/Release/obj.target/v8_base/deps/v8/src/bignum.o ../deps/v8/src/bignum.cc
255  [06/09/2017 11:13PM]:   g++ -DV8_TARGET_ARCH_X64 -DENABLE_DISASSEMBLER -DV8_I18N_SUPPORT -DV8_IMMINENT_DEPRECATION_WARNINGS -DICU_UTIL_DATA_IMPL=ICU_UTIL_DATA_STATIC -I../deps/v8 -I../deps  -pthread -Wall -Wextra -Wno-unused-parameter -m64 -fno-strict-aliasing -m64 -fdata-sections -ffunction-sections -O3 -O3 -fno-omit-frame-pointer -fno-rtti -fno-exceptions -std=gnu++0x -MMD -MF /pkg/src/node-v6.11.0/out/Release/.deps//pkg/src/node-v6.11.0/out/Release/obj.target/v8_base/deps/v8/src/bit-vector.o.d.raw -D_FORTIFY_SOURCE=2 -march=x86-64 -mtune=generic -O2 -pipe -fstack-protector-strong -c -o /pkg/src/node-v6.11.0/out/Release/obj.target/v8_base/deps/v8/src/bit-vector.o ../deps/v8/src/bit-vector.cc
256  [06/09/2017 11:13PM]:   g++ -DV8_TARGET_ARCH_X64 -DENABLE_DISASSEMBLER -DV8_I18N_SUPPORT -DV8_IMMINENT_DEPRECATION_WARNINGS -DICU_UTIL_DATA_IMPL=ICU_UTIL_DATA_STATIC -I../deps/v8 -I../deps  -pthread -Wall -Wextra -Wno-unused-parameter -m64 -fno-strict-aliasing -m64 -fdata-sections -ffunction-sections -O3 -O3 -fno-omit-frame-pointer -fno-rtti -fno-exceptions -std=gnu++0x -MMD -MF /pkg/src/node-v6.11.0/out/Release/.deps//pkg/src/node-v6.11.0/out/Release/obj.target/v8_base/deps/v8/src/bootstrapper.o.d.raw -D_FORTIFY_SOURCE=2 -march=x86-64 -mtune=generic -O2 -pipe -fstack-protector-strong -c -o /pkg/src/node-v6.11.0/out/Release/obj.target/v8_base/deps/v8/src/bootstrapper.o ../deps/v8/src/bootstrapper.cc
257  [06/09/2017 11:13PM]:                  from ../deps/v8/src/factory.h:8,
258  [06/09/2017 11:13PM]:                  from ../deps/v8/src/bootstrapper.h:8,
259  [06/09/2017 11:13PM]:                  from ../deps/v8/src/bootstrapper.cc:5:
260  [06/09/2017 11:13PM]: In file included from ../deps/v8/include/v8-debug.h:8:0,
261  [06/09/2017 11:13PM]:                  from ../deps/v8/src/isolate.h:11,
262  [06/09/2017 11:13PM]:   g++ -DV8_TARGET_ARCH_X64 -DENABLE_DISASSEMBLER -DV8_I18N_SUPPORT -DV8_IMMINENT_DEPRECATION_WARNINGS -DICU_UTIL_DATA_IMPL=ICU_UTIL_DATA_STATIC -I../deps/v8 -I../deps  -pthread -Wall -Wextra -Wno-unused-parameter -m64 -fno-strict-aliasing -m64 -fdata-sections -ffunction-sections -O3 -O3 -fno-omit-frame-pointer -fno-rtti -fno-exceptions -std=gnu++0x -MMD -MF /pkg/src/node-v6.11.0/out/Release/.deps//pkg/src/node-v6.11.0/out/Release/obj.target/v8_base/deps/v8/src/builtins.o.d.raw -D_FORTIFY_SOURCE=2 -march=x86-64 -mtune=generic -O2 -pipe -fstack-protector-strong -c -o /pkg/src/node-v6.11.0/out/Release/obj.target/v8_base/deps/v8/src/builtins.o ../deps/v8/src/builtins.cc
263  [06/09/2017 11:13PM]:                  from ../deps/v8/src/builtins.cc:7:
264  [06/09/2017 11:13PM]:                  from ../deps/v8/src/builtins.h:9,
265  [06/09/2017 11:13PM]:                  from ../deps/v8/src/builtins.cc:5:
266  [06/09/2017 11:13PM]:   g++ -DV8_TARGET_ARCH_X64 -DENABLE_DISASSEMBLER -DV8_I18N_SUPPORT -DV8_IMMINENT_DEPRECATION_WARNINGS -DICU_UTIL_DATA_IMPL=ICU_UTIL_DATA_STATIC -I../deps/v8 -I../deps  -pthread -Wall -Wextra -Wno-unused-parameter -m64 -fno-strict-aliasing -m64 -fdata-sections -ffunction-sections -O3 -O3 -fno-omit-frame-pointer -fno-rtti -fno-exceptions -std=gnu++0x -MMD -MF /pkg/src/node-v6.11.0/out/Release/.deps//pkg/src/node-v6.11.0/out/Release/obj.target/v8_base/deps/v8/src/cached-powers.o.d.raw -D_FORTIFY_SOURCE=2 -march=x86-64 -mtune=generic -O2 -pipe -fstack-protector-strong -c -o /pkg/src/node-v6.11.0/out/Release/obj.target/v8_base/deps/v8/src/cached-powers.o ../deps/v8/src/cached-powers.cc
267  [06/09/2017 11:13PM]:   g++ -DV8_TARGET_ARCH_X64 -DENABLE_DISASSEMBLER -DV8_I18N_SUPPORT -DV8_IMMINENT_DEPRECATION_WARNINGS -DICU_UTIL_DATA_IMPL=ICU_UTIL_DATA_STATIC -I../deps/v8 -I../deps  -pthread -Wall -Wextra -Wno-unused-parameter -m64 -fno-strict-aliasing -m64 -fdata-sections -ffunction-sections -O3 -O3 -fno-omit-frame-pointer -fno-rtti -fno-exceptions -std=gnu++0x -MMD -MF /pkg/src/node-v6.11.0/out/Release/.deps//pkg/src/node-v6.11.0/out/Release/obj.target/v8_base/deps/v8/src/cancelable-task.o.d.raw -D_FORTIFY_SOURCE=2 -march=x86-64 -mtune=generic -O2 -pipe -fstack-protector-strong -c -o /pkg/src/node-v6.11.0/out/Release/obj.target/v8_base/deps/v8/src/cancelable-task.o ../deps/v8/src/cancelable-task.cc
268  [06/09/2017 11:13PM]:                  from ../deps/v8/src/cancelable-task.cc:8:
269  [06/09/2017 11:13PM]:                  from ../deps/v8/src/cancelable-task.h:12,
270  [06/09/2017 11:13PM]:                  from ../deps/v8/src/cancelable-task.cc:5:
271  [06/09/2017 11:13PM]:   g++ -DV8_TARGET_ARCH_X64 -DENABLE_DISASSEMBLER -DV8_I18N_SUPPORT -DV8_IMMINENT_DEPRECATION_WARNINGS -DICU_UTIL_DATA_IMPL=ICU_UTIL_DATA_STATIC -I../deps/v8 -I../deps  -pthread -Wall -Wextra -Wno-unused-parameter -m64 -fno-strict-aliasing -m64 -fdata-sections -ffunction-sections -O3 -O3 -fno-omit-frame-pointer -fno-rtti -fno-exceptions -std=gnu++0x -MMD -MF /pkg/src/node-v6.11.0/out/Release/.deps//pkg/src/node-v6.11.0/out/Release/obj.target/v8_base/deps/v8/src/char-predicates.o.d.raw -D_FORTIFY_SOURCE=2 -march=x86-64 -mtune=generic -O2 -pipe -fstack-protector-strong -c -o /pkg/src/node-v6.11.0/out/Release/obj.target/v8_base/deps/v8/src/char-predicates.o ../deps/v8/src/char-predicates.cc
272  [06/09/2017 11:13PM]:   g++ -DV8_TARGET_ARCH_X64 -DENABLE_DISASSEMBLER -DV8_I18N_SUPPORT -DV8_IMMINENT_DEPRECATION_WARNINGS -DICU_UTIL_DATA_IMPL=ICU_UTIL_DATA_STATIC -I../deps/v8 -I../deps  -pthread -Wall -Wextra -Wno-unused-parameter -m64 -fno-strict-aliasing -m64 -fdata-sections -ffunction-sections -O3 -O3 -fno-omit-frame-pointer -fno-rtti -fno-exceptions -std=gnu++0x -MMD -MF /pkg/src/node-v6.11.0/out/Release/.deps//pkg/src/node-v6.11.0/out/Release/obj.target/v8_base/deps/v8/src/code-factory.o.d.raw -D_FORTIFY_SOURCE=2 -march=x86-64 -mtune=generic -O2 -pipe -fstack-protector-strong -c -o /pkg/src/node-v6.11.0/out/Release/obj.target/v8_base/deps/v8/src/code-factory.o ../deps/v8/src/code-factory.cc
273  [06/09/2017 11:13PM]:                  from ../deps/v8/src/code-factory.h:9,
274  [06/09/2017 11:13PM]:                  from ../deps/v8/src/code-factory.cc:5:
275  [06/09/2017 11:13PM]:                  from ../deps/v8/src/code-factory.h:8,
276  [06/09/2017 11:13PM]:   g++ -DV8_TARGET_ARCH_X64 -DENABLE_DISASSEMBLER -DV8_I18N_SUPPORT -DV8_IMMINENT_DEPRECATION_WARNINGS -DICU_UTIL_DATA_IMPL=ICU_UTIL_DATA_STATIC -I../deps/v8 -I../deps  -pthread -Wall -Wextra -Wno-unused-parameter -m64 -fno-strict-aliasing -m64 -fdata-sections -ffunction-sections -O3 -O3 -fno-omit-frame-pointer -fno-rtti -fno-exceptions -std=gnu++0x -MMD -MF /pkg/src/node-v6.11.0/out/Release/.deps//pkg/src/node-v6.11.0/out/Release/obj.target/v8_base/deps/v8/src/code-stubs.o.d.raw -D_FORTIFY_SOURCE=2 -march=x86-64 -mtune=generic -O2 -pipe -fstack-protector-strong -c -o /pkg/src/node-v6.11.0/out/Release/obj.target/v8_base/deps/v8/src/code-stubs.o ../deps/v8/src/code-stubs.cc
277  [06/09/2017 11:13PM]:                  from ../deps/v8/src/code-stubs.h:9,
278  [06/09/2017 11:13PM]:                  from ../deps/v8/src/code-stubs.cc:5:
279  [06/09/2017 11:13PM]:                  from ../deps/v8/src/code-stubs.h:8,
280  [06/09/2017 11:13PM]:   g++ -DV8_TARGET_ARCH_X64 -DENABLE_DISASSEMBLER -DV8_I18N_SUPPORT -DV8_IMMINENT_DEPRECATION_WARNINGS -DICU_UTIL_DATA_IMPL=ICU_UTIL_DATA_STATIC -I../deps/v8 -I../deps  -pthread -Wall -Wextra -Wno-unused-parameter -m64 -fno-strict-aliasing -m64 -fdata-sections -ffunction-sections -O3 -O3 -fno-omit-frame-pointer -fno-rtti -fno-exceptions -std=gnu++0x -MMD -MF /pkg/src/node-v6.11.0/out/Release/.deps//pkg/src/node-v6.11.0/out/Release/obj.target/v8_base/deps/v8/src/code-stubs-hydrogen.o.d.raw -D_FORTIFY_SOURCE=2 -march=x86-64 -mtune=generic -O2 -pipe -fstack-protector-strong -c -o /pkg/src/node-v6.11.0/out/Release/obj.target/v8_base/deps/v8/src/code-stubs-hydrogen.o ../deps/v8/src/code-stubs-hydrogen.cc
281  [06/09/2017 11:13PM]:                  from ../deps/v8/src/code-stubs-hydrogen.cc:5:
282  [06/09/2017 11:14PM]:   g++ -DV8_TARGET_ARCH_X64 -DENABLE_DISASSEMBLER -DV8_I18N_SUPPORT -DV8_IMMINENT_DEPRECATION_WARNINGS -DICU_UTIL_DATA_IMPL=ICU_UTIL_DATA_STATIC -I../deps/v8 -I../deps  -pthread -Wall -Wextra -Wno-unused-parameter -m64 -fno-strict-aliasing -m64 -fdata-sections -ffunction-sections -O3 -O3 -fno-omit-frame-pointer -fno-rtti -fno-exceptions -std=gnu++0x -MMD -MF /pkg/src/node-v6.11.0/out/Release/.deps//pkg/src/node-v6.11.0/out/Release/obj.target/v8_base/deps/v8/src/codegen.o.d.raw -D_FORTIFY_SOURCE=2 -march=x86-64 -mtune=generic -O2 -pipe -fstack-protector-strong -c -o /pkg/src/node-v6.11.0/out/Release/obj.target/v8_base/deps/v8/src/codegen.o ../deps/v8/src/codegen.cc
283  [06/09/2017 11:14PM]:                  from ../deps/v8/src/codegen.h:8,
284  [06/09/2017 11:14PM]:                  from ../deps/v8/src/codegen.cc:5:
285  [06/09/2017 11:14PM]:   g++ -DV8_TARGET_ARCH_X64 -DENABLE_DISASSEMBLER -DV8_I18N_SUPPORT -DV8_IMMINENT_DEPRECATION_WARNINGS -DICU_UTIL_DATA_IMPL=ICU_UTIL_DATA_STATIC -I../deps/v8 -I../deps  -pthread -Wall -Wextra -Wno-unused-parameter -m64 -fno-strict-aliasing -m64 -fdata-sections -ffunction-sections -O3 -O3 -fno-omit-frame-pointer -fno-rtti -fno-exceptions -std=gnu++0x -MMD -MF /pkg/src/node-v6.11.0/out/Release/.deps//pkg/src/node-v6.11.0/out/Release/obj.target/v8_base/deps/v8/src/compilation-cache.o.d.raw -D_FORTIFY_SOURCE=2 -march=x86-64 -mtune=generic -O2 -pipe -fstack-protector-strong -c -o /pkg/src/node-v6.11.0/out/Release/obj.target/v8_base/deps/v8/src/compilation-cache.o ../deps/v8/src/compilation-cache.cc
286  [06/09/2017 11:14PM]: In file included from ../deps/v8/src/compilation-cache.h:10:0,
287  [06/09/2017 11:14PM]:                  from ../deps/v8/src/compilation-cache.cc:5:
288  [06/09/2017 11:14PM]:                  from ../deps/v8/src/compilation-cache.h:8,
289  [06/09/2017 11:14PM]:   g++ -DV8_TARGET_ARCH_X64 -DENABLE_DISASSEMBLER -DV8_I18N_SUPPORT -DV8_IMMINENT_DEPRECATION_WARNINGS -DICU_UTIL_DATA_IMPL=ICU_UTIL_DATA_STATIC -I../deps/v8 -I../deps  -pthread -Wall -Wextra -Wno-unused-parameter -m64 -fno-strict-aliasing -m64 -fdata-sections -ffunction-sections -O3 -O3 -fno-omit-frame-pointer -fno-rtti -fno-exceptions -std=gnu++0x -MMD -MF /pkg/src/node-v6.11.0/out/Release/.deps//pkg/src/node-v6.11.0/out/Release/obj.target/v8_base/deps/v8/src/compilation-dependencies.o.d.raw -D_FORTIFY_SOURCE=2 -march=x86-64 -mtune=generic -O2 -pipe -fstack-protector-strong -c -o /pkg/src/node-v6.11.0/out/Release/obj.target/v8_base/deps/v8/src/compilation-dependencies.o ../deps/v8/src/compilation-dependencies.cc
290  [06/09/2017 11:14PM]: In file included from ../deps/v8/src/compilation-dependencies.h:9:0,
291  [06/09/2017 11:14PM]:                  from ../deps/v8/src/compilation-dependencies.cc:5:
292  [06/09/2017 11:14PM]:                  from ../deps/v8/src/compilation-dependencies.h:8,
293  [06/09/2017 11:14PM]:   g++ -DV8_TARGET_ARCH_X64 -DENABLE_DISASSEMBLER -DV8_I18N_SUPPORT -DV8_IMMINENT_DEPRECATION_WARNINGS -DICU_UTIL_DATA_IMPL=ICU_UTIL_DATA_STATIC -I../deps/v8 -I../deps  -pthread -Wall -Wextra -Wno-unused-parameter -m64 -fno-strict-aliasing -m64 -fdata-sections -ffunction-sections -O3 -O3 -fno-omit-frame-pointer -fno-rtti -fno-exceptions -std=gnu++0x -MMD -MF /pkg/src/node-v6.11.0/out/Release/.deps//pkg/src/node-v6.11.0/out/Release/obj.target/v8_base/deps/v8/src/compilation-statistics.o.d.raw -D_FORTIFY_SOURCE=2 -march=x86-64 -mtune=generic -O2 -pipe -fstack-protector-strong -c -o /pkg/src/node-v6.11.0/out/Release/obj.target/v8_base/deps/v8/src/compilation-statistics.o ../deps/v8/src/compilation-statistics.cc
294  [06/09/2017 11:14PM]:   g++ -DV8_TARGET_ARCH_X64 -DENABLE_DISASSEMBLER -DV8_I18N_SUPPORT -DV8_IMMINENT_DEPRECATION_WARNINGS -DICU_UTIL_DATA_IMPL=ICU_UTIL_DATA_STATIC -I../deps/v8 -I../deps  -pthread -Wall -Wextra -Wno-unused-parameter -m64 -fno-strict-aliasing -m64 -fdata-sections -ffunction-sections -O3 -O3 -fno-omit-frame-pointer -fno-rtti -fno-exceptions -std=gnu++0x -MMD -MF /pkg/src/node-v6.11.0/out/Release/.deps//pkg/src/node-v6.11.0/out/Release/obj.target/v8_base/deps/v8/src/compiler/access-builder.o.d.raw -D_FORTIFY_SOURCE=2 -march=x86-64 -mtune=generic -O2 -pipe -fstack-protector-strong -c -o /pkg/src/node-v6.11.0/out/Release/obj.target/v8_base/deps/v8/src/compiler/access-builder.o ../deps/v8/src/compiler/access-builder.cc
295  [06/09/2017 11:14PM]: In file included from ../deps/v8/src/compiler/simplified-operator.h:12:0,
296  [06/09/2017 11:14PM]:                  from ../deps/v8/src/compiler/access-builder.h:8,
297  [06/09/2017 11:14PM]:                  from ../deps/v8/src/compiler/access-builder.cc:5:
298  [06/09/2017 11:14PM]:                  from ../deps/v8/src/compiler/simplified-operator.h:10,
299  [06/09/2017 11:14PM]:   g++ -DV8_TARGET_ARCH_X64 -DENABLE_DISASSEMBLER -DV8_I18N_SUPPORT -DV8_IMMINENT_DEPRECATION_WARNINGS -DICU_UTIL_DATA_IMPL=ICU_UTIL_DATA_STATIC -I../deps/v8 -I../deps  -pthread -Wall -Wextra -Wno-unused-parameter -m64 -fno-strict-aliasing -m64 -fdata-sections -ffunction-sections -O3 -O3 -fno-omit-frame-pointer -fno-rtti -fno-exceptions -std=gnu++0x -MMD -MF /pkg/src/node-v6.11.0/out/Release/.deps//pkg/src/node-v6.11.0/out/Release/obj.target/v8_base/deps/v8/src/compiler/access-info.o.d.raw -D_FORTIFY_SOURCE=2 -march=x86-64 -mtune=generic -O2 -pipe -fstack-protector-strong -c -o /pkg/src/node-v6.11.0/out/Release/obj.target/v8_base/deps/v8/src/compiler/access-info.o ../deps/v8/src/compiler/access-info.cc
300  [06/09/2017 11:14PM]:                  from ../deps/v8/src/compiler/access-info.cc:8:
301  [06/09/2017 11:14PM]:                  from ../deps/v8/src/compiler/access-info.cc:7:
302  [06/09/2017 11:14PM]:   g++ -DV8_TARGET_ARCH_X64 -DENABLE_DISASSEMBLER -DV8_I18N_SUPPORT -DV8_IMMINENT_DEPRECATION_WARNINGS -DICU_UTIL_DATA_IMPL=ICU_UTIL_DATA_STATIC -I../deps/v8 -I../deps  -pthread -Wall -Wextra -Wno-unused-parameter -m64 -fno-strict-aliasing -m64 -fdata-sections -ffunction-sections -O3 -O3 -fno-omit-frame-pointer -fno-rtti -fno-exceptions -std=gnu++0x -MMD -MF /pkg/src/node-v6.11.0/out/Release/.deps//pkg/src/node-v6.11.0/out/Release/obj.target/v8_base/deps/v8/src/compiler/all-nodes.o.d.raw -D_FORTIFY_SOURCE=2 -march=x86-64 -mtune=generic -O2 -pipe -fstack-protector-strong -c -o /pkg/src/node-v6.11.0/out/Release/obj.target/v8_base/deps/v8/src/compiler/all-nodes.o ../deps/v8/src/compiler/all-nodes.cc
303  [06/09/2017 11:14PM]: In file included from ../deps/v8/src/types.h:10:0,
304  [06/09/2017 11:14PM]:                  from ../deps/v8/src/compiler/node.h:10,
305  [06/09/2017 11:14PM]:                  from ../deps/v8/src/compiler/all-nodes.h:8,
306  [06/09/2017 11:14PM]:                  from ../deps/v8/src/compiler/all-nodes.cc:5:
307  [06/09/2017 11:14PM]:                  from ../deps/v8/src/compiler/operator.h:12,
308  [06/09/2017 11:14PM]:                  from ../deps/v8/src/compiler/node.h:9,
309  [06/09/2017 11:14PM]:   g++ -DV8_TARGET_ARCH_X64 -DENABLE_DISASSEMBLER -DV8_I18N_SUPPORT -DV8_IMMINENT_DEPRECATION_WARNINGS -DICU_UTIL_DATA_IMPL=ICU_UTIL_DATA_STATIC -I../deps/v8 -I../deps  -pthread -Wall -Wextra -Wno-unused-parameter -m64 -fno-strict-aliasing -m64 -fdata-sections -ffunction-sections -O3 -O3 -fno-omit-frame-pointer -fno-rtti -fno-exceptions -std=gnu++0x -MMD -MF /pkg/src/node-v6.11.0/out/Release/.deps//pkg/src/node-v6.11.0/out/Release/obj.target/v8_base/deps/v8/src/compiler/ast-graph-builder.o.d.raw -D_FORTIFY_SOURCE=2 -march=x86-64 -mtune=generic -O2 -pipe -fstack-protector-strong -c -o /pkg/src/node-v6.11.0/out/Release/obj.target/v8_base/deps/v8/src/compiler/ast-graph-builder.o ../deps/v8/src/compiler/ast-graph-builder.cc
310  [06/09/2017 11:14PM]:                  from ../deps/v8/src/compiler/ast-graph-builder.h:8,
311  [06/09/2017 11:14PM]:                  from ../deps/v8/src/compiler/ast-graph-builder.cc:5:
312  [06/09/2017 11:14PM]:   g++ -DV8_TARGET_ARCH_X64 -DENABLE_DISASSEMBLER -DV8_I18N_SUPPORT -DV8_IMMINENT_DEPRECATION_WARNINGS -DICU_UTIL_DATA_IMPL=ICU_UTIL_DATA_STATIC -I../deps/v8 -I../deps  -pthread -Wall -Wextra -Wno-unused-parameter -m64 -fno-strict-aliasing -m64 -fdata-sections -ffunction-sections -O3 -O3 -fno-omit-frame-pointer -fno-rtti -fno-exceptions -std=gnu++0x -MMD -MF /pkg/src/node-v6.11.0/out/Release/.deps//pkg/src/node-v6.11.0/out/Release/obj.target/v8_base/deps/v8/src/compiler/ast-loop-assignment-analyzer.o.d.raw -D_FORTIFY_SOURCE=2 -march=x86-64 -mtune=generic -O2 -pipe -fstack-protector-strong -c -o /pkg/src/node-v6.11.0/out/Release/obj.target/v8_base/deps/v8/src/compiler/ast-loop-assignment-analyzer.o ../deps/v8/src/compiler/ast-loop-assignment-analyzer.cc
313  [06/09/2017 11:14PM]:                  from ../deps/v8/src/compiler/ast-loop-assignment-analyzer.h:8,
314  [06/09/2017 11:14PM]:                  from ../deps/v8/src/compiler/ast-loop-assignment-analyzer.cc:5:
315  [06/09/2017 11:14PM]:   g++ -DV8_TARGET_ARCH_X64 -DENABLE_DISASSEMBLER -DV8_I18N_SUPPORT -DV8_IMMINENT_DEPRECATION_WARNINGS -DICU_UTIL_DATA_IMPL=ICU_UTIL_DATA_STATIC -I../deps/v8 -I../deps  -pthread -Wall -Wextra -Wno-unused-parameter -m64 -fno-strict-aliasing -m64 -fdata-sections -ffunction-sections -O3 -O3 -fno-omit-frame-pointer -fno-rtti -fno-exceptions -std=gnu++0x -MMD -MF /pkg/src/node-v6.11.0/out/Release/.deps//pkg/src/node-v6.11.0/out/Release/obj.target/v8_base/deps/v8/src/compiler/basic-block-instrumentor.o.d.raw -D_FORTIFY_SOURCE=2 -march=x86-64 -mtune=generic -O2 -pipe -fstack-protector-strong -c -o /pkg/src/node-v6.11.0/out/Release/obj.target/v8_base/deps/v8/src/compiler/basic-block-instrumentor.o ../deps/v8/src/compiler/basic-block-instrumentor.cc
316  [06/09/2017 11:14PM]:                  from ../deps/v8/src/compiler/basic-block-instrumentor.cc:9:
317  [06/09/2017 11:14PM]:                  from ../deps/v8/src/compiler/basic-block-instrumentor.h:8,
318  [06/09/2017 11:14PM]:                  from ../deps/v8/src/compiler/basic-block-instrumentor.cc:5:
319  [06/09/2017 11:14PM]:   g++ -DV8_TARGET_ARCH_X64 -DENABLE_DISASSEMBLER -DV8_I18N_SUPPORT -DV8_IMMINENT_DEPRECATION_WARNINGS -DICU_UTIL_DATA_IMPL=ICU_UTIL_DATA_STATIC -I../deps/v8 -I../deps  -pthread -Wall -Wextra -Wno-unused-parameter -m64 -fno-strict-aliasing -m64 -fdata-sections -ffunction-sections -O3 -O3 -fno-omit-frame-pointer -fno-rtti -fno-exceptions -std=gnu++0x -MMD -MF /pkg/src/node-v6.11.0/out/Release/.deps//pkg/src/node-v6.11.0/out/Release/obj.target/v8_base/deps/v8/src/compiler/branch-elimination.o.d.raw -D_FORTIFY_SOURCE=2 -march=x86-64 -mtune=generic -O2 -pipe -fstack-protector-strong -c -o /pkg/src/node-v6.11.0/out/Release/obj.target/v8_base/deps/v8/src/compiler/branch-elimination.o ../deps/v8/src/compiler/branch-elimination.cc
320  [06/09/2017 11:14PM]:                  from ../deps/v8/src/compiler/node-marker.h:8,
321  [06/09/2017 11:14PM]:                  from ../deps/v8/src/compiler/graph-reducer.h:8,
322  [06/09/2017 11:14PM]:                  from ../deps/v8/src/compiler/branch-elimination.h:8,
323  [06/09/2017 11:14PM]:                  from ../deps/v8/src/compiler/branch-elimination.cc:5:
324  [06/09/2017 11:14PM]:   g++ -DV8_TARGET_ARCH_X64 -DENABLE_DISASSEMBLER -DV8_I18N_SUPPORT -DV8_IMMINENT_DEPRECATION_WARNINGS -DICU_UTIL_DATA_IMPL=ICU_UTIL_DATA_STATIC -I../deps/v8 -I../deps  -pthread -Wall -Wextra -Wno-unused-parameter -m64 -fno-strict-aliasing -m64 -fdata-sections -ffunction-sections -O3 -O3 -fno-omit-frame-pointer -fno-rtti -fno-exceptions -std=gnu++0x -MMD -MF /pkg/src/node-v6.11.0/out/Release/.deps//pkg/src/node-v6.11.0/out/Release/obj.target/v8_base/deps/v8/src/compiler/bytecode-branch-analysis.o.d.raw -D_FORTIFY_SOURCE=2 -march=x86-64 -mtune=generic -O2 -pipe -fstack-protector-strong -c -o /pkg/src/node-v6.11.0/out/Release/obj.target/v8_base/deps/v8/src/compiler/bytecode-branch-analysis.o ../deps/v8/src/compiler/bytecode-branch-analysis.cc
325  [06/09/2017 11:14PM]: In file included from ../deps/v8/src/interpreter/bytecode-array-iterator.h:10:0,
326  [06/09/2017 11:14PM]:                  from ../deps/v8/src/compiler/bytecode-branch-analysis.cc:7:
327  [06/09/2017 11:14PM]:                  from ../deps/v8/src/bit-vector.h:8,
328  [06/09/2017 11:14PM]:                  from ../deps/v8/src/compiler/bytecode-branch-analysis.h:8,
329  [06/09/2017 11:14PM]:                  from ../deps/v8/src/compiler/bytecode-branch-analysis.cc:5:
330  [06/09/2017 11:14PM]:   g++ -DV8_TARGET_ARCH_X64 -DENABLE_DISASSEMBLER -DV8_I18N_SUPPORT -DV8_IMMINENT_DEPRECATION_WARNINGS -DICU_UTIL_DATA_IMPL=ICU_UTIL_DATA_STATIC -I../deps/v8 -I../deps  -pthread -Wall -Wextra -Wno-unused-parameter -m64 -fno-strict-aliasing -m64 -fdata-sections -ffunction-sections -O3 -O3 -fno-omit-frame-pointer -fno-rtti -fno-exceptions -std=gnu++0x -MMD -MF /pkg/src/node-v6.11.0/out/Release/.deps//pkg/src/node-v6.11.0/out/Release/obj.target/v8_base/deps/v8/src/compiler/bytecode-graph-builder.o.d.raw -D_FORTIFY_SOURCE=2 -march=x86-64 -mtune=generic -O2 -pipe -fstack-protector-strong -c -o /pkg/src/node-v6.11.0/out/Release/obj.target/v8_base/deps/v8/src/compiler/bytecode-graph-builder.o ../deps/v8/src/compiler/bytecode-graph-builder.cc
331  [06/09/2017 11:14PM]:                  from ../deps/v8/src/compiler/bytecode-graph-builder.h:8,
332  [06/09/2017 11:14PM]:                  from ../deps/v8/src/compiler/bytecode-graph-builder.cc:5:
333  [06/09/2017 11:14PM]:   g++ -DV8_TARGET_ARCH_X64 -DENABLE_DISASSEMBLER -DV8_I18N_SUPPORT -DV8_IMMINENT_DEPRECATION_WARNINGS -DICU_UTIL_DATA_IMPL=ICU_UTIL_DATA_STATIC -I../deps/v8 -I../deps  -pthread -Wall -Wextra -Wno-unused-parameter -m64 -fno-strict-aliasing -m64 -fdata-sections -ffunction-sections -O3 -O3 -fno-omit-frame-pointer -fno-rtti -fno-exceptions -std=gnu++0x -MMD -MF /pkg/src/node-v6.11.0/out/Release/.deps//pkg/src/node-v6.11.0/out/Release/obj.target/v8_base/deps/v8/src/compiler/change-lowering.o.d.raw -D_FORTIFY_SOURCE=2 -march=x86-64 -mtune=generic -O2 -pipe -fstack-protector-strong -c -o /pkg/src/node-v6.11.0/out/Release/obj.target/v8_base/deps/v8/src/compiler/change-lowering.o ../deps/v8/src/compiler/change-lowering.cc
334  [06/09/2017 11:14PM]:                  from ../deps/v8/src/compiler/change-lowering.h:8,
335  [06/09/2017 11:14PM]:                  from ../deps/v8/src/compiler/change-lowering.cc:5:
336  [06/09/2017 11:14PM]:   g++ -DV8_TARGET_ARCH_X64 -DENABLE_DISASSEMBLER -DV8_I18N_SUPPORT -DV8_IMMINENT_DEPRECATION_WARNINGS -DICU_UTIL_DATA_IMPL=ICU_UTIL_DATA_STATIC -I../deps/v8 -I../deps  -pthread -Wall -Wextra -Wno-unused-parameter -m64 -fno-strict-aliasing -m64 -fdata-sections -ffunction-sections -O3 -O3 -fno-omit-frame-pointer -fno-rtti -fno-exceptions -std=gnu++0x -MMD -MF /pkg/src/node-v6.11.0/out/Release/.deps//pkg/src/node-v6.11.0/out/Release/obj.target/v8_base/deps/v8/src/compiler/c-linkage.o.d.raw -D_FORTIFY_SOURCE=2 -march=x86-64 -mtune=generic -O2 -pipe -fstack-protector-strong -c -o /pkg/src/node-v6.11.0/out/Release/obj.target/v8_base/deps/v8/src/compiler/c-linkage.o ../deps/v8/src/compiler/c-linkage.cc
337  [06/09/2017 11:14PM]:                  from ../deps/v8/src/compiler/c-linkage.cc:5:
338  [06/09/2017 11:14PM]:   g++ -DV8_TARGET_ARCH_X64 -DENABLE_DISASSEMBLER -DV8_I18N_SUPPORT -DV8_IMMINENT_DEPRECATION_WARNINGS -DICU_UTIL_DATA_IMPL=ICU_UTIL_DATA_STATIC -I../deps/v8 -I../deps  -pthread -Wall -Wextra -Wno-unused-parameter -m64 -fno-strict-aliasing -m64 -fdata-sections -ffunction-sections -O3 -O3 -fno-omit-frame-pointer -fno-rtti -fno-exceptions -std=gnu++0x -MMD -MF /pkg/src/node-v6.11.0/out/Release/.deps//pkg/src/node-v6.11.0/out/Release/obj.target/v8_base/deps/v8/src/compiler/coalesced-live-ranges.o.d.raw -D_FORTIFY_SOURCE=2 -march=x86-64 -mtune=generic -O2 -pipe -fstack-protector-strong -c -o /pkg/src/node-v6.11.0/out/Release/obj.target/v8_base/deps/v8/src/compiler/coalesced-live-ranges.o ../deps/v8/src/compiler/coalesced-live-ranges.cc
339  [06/09/2017 11:14PM]:                  from ../deps/v8/src/safepoint-table.h:9,
340  [06/09/2017 11:14PM]:                  from ../deps/v8/src/frames.h:10,
341  [06/09/2017 11:14PM]:                  from ../deps/v8/src/compiler/frame.h:9,
342  [06/09/2017 11:14PM]:                  from ../deps/v8/src/compiler/instruction.h:14,
343  [06/09/2017 11:14PM]:                  from ../deps/v8/src/compiler/register-allocator.h:8,
344  [06/09/2017 11:14PM]:                  from ../deps/v8/src/compiler/coalesced-live-ranges.h:8,
345  [06/09/2017 11:14PM]:                  from ../deps/v8/src/compiler/coalesced-live-ranges.cc:5:
346  [06/09/2017 11:14PM]:                  from ../deps/v8/src/compiler/frame-states.h:8,
347  [06/09/2017 11:14PM]:                  from ../deps/v8/src/compiler/common-operator.h:8,
348  [06/09/2017 11:14PM]:                  from ../deps/v8/src/compiler/instruction.h:13,
349  [06/09/2017 11:14PM]:   g++ -DV8_TARGET_ARCH_X64 -DENABLE_DISASSEMBLER -DV8_I18N_SUPPORT -DV8_IMMINENT_DEPRECATION_WARNINGS -DICU_UTIL_DATA_IMPL=ICU_UTIL_DATA_STATIC -I../deps/v8 -I../deps  -pthread -Wall -Wextra -Wno-unused-parameter -m64 -fno-strict-aliasing -m64 -fdata-sections -ffunction-sections -O3 -O3 -fno-omit-frame-pointer -fno-rtti -fno-exceptions -std=gnu++0x -MMD -MF /pkg/src/node-v6.11.0/out/Release/.deps//pkg/src/node-v6.11.0/out/Release/obj.target/v8_base/deps/v8/src/compiler/code-generator.o.d.raw -D_FORTIFY_SOURCE=2 -march=x86-64 -mtune=generic -O2 -pipe -fstack-protector-strong -c -o /pkg/src/node-v6.11.0/out/Release/obj.target/v8_base/deps/v8/src/compiler/code-generator.o ../deps/v8/src/compiler/code-generator.cc
350  [06/09/2017 11:14PM]:                  from ../deps/v8/src/compiler/gap-resolver.h:8,
351  [06/09/2017 11:14PM]:                  from ../deps/v8/src/compiler/code-generator.h:8,
352  [06/09/2017 11:14PM]:                  from ../deps/v8/src/compiler/code-generator.cc:5:
353  [06/09/2017 11:14PM]:   g++ -DV8_TARGET_ARCH_X64 -DENABLE_DISASSEMBLER -DV8_I18N_SUPPORT -DV8_IMMINENT_DEPRECATION_WARNINGS -DICU_UTIL_DATA_IMPL=ICU_UTIL_DATA_STATIC -I../deps/v8 -I../deps  -pthread -Wall -Wextra -Wno-unused-parameter -m64 -fno-strict-aliasing -m64 -fdata-sections -ffunction-sections -O3 -O3 -fno-omit-frame-pointer -fno-rtti -fno-exceptions -std=gnu++0x -MMD -MF /pkg/src/node-v6.11.0/out/Release/.deps//pkg/src/node-v6.11.0/out/Release/obj.target/v8_base/deps/v8/src/compiler/code-stub-assembler.o.d.raw -D_FORTIFY_SOURCE=2 -march=x86-64 -mtune=generic -O2 -pipe -fstack-protector-strong -c -o /pkg/src/node-v6.11.0/out/Release/obj.target/v8_base/deps/v8/src/compiler/code-stub-assembler.o ../deps/v8/src/compiler/code-stub-assembler.cc
354  [06/09/2017 11:14PM]:                  from ../deps/v8/src/compiler/code-stub-assembler.h:14,
355  [06/09/2017 11:14PM]:                  from ../deps/v8/src/compiler/code-stub-assembler.cc:5:
356  [06/09/2017 11:14PM]:                  from ../deps/v8/src/compiler/code-stub-assembler.h:12,
357  [06/09/2017 11:14PM]:   g++ -DV8_TARGET_ARCH_X64 -DENABLE_DISASSEMBLER -DV8_I18N_SUPPORT -DV8_IMMINENT_DEPRECATION_WARNINGS -DICU_UTIL_DATA_IMPL=ICU_UTIL_DATA_STATIC -I../deps/v8 -I../deps  -pthread -Wall -Wextra -Wno-unused-parameter -m64 -fno-strict-aliasing -m64 -fdata-sections -ffunction-sections -O3 -O3 -fno-omit-frame-pointer -fno-rtti -fno-exceptions -std=gnu++0x -MMD -MF /pkg/src/node-v6.11.0/out/Release/.deps//pkg/src/node-v6.11.0/out/Release/obj.target/v8_base/deps/v8/src/compiler/common-node-cache.o.d.raw -D_FORTIFY_SOURCE=2 -march=x86-64 -mtune=generic -O2 -pipe -fstack-protector-strong -c -o /pkg/src/node-v6.11.0/out/Release/obj.target/v8_base/deps/v8/src/compiler/common-node-cache.o ../deps/v8/src/compiler/common-node-cache.cc
358  [06/09/2017 11:14PM]:                  from ../deps/v8/src/compiler/common-node-cache.cc:7:
359  [06/09/2017 11:14PM]:   g++ -DV8_TARGET_ARCH_X64 -DENABLE_DISASSEMBLER -DV8_I18N_SUPPORT -DV8_IMMINENT_DEPRECATION_WARNINGS -DICU_UTIL_DATA_IMPL=ICU_UTIL_DATA_STATIC -I../deps/v8 -I../deps  -pthread -Wall -Wextra -Wno-unused-parameter -m64 -fno-strict-aliasing -m64 -fdata-sections -ffunction-sections -O3 -O3 -fno-omit-frame-pointer -fno-rtti -fno-exceptions -std=gnu++0x -MMD -MF /pkg/src/node-v6.11.0/out/Release/.deps//pkg/src/node-v6.11.0/out/Release/obj.target/v8_base/deps/v8/src/compiler/common-operator-reducer.o.d.raw -D_FORTIFY_SOURCE=2 -march=x86-64 -mtune=generic -O2 -pipe -fstack-protector-strong -c -o /pkg/src/node-v6.11.0/out/Release/obj.target/v8_base/deps/v8/src/compiler/common-operator-reducer.o ../deps/v8/src/compiler/common-operator-reducer.cc
360  [06/09/2017 11:14PM]:                  from ../deps/v8/src/compiler/common-operator-reducer.h:8,
361  [06/09/2017 11:14PM]:                  from ../deps/v8/src/compiler/common-operator-reducer.cc:5:
362  [06/09/2017 11:14PM]:   g++ -DV8_TARGET_ARCH_X64 -DENABLE_DISASSEMBLER -DV8_I18N_SUPPORT -DV8_IMMINENT_DEPRECATION_WARNINGS -DICU_UTIL_DATA_IMPL=ICU_UTIL_DATA_STATIC -I../deps/v8 -I../deps  -pthread -Wall -Wextra -Wno-unused-parameter -m64 -fno-strict-aliasing -m64 -fdata-sections -ffunction-sections -O3 -O3 -fno-omit-frame-pointer -fno-rtti -fno-exceptions -std=gnu++0x -MMD -MF /pkg/src/node-v6.11.0/out/Release/.deps//pkg/src/node-v6.11.0/out/Release/obj.target/v8_base/deps/v8/src/compiler/common-operator.o.d.raw -D_FORTIFY_SOURCE=2 -march=x86-64 -mtune=generic -O2 -pipe -fstack-protector-strong -c -o /pkg/src/node-v6.11.0/out/Release/obj.target/v8_base/deps/v8/src/compiler/common-operator.o ../deps/v8/src/compiler/common-operator.cc
363  [06/09/2017 11:14PM]:                  from ../deps/v8/src/compiler/common-operator.cc:7:
364  [06/09/2017 11:14PM]:                  from ../deps/v8/src/compiler/common-operator.cc:5:
365  [06/09/2017 11:15PM]:   g++ -DV8_TARGET_ARCH_X64 -DENABLE_DISASSEMBLER -DV8_I18N_SUPPORT -DV8_IMMINENT_DEPRECATION_WARNINGS -DICU_UTIL_DATA_IMPL=ICU_UTIL_DATA_STATIC -I../deps/v8 -I../deps  -pthread -Wall -Wextra -Wno-unused-parameter -m64 -fno-strict-aliasing -m64 -fdata-sections -ffunction-sections -O3 -O3 -fno-omit-frame-pointer -fno-rtti -fno-exceptions -std=gnu++0x -MMD -MF /pkg/src/node-v6.11.0/out/Release/.deps//pkg/src/node-v6.11.0/out/Release/obj.target/v8_base/deps/v8/src/compiler/control-builders.o.d.raw -D_FORTIFY_SOURCE=2 -march=x86-64 -mtune=generic -O2 -pipe -fstack-protector-strong -c -o /pkg/src/node-v6.11.0/out/Release/obj.target/v8_base/deps/v8/src/compiler/control-builders.o ../deps/v8/src/compiler/control-builders.cc
366  [06/09/2017 11:15PM]:                  from ../deps/v8/src/compiler/control-builders.h:8,
367  [06/09/2017 11:15PM]:                  from ../deps/v8/src/compiler/control-builders.cc:5:
368  [06/09/2017 11:15PM]:   g++ -DV8_TARGET_ARCH_X64 -DENABLE_DISASSEMBLER -DV8_I18N_SUPPORT -DV8_IMMINENT_DEPRECATION_WARNINGS -DICU_UTIL_DATA_IMPL=ICU_UTIL_DATA_STATIC -I../deps/v8 -I../deps  -pthread -Wall -Wextra -Wno-unused-parameter -m64 -fno-strict-aliasing -m64 -fdata-sections -ffunction-sections -O3 -O3 -fno-omit-frame-pointer -fno-rtti -fno-exceptions -std=gnu++0x -MMD -MF /pkg/src/node-v6.11.0/out/Release/.deps//pkg/src/node-v6.11.0/out/Release/obj.target/v8_base/deps/v8/src/compiler/control-equivalence.o.d.raw -D_FORTIFY_SOURCE=2 -march=x86-64 -mtune=generic -O2 -pipe -fstack-protector-strong -c -o /pkg/src/node-v6.11.0/out/Release/obj.target/v8_base/deps/v8/src/compiler/control-equivalence.o ../deps/v8/src/compiler/control-equivalence.cc
369  [06/09/2017 11:15PM]:                  from ../deps/v8/src/compiler/control-equivalence.h:9,
370  [06/09/2017 11:15PM]:                  from ../deps/v8/src/compiler/control-equivalence.cc:5:
371  [06/09/2017 11:15PM]:                  from ../deps/v8/src/compiler/graph.h:8,
372  [06/09/2017 11:15PM]:                  from ../deps/v8/src/compiler/control-equivalence.h:8,
373  [06/09/2017 11:15PM]:   g++ -DV8_TARGET_ARCH_X64 -DENABLE_DISASSEMBLER -DV8_I18N_SUPPORT -DV8_IMMINENT_DEPRECATION_WARNINGS -DICU_UTIL_DATA_IMPL=ICU_UTIL_DATA_STATIC -I../deps/v8 -I../deps  -pthread -Wall -Wextra -Wno-unused-parameter -m64 -fno-strict-aliasing -m64 -fdata-sections -ffunction-sections -O3 -O3 -fno-omit-frame-pointer -fno-rtti -fno-exceptions -std=gnu++0x -MMD -MF /pkg/src/node-v6.11.0/out/Release/.deps//pkg/src/node-v6.11.0/out/Release/obj.target/v8_base/deps/v8/src/compiler/control-flow-optimizer.o.d.raw -D_FORTIFY_SOURCE=2 -march=x86-64 -mtune=generic -O2 -pipe -fstack-protector-strong -c -o /pkg/src/node-v6.11.0/out/Release/obj.target/v8_base/deps/v8/src/compiler/control-flow-optimizer.o ../deps/v8/src/compiler/control-flow-optimizer.cc
374  [06/09/2017 11:15PM]:                  from ../deps/v8/src/compiler/control-flow-optimizer.h:8,
375  [06/09/2017 11:15PM]:                  from ../deps/v8/src/compiler/control-flow-optimizer.cc:5:
376  [06/09/2017 11:15PM]:   g++ -DV8_TARGET_ARCH_X64 -DENABLE_DISASSEMBLER -DV8_I18N_SUPPORT -DV8_IMMINENT_DEPRECATION_WARNINGS -DICU_UTIL_DATA_IMPL=ICU_UTIL_DATA_STATIC -I../deps/v8 -I../deps  -pthread -Wall -Wextra -Wno-unused-parameter -m64 -fno-strict-aliasing -m64 -fdata-sections -ffunction-sections -O3 -O3 -fno-omit-frame-pointer -fno-rtti -fno-exceptions -std=gnu++0x -MMD -MF /pkg/src/node-v6.11.0/out/Release/.deps//pkg/src/node-v6.11.0/out/Release/obj.target/v8_base/deps/v8/src/compiler/dead-code-elimination.o.d.raw -D_FORTIFY_SOURCE=2 -march=x86-64 -mtune=generic -O2 -pipe -fstack-protector-strong -c -o /pkg/src/node-v6.11.0/out/Release/obj.target/v8_base/deps/v8/src/compiler/dead-code-elimination.o ../deps/v8/src/compiler/dead-code-elimination.cc
377  [06/09/2017 11:15PM]:                  from ../deps/v8/src/compiler/dead-code-elimination.h:8,
378  [06/09/2017 11:15PM]:                  from ../deps/v8/src/compiler/dead-code-elimination.cc:5:
379  [06/09/2017 11:15PM]:   g++ -DV8_TARGET_ARCH_X64 -DENABLE_DISASSEMBLER -DV8_I18N_SUPPORT -DV8_IMMINENT_DEPRECATION_WARNINGS -DICU_UTIL_DATA_IMPL=ICU_UTIL_DATA_STATIC -I../deps/v8 -I../deps  -pthread -Wall -Wextra -Wno-unused-parameter -m64 -fno-strict-aliasing -m64 -fdata-sections -ffunction-sections -O3 -O3 -fno-omit-frame-pointer -fno-rtti -fno-exceptions -std=gnu++0x -MMD -MF /pkg/src/node-v6.11.0/out/Release/.deps//pkg/src/node-v6.11.0/out/Release/obj.target/v8_base/deps/v8/src/compiler/escape-analysis.o.d.raw -D_FORTIFY_SOURCE=2 -march=x86-64 -mtune=generic -O2 -pipe -fstack-protector-strong -c -o /pkg/src/node-v6.11.0/out/Release/obj.target/v8_base/deps/v8/src/compiler/escape-analysis.o ../deps/v8/src/compiler/escape-analysis.cc
380  [06/09/2017 11:15PM]:                  from ../deps/v8/src/compiler/escape-analysis.cc:10:
381  [06/09/2017 11:15PM]:                  from ../deps/v8/src/compiler/escape-analysis.h:9,
382  [06/09/2017 11:15PM]:                  from ../deps/v8/src/compiler/escape-analysis.cc:5:
383  [06/09/2017 11:15PM]: ../deps/v8/src/compiler/escape-analysis.cc: In function bool v8::internal::compiler::{anonymous}::IsEquivalentPhi(v8::internal::compiler::Node*, v8::internal::ZoneVector<v8::internal::compiler::Node*>&):
384  [06/09/2017 11:15PM]: ../deps/v8/src/compiler/escape-analysis.cc:339:36: warning: comparison between signed and unsigned integer expressions [-Wsign-compare]
385  [06/09/2017 11:15PM]:    if (phi->op()->ValueInputCount() != inputs.size()) {
386  [06/09/2017 11:15PM]:        ~~~~~~~~~~~~~~~~~~~~~~~~~~~~~^~~~~~~~~~~~~~~~
387  [06/09/2017 11:15PM]: ../deps/v8/src/compiler/escape-analysis.cc: In member function bool v8::internal::compiler::VirtualObject::MergeFrom(v8::internal::compiler::MergeCache*, v8::internal::compiler::Node*, v8::internal::compiler::Graph*, v8::internal::compiler::CommonOperatorBuilder*):
388  [06/09/2017 11:15PM]: ../deps/v8/src/compiler/escape-analysis.cc:403:34: warning: comparison between signed and unsigned integer expressions [-Wsign-compare]
389  [06/09/2017 11:15PM]:        if (cache->fields().size() == arity) {
390  [06/09/2017 11:15PM]:            ~~~~~~~~~~~~~~~~~~~~~~~^~~~~~~~
391  [06/09/2017 11:15PM]:   g++ -DV8_TARGET_ARCH_X64 -DENABLE_DISASSEMBLER -DV8_I18N_SUPPORT -DV8_IMMINENT_DEPRECATION_WARNINGS -DICU_UTIL_DATA_IMPL=ICU_UTIL_DATA_STATIC -I../deps/v8 -I../deps  -pthread -Wall -Wextra -Wno-unused-parameter -m64 -fno-strict-aliasing -m64 -fdata-sections -ffunction-sections -O3 -O3 -fno-omit-frame-pointer -fno-rtti -fno-exceptions -std=gnu++0x -MMD -MF /pkg/src/node-v6.11.0/out/Release/.deps//pkg/src/node-v6.11.0/out/Release/obj.target/v8_base/deps/v8/src/compiler/escape-analysis-reducer.o.d.raw -D_FORTIFY_SOURCE=2 -march=x86-64 -mtune=generic -O2 -pipe -fstack-protector-strong -c -o /pkg/src/node-v6.11.0/out/Release/obj.target/v8_base/deps/v8/src/compiler/escape-analysis-reducer.o ../deps/v8/src/compiler/escape-analysis-reducer.cc
392  [06/09/2017 11:15PM]:                  from ../deps/v8/src/compiler/escape-analysis-reducer.h:10,
393  [06/09/2017 11:15PM]:                  from ../deps/v8/src/compiler/escape-analysis-reducer.cc:5:
394  [06/09/2017 11:15PM]:                  from ../deps/v8/src/compiler/escape-analysis-reducer.h:8,
395  [06/09/2017 11:15PM]:   g++ -DV8_TARGET_ARCH_X64 -DENABLE_DISASSEMBLER -DV8_I18N_SUPPORT -DV8_IMMINENT_DEPRECATION_WARNINGS -DICU_UTIL_DATA_IMPL=ICU_UTIL_DATA_STATIC -I../deps/v8 -I../deps  -pthread -Wall -Wextra -Wno-unused-parameter -m64 -fno-strict-aliasing -m64 -fdata-sections -ffunction-sections -O3 -O3 -fno-omit-frame-pointer -fno-rtti -fno-exceptions -std=gnu++0x -MMD -MF /pkg/src/node-v6.11.0/out/Release/.deps//pkg/src/node-v6.11.0/out/Release/obj.target/v8_base/deps/v8/src/compiler/frame.o.d.raw -D_FORTIFY_SOURCE=2 -march=x86-64 -mtune=generic -O2 -pipe -fstack-protector-strong -c -o /pkg/src/node-v6.11.0/out/Release/obj.target/v8_base/deps/v8/src/compiler/frame.o ../deps/v8/src/compiler/frame.cc
396  [06/09/2017 11:15PM]:                  from ../deps/v8/src/compiler/frame.cc:5:
397  [06/09/2017 11:15PM]:                  from ../deps/v8/src/compiler/frame.h:8,
398  [06/09/2017 11:15PM]:   g++ -DV8_TARGET_ARCH_X64 -DENABLE_DISASSEMBLER -DV8_I18N_SUPPORT -DV8_IMMINENT_DEPRECATION_WARNINGS -DICU_UTIL_DATA_IMPL=ICU_UTIL_DATA_STATIC -I../deps/v8 -I../deps  -pthread -Wall -Wextra -Wno-unused-parameter -m64 -fno-strict-aliasing -m64 -fdata-sections -ffunction-sections -O3 -O3 -fno-omit-frame-pointer -fno-rtti -fno-exceptions -std=gnu++0x -MMD -MF /pkg/src/node-v6.11.0/out/Release/.deps//pkg/src/node-v6.11.0/out/Release/obj.target/v8_base/deps/v8/src/compiler/frame-elider.o.d.raw -D_FORTIFY_SOURCE=2 -march=x86-64 -mtune=generic -O2 -pipe -fstack-protector-strong -c -o /pkg/src/node-v6.11.0/out/Release/obj.target/v8_base/deps/v8/src/compiler/frame-elider.o ../deps/v8/src/compiler/frame-elider.cc
399  [06/09/2017 11:15PM]:                  from ../deps/v8/src/compiler/frame-elider.h:8,
400  [06/09/2017 11:15PM]:                  from ../deps/v8/src/compiler/frame-elider.cc:6:
401  [06/09/2017 11:15PM]:   g++ -DV8_TARGET_ARCH_X64 -DENABLE_DISASSEMBLER -DV8_I18N_SUPPORT -DV8_IMMINENT_DEPRECATION_WARNINGS -DICU_UTIL_DATA_IMPL=ICU_UTIL_DATA_STATIC -I../deps/v8 -I../deps  -pthread -Wall -Wextra -Wno-unused-parameter -m64 -fno-strict-aliasing -m64 -fdata-sections -ffunction-sections -O3 -O3 -fno-omit-frame-pointer -fno-rtti -fno-exceptions -std=gnu++0x -MMD -MF /pkg/src/node-v6.11.0/out/Release/.deps//pkg/src/node-v6.11.0/out/Release/obj.target/v8_base/deps/v8/src/compiler/frame-states.o.d.raw -D_FORTIFY_SOURCE=2 -march=x86-64 -mtune=generic -O2 -pipe -fstack-protector-strong -c -o /pkg/src/node-v6.11.0/out/Release/obj.target/v8_base/deps/v8/src/compiler/frame-states.o ../deps/v8/src/compiler/frame-states.cc
402  [06/09/2017 11:15PM]:                  from ../deps/v8/src/handles-inl.h:8,
403  [06/09/2017 11:15PM]:                  from ../deps/v8/src/compiler/frame-states.cc:8:
404  [06/09/2017 11:15PM]:                  from ../deps/v8/src/compiler/frame-states.cc:5:
405  [06/09/2017 11:15PM]:   g++ -DV8_TARGET_ARCH_X64 -DENABLE_DISASSEMBLER -DV8_I18N_SUPPORT -DV8_IMMINENT_DEPRECATION_WARNINGS -DICU_UTIL_DATA_IMPL=ICU_UTIL_DATA_STATIC -I../deps/v8 -I../deps  -pthread -Wall -Wextra -Wno-unused-parameter -m64 -fno-strict-aliasing -m64 -fdata-sections -ffunction-sections -O3 -O3 -fno-omit-frame-pointer -fno-rtti -fno-exceptions -std=gnu++0x -MMD -MF /pkg/src/node-v6.11.0/out/Release/.deps//pkg/src/node-v6.11.0/out/Release/obj.target/v8_base/deps/v8/src/compiler/gap-resolver.o.d.raw -D_FORTIFY_SOURCE=2 -march=x86-64 -mtune=generic -O2 -pipe -fstack-protector-strong -c -o /pkg/src/node-v6.11.0/out/Release/obj.target/v8_base/deps/v8/src/compiler/gap-resolver.o ../deps/v8/src/compiler/gap-resolver.cc
406  [06/09/2017 11:15PM]:                  from ../deps/v8/src/compiler/gap-resolver.cc:5:
407  [06/09/2017 11:15PM]:   g++ -DV8_TARGET_ARCH_X64 -DENABLE_DISASSEMBLER -DV8_I18N_SUPPORT -DV8_IMMINENT_DEPRECATION_WARNINGS -DICU_UTIL_DATA_IMPL=ICU_UTIL_DATA_STATIC -I../deps/v8 -I../deps  -pthread -Wall -Wextra -Wno-unused-parameter -m64 -fno-strict-aliasing -m64 -fdata-sections -ffunction-sections -O3 -O3 -fno-omit-frame-pointer -fno-rtti -fno-exceptions -std=gnu++0x -MMD -MF /pkg/src/node-v6.11.0/out/Release/.deps//pkg/src/node-v6.11.0/out/Release/obj.target/v8_base/deps/v8/src/compiler/graph-reducer.o.d.raw -D_FORTIFY_SOURCE=2 -march=x86-64 -mtune=generic -O2 -pipe -fstack-protector-strong -c -o /pkg/src/node-v6.11.0/out/Release/obj.target/v8_base/deps/v8/src/compiler/graph-reducer.o ../deps/v8/src/compiler/graph-reducer.cc
408  [06/09/2017 11:15PM]:                  from ../deps/v8/src/compiler/graph-reducer.cc:9:
409  [06/09/2017 11:15PM]:                  from ../deps/v8/src/compiler/graph-reducer.cc:8:
410  [06/09/2017 11:15PM]:   g++ -DV8_TARGET_ARCH_X64 -DENABLE_DISASSEMBLER -DV8_I18N_SUPPORT -DV8_IMMINENT_DEPRECATION_WARNINGS -DICU_UTIL_DATA_IMPL=ICU_UTIL_DATA_STATIC -I../deps/v8 -I../deps  -pthread -Wall -Wextra -Wno-unused-parameter -m64 -fno-strict-aliasing -m64 -fdata-sections -ffunction-sections -O3 -O3 -fno-omit-frame-pointer -fno-rtti -fno-exceptions -std=gnu++0x -MMD -MF /pkg/src/node-v6.11.0/out/Release/.deps//pkg/src/node-v6.11.0/out/Release/obj.target/v8_base/deps/v8/src/compiler/graph-replay.o.d.raw -D_FORTIFY_SOURCE=2 -march=x86-64 -mtune=generic -O2 -pipe -fstack-protector-strong -c -o /pkg/src/node-v6.11.0/out/Release/obj.target/v8_base/deps/v8/src/compiler/graph-replay.o ../deps/v8/src/compiler/graph-replay.cc
411  [06/09/2017 11:15PM]:                  from ../deps/v8/src/compiler/graph-replay.h:8,
412  [06/09/2017 11:15PM]:                  from ../deps/v8/src/compiler/graph-replay.cc:5:
413  [06/09/2017 11:15PM]:   g++ -DV8_TARGET_ARCH_X64 -DENABLE_DISASSEMBLER -DV8_I18N_SUPPORT -DV8_IMMINENT_DEPRECATION_WARNINGS -DICU_UTIL_DATA_IMPL=ICU_UTIL_DATA_STATIC -I../deps/v8 -I../deps  -pthread -Wall -Wextra -Wno-unused-parameter -m64 -fno-strict-aliasing -m64 -fdata-sections -ffunction-sections -O3 -O3 -fno-omit-frame-pointer -fno-rtti -fno-exceptions -std=gnu++0x -MMD -MF /pkg/src/node-v6.11.0/out/Release/.deps//pkg/src/node-v6.11.0/out/Release/obj.target/v8_base/deps/v8/src/compiler/graph-trimmer.o.d.raw -D_FORTIFY_SOURCE=2 -march=x86-64 -mtune=generic -O2 -pipe -fstack-protector-strong -c -o /pkg/src/node-v6.11.0/out/Release/obj.target/v8_base/deps/v8/src/compiler/graph-trimmer.o ../deps/v8/src/compiler/graph-trimmer.cc
414  [06/09/2017 11:15PM]:                  from ../deps/v8/src/compiler/graph-trimmer.h:8,
415  [06/09/2017 11:15PM]:                  from ../deps/v8/src/compiler/graph-trimmer.cc:5:
416  [06/09/2017 11:15PM]:   g++ -DV8_TARGET_ARCH_X64 -DENABLE_DISASSEMBLER -DV8_I18N_SUPPORT -DV8_IMMINENT_DEPRECATION_WARNINGS -DICU_UTIL_DATA_IMPL=ICU_UTIL_DATA_STATIC -I../deps/v8 -I../deps  -pthread -Wall -Wextra -Wno-unused-parameter -m64 -fno-strict-aliasing -m64 -fdata-sections -ffunction-sections -O3 -O3 -fno-omit-frame-pointer -fno-rtti -fno-exceptions -std=gnu++0x -MMD -MF /pkg/src/node-v6.11.0/out/Release/.deps//pkg/src/node-v6.11.0/out/Release/obj.target/v8_base/deps/v8/src/compiler/graph-visualizer.o.d.raw -D_FORTIFY_SOURCE=2 -march=x86-64 -mtune=generic -O2 -pipe -fstack-protector-strong -c -o /pkg/src/node-v6.11.0/out/Release/obj.target/v8_base/deps/v8/src/compiler/graph-visualizer.o ../deps/v8/src/compiler/graph-visualizer.cc
417  [06/09/2017 11:15PM]:                  from ../deps/v8/src/compiler/graph-visualizer.cc:10:
418  [06/09/2017 11:15PM]:   g++ -DV8_TARGET_ARCH_X64 -DENABLE_DISASSEMBLER -DV8_I18N_SUPPORT -DV8_IMMINENT_DEPRECATION_WARNINGS -DICU_UTIL_DATA_IMPL=ICU_UTIL_DATA_STATIC -I../deps/v8 -I../deps  -pthread -Wall -Wextra -Wno-unused-parameter -m64 -fno-strict-aliasing -m64 -fdata-sections -ffunction-sections -O3 -O3 -fno-omit-frame-pointer -fno-rtti -fno-exceptions -std=gnu++0x -MMD -MF /pkg/src/node-v6.11.0/out/Release/.deps//pkg/src/node-v6.11.0/out/Release/obj.target/v8_base/deps/v8/src/compiler/graph.o.d.raw -D_FORTIFY_SOURCE=2 -march=x86-64 -mtune=generic -O2 -pipe -fstack-protector-strong -c -o /pkg/src/node-v6.11.0/out/Release/obj.target/v8_base/deps/v8/src/compiler/graph.o ../deps/v8/src/compiler/graph.cc
419  [06/09/2017 11:15PM]:                  from ../deps/v8/src/compiler/graph.cc:10:
420  [06/09/2017 11:15PM]:                  from ../deps/v8/src/compiler/graph.cc:5:
421  [06/09/2017 11:15PM]:   g++ -DV8_TARGET_ARCH_X64 -DENABLE_DISASSEMBLER -DV8_I18N_SUPPORT -DV8_IMMINENT_DEPRECATION_WARNINGS -DICU_UTIL_DATA_IMPL=ICU_UTIL_DATA_STATIC -I../deps/v8 -I../deps  -pthread -Wall -Wextra -Wno-unused-parameter -m64 -fno-strict-aliasing -m64 -fdata-sections -ffunction-sections -O3 -O3 -fno-omit-frame-pointer -fno-rtti -fno-exceptions -std=gnu++0x -MMD -MF /pkg/src/node-v6.11.0/out/Release/.deps//pkg/src/node-v6.11.0/out/Release/obj.target/v8_base/deps/v8/src/compiler/greedy-allocator.o.d.raw -D_FORTIFY_SOURCE=2 -march=x86-64 -mtune=generic -O2 -pipe -fstack-protector-strong -c -o /pkg/src/node-v6.11.0/out/Release/obj.target/v8_base/deps/v8/src/compiler/greedy-allocator.o ../deps/v8/src/compiler/greedy-allocator.cc
422  [06/09/2017 11:15PM]:                  from ../deps/v8/src/compiler/greedy-allocator.h:8,
423  [06/09/2017 11:15PM]:                  from ../deps/v8/src/compiler/greedy-allocator.cc:5:
424  [06/09/2017 11:15PM]:   g++ -DV8_TARGET_ARCH_X64 -DENABLE_DISASSEMBLER -DV8_I18N_SUPPORT -DV8_IMMINENT_DEPRECATION_WARNINGS -DICU_UTIL_DATA_IMPL=ICU_UTIL_DATA_STATIC -I../deps/v8 -I../deps  -pthread -Wall -Wextra -Wno-unused-parameter -m64 -fno-strict-aliasing -m64 -fdata-sections -ffunction-sections -O3 -O3 -fno-omit-frame-pointer -fno-rtti -fno-exceptions -std=gnu++0x -MMD -MF /pkg/src/node-v6.11.0/out/Release/.deps//pkg/src/node-v6.11.0/out/Release/obj.target/v8_base/deps/v8/src/compiler/instruction-selector.o.d.raw -D_FORTIFY_SOURCE=2 -march=x86-64 -mtune=generic -O2 -pipe -fstack-protector-strong -c -o /pkg/src/node-v6.11.0/out/Release/obj.target/v8_base/deps/v8/src/compiler/instruction-selector.o ../deps/v8/src/compiler/instruction-selector.cc
425  [06/09/2017 11:15PM]:                  from ../deps/v8/src/compiler/instruction-selector.h:11,
426  [06/09/2017 11:15PM]:                  from ../deps/v8/src/compiler/instruction-selector.cc:5:
427  [06/09/2017 11:15PM]:                  from ../deps/v8/src/compiler/instruction-selector.h:10,
428  [06/09/2017 11:15PM]:   g++ -DV8_TARGET_ARCH_X64 -DENABLE_DISASSEMBLER -DV8_I18N_SUPPORT -DV8_IMMINENT_DEPRECATION_WARNINGS -DICU_UTIL_DATA_IMPL=ICU_UTIL_DATA_STATIC -I../deps/v8 -I../deps  -pthread -Wall -Wextra -Wno-unused-parameter -m64 -fno-strict-aliasing -m64 -fdata-sections -ffunction-sections -O3 -O3 -fno-omit-frame-pointer -fno-rtti -fno-exceptions -std=gnu++0x -MMD -MF /pkg/src/node-v6.11.0/out/Release/.deps//pkg/src/node-v6.11.0/out/Release/obj.target/v8_base/deps/v8/src/compiler/instruction-scheduler.o.d.raw -D_FORTIFY_SOURCE=2 -march=x86-64 -mtune=generic -O2 -pipe -fstack-protector-strong -c -o /pkg/src/node-v6.11.0/out/Release/obj.target/v8_base/deps/v8/src/compiler/instruction-scheduler.o ../deps/v8/src/compiler/instruction-scheduler.cc
429  [06/09/2017 11:15PM]:                  from ../deps/v8/src/compiler/instruction-scheduler.h:8,
430  [06/09/2017 11:15PM]:                  from ../deps/v8/src/compiler/instruction-scheduler.cc:5:
431  [06/09/2017 11:15PM]:   g++ -DV8_TARGET_ARCH_X64 -DENABLE_DISASSEMBLER -DV8_I18N_SUPPORT -DV8_IMMINENT_DEPRECATION_WARNINGS -DICU_UTIL_DATA_IMPL=ICU_UTIL_DATA_STATIC -I../deps/v8 -I../deps  -pthread -Wall -Wextra -Wno-unused-parameter -m64 -fno-strict-aliasing -m64 -fdata-sections -ffunction-sections -O3 -O3 -fno-omit-frame-pointer -fno-rtti -fno-exceptions -std=gnu++0x -MMD -MF /pkg/src/node-v6.11.0/out/Release/.deps//pkg/src/node-v6.11.0/out/Release/obj.target/v8_base/deps/v8/src/compiler/instruction.o.d.raw -D_FORTIFY_SOURCE=2 -march=x86-64 -mtune=generic -O2 -pipe -fstack-protector-strong -c -o /pkg/src/node-v6.11.0/out/Release/obj.target/v8_base/deps/v8/src/compiler/instruction.o ../deps/v8/src/compiler/instruction.cc
432  [06/09/2017 11:15PM]:                  from ../deps/v8/src/compiler/instruction.cc:7:
433  [06/09/2017 11:15PM]:                  from ../deps/v8/src/compiler/instruction.cc:5:
434  [06/09/2017 11:15PM]: ../deps/v8/src/compiler/instruction.cc: In function std::ostream& v8::internal::compiler::operator<<(std::ostream&, const v8::internal::compiler::PrintableInstructionOperand&):
435  [06/09/2017 11:15PM]: ../deps/v8/src/compiler/instruction.cc:111:7: warning: this statement may fall through [-Wimplicit-fallthrough=]
436  [06/09/2017 11:15PM]: ../deps/v8/src/compiler/instruction.cc:113:5: note: here
437  [06/09/2017 11:15PM]:      case InstructionOperand::CONSTANT:
438  [06/09/2017 11:15PM]: ../deps/v8/src/compiler/instruction.cc:123:7: warning: this statement may fall through [-Wimplicit-fallthrough=]
439  [06/09/2017 11:15PM]: ../deps/v8/src/compiler/instruction.cc:125:5: note: here
440  [06/09/2017 11:15PM]:      case InstructionOperand::EXPLICIT:
441  [06/09/2017 11:15PM]:   g++ -DV8_TARGET_ARCH_X64 -DENABLE_DISASSEMBLER -DV8_I18N_SUPPORT -DV8_IMMINENT_DEPRECATION_WARNINGS -DICU_UTIL_DATA_IMPL=ICU_UTIL_DATA_STATIC -I../deps/v8 -I../deps  -pthread -Wall -Wextra -Wno-unused-parameter -m64 -fno-strict-aliasing -m64 -fdata-sections -ffunction-sections -O3 -O3 -fno-omit-frame-pointer -fno-rtti -fno-exceptions -std=gnu++0x -MMD -MF /pkg/src/node-v6.11.0/out/Release/.deps//pkg/src/node-v6.11.0/out/Release/obj.target/v8_base/deps/v8/src/compiler/int64-lowering.o.d.raw -D_FORTIFY_SOURCE=2 -march=x86-64 -mtune=generic -O2 -pipe -fstack-protector-strong -c -o /pkg/src/node-v6.11.0/out/Release/obj.target/v8_base/deps/v8/src/compiler/int64-lowering.o ../deps/v8/src/compiler/int64-lowering.cc
442  [06/09/2017 11:15PM]:                  from ../deps/v8/src/compiler/int64-lowering.h:11,
443  [06/09/2017 11:15PM]:                  from ../deps/v8/src/compiler/int64-lowering.cc:5:
444  [06/09/2017 11:15PM]:                  from ../deps/v8/src/compiler/int64-lowering.h:8,
445  [06/09/2017 11:15PM]: ../deps/v8/src/compiler/int64-lowering.cc: In member function void v8::internal::compiler::Int64Lowering::LowerNode(v8::internal::compiler::Node*):
446  [06/09/2017 11:15PM]: ../deps/v8/src/compiler/int64-lowering.cc:187:27: warning: comparison between signed and unsigned integer expressions [-Wsign-compare]
447  [06/09/2017 11:15PM]:        if (parameter_count != signature()->parameter_count()) {
448  [06/09/2017 11:15PM]:            ~~~~~~~~~~~~~~~~^~~~~~~~~~~~~~~~~~~~~~~~~~~~~~~~~
449  [06/09/2017 11:15PM]: ../deps/v8/src/compiler/int64-lowering.cc:201:55: warning: comparison between signed and unsigned integer expressions [-Wsign-compare]
450  [06/09/2017 11:15PM]:        if (GetParameterCountAfterLowering(signature()) !=
451  [06/09/2017 11:15PM]:            ~~~~~~~~~~~~~~~~~~~~~~~~~~~~~~~~~~~~~~~~~~~~^~
452  [06/09/2017 11:15PM]:            signature()->parameter_count()) {
453  [06/09/2017 11:15PM]:            ~~~~~~~~~~~~~~~~~~~~~~~~~~~~~~
454  [06/09/2017 11:15PM]: ../deps/v8/src/compiler/int64-lowering.cc:220:39: warning: comparison between signed and unsigned integer expressions [-Wsign-compare]
455  [06/09/2017 11:15PM]:        if (signature()->return_count() != new_return_count) {
456  [06/09/2017 11:15PM]:            ~~~~~~~~~~~~~~~~~~~~~~~~~~~~^~~~~~~~~~~~~~~~~~~
457  [06/09/2017 11:15PM]:   g++ -DV8_TARGET_ARCH_X64 -DENABLE_DISASSEMBLER -DV8_I18N_SUPPORT -DV8_IMMINENT_DEPRECATION_WARNINGS -DICU_UTIL_DATA_IMPL=ICU_UTIL_DATA_STATIC -I../deps/v8 -I../deps  -pthread -Wall -Wextra -Wno-unused-parameter -m64 -fno-strict-aliasing -m64 -fdata-sections -ffunction-sections -O3 -O3 -fno-omit-frame-pointer -fno-rtti -fno-exceptions -std=gnu++0x -MMD -MF /pkg/src/node-v6.11.0/out/Release/.deps//pkg/src/node-v6.11.0/out/Release/obj.target/v8_base/deps/v8/src/compiler/js-builtin-reducer.o.d.raw -D_FORTIFY_SOURCE=2 -march=x86-64 -mtune=generic -O2 -pipe -fstack-protector-strong -c -o /pkg/src/node-v6.11.0/out/Release/obj.target/v8_base/deps/v8/src/compiler/js-builtin-reducer.o ../deps/v8/src/compiler/js-builtin-reducer.cc
458  [06/09/2017 11:15PM]:                  from ../deps/v8/src/compiler/js-builtin-reducer.h:8,
459  [06/09/2017 11:15PM]:                  from ../deps/v8/src/compiler/js-builtin-reducer.cc:5:
460  [06/09/2017 11:15PM]:   g++ -DV8_TARGET_ARCH_X64 -DENABLE_DISASSEMBLER -DV8_I18N_SUPPORT -DV8_IMMINENT_DEPRECATION_WARNINGS -DICU_UTIL_DATA_IMPL=ICU_UTIL_DATA_STATIC -I../deps/v8 -I../deps  -pthread -Wall -Wextra -Wno-unused-parameter -m64 -fno-strict-aliasing -m64 -fdata-sections -ffunction-sections -O3 -O3 -fno-omit-frame-pointer -fno-rtti -fno-exceptions -std=gnu++0x -MMD -MF /pkg/src/node-v6.11.0/out/Release/.deps//pkg/src/node-v6.11.0/out/Release/obj.target/v8_base/deps/v8/src/compiler/js-call-reducer.o.d.raw -D_FORTIFY_SOURCE=2 -march=x86-64 -mtune=generic -O2 -pipe -fstack-protector-strong -c -o /pkg/src/node-v6.11.0/out/Release/obj.target/v8_base/deps/v8/src/compiler/js-call-reducer.o ../deps/v8/src/compiler/js-call-reducer.cc
461  [06/09/2017 11:15PM]:                  from ../deps/v8/src/compiler/js-call-reducer.h:9,
462  [06/09/2017 11:15PM]:                  from ../deps/v8/src/compiler/js-call-reducer.cc:5:
463  [06/09/2017 11:15PM]:   g++ -DV8_TARGET_ARCH_X64 -DENABLE_DISASSEMBLER -DV8_I18N_SUPPORT -DV8_IMMINENT_DEPRECATION_WARNINGS -DICU_UTIL_DATA_IMPL=ICU_UTIL_DATA_STATIC -I../deps/v8 -I../deps  -pthread -Wall -Wextra -Wno-unused-parameter -m64 -fno-strict-aliasing -m64 -fdata-sections -ffunction-sections -O3 -O3 -fno-omit-frame-pointer -fno-rtti -fno-exceptions -std=gnu++0x -MMD -MF /pkg/src/node-v6.11.0/out/Release/.deps//pkg/src/node-v6.11.0/out/Release/obj.target/v8_base/deps/v8/src/compiler/js-context-specialization.o.d.raw -D_FORTIFY_SOURCE=2 -march=x86-64 -mtune=generic -O2 -pipe -fstack-protector-strong -c -o /pkg/src/node-v6.11.0/out/Release/obj.target/v8_base/deps/v8/src/compiler/js-context-specialization.o ../deps/v8/src/compiler/js-context-specialization.cc
464  [06/09/2017 11:16PM]:                  from ../deps/v8/src/compiler/js-context-specialization.h:8,
465  [06/09/2017 11:16PM]:                  from ../deps/v8/src/compiler/js-context-specialization.cc:5:
466  [06/09/2017 11:16PM]:   g++ -DV8_TARGET_ARCH_X64 -DENABLE_DISASSEMBLER -DV8_I18N_SUPPORT -DV8_IMMINENT_DEPRECATION_WARNINGS -DICU_UTIL_DATA_IMPL=ICU_UTIL_DATA_STATIC -I../deps/v8 -I../deps  -pthread -Wall -Wextra -Wno-unused-parameter -m64 -fno-strict-aliasing -m64 -fdata-sections -ffunction-sections -O3 -O3 -fno-omit-frame-pointer -fno-rtti -fno-exceptions -std=gnu++0x -MMD -MF /pkg/src/node-v6.11.0/out/Release/.deps//pkg/src/node-v6.11.0/out/Release/obj.target/v8_base/deps/v8/src/compiler/js-create-lowering.o.d.raw -D_FORTIFY_SOURCE=2 -march=x86-64 -mtune=generic -O2 -pipe -fstack-protector-strong -c -o /pkg/src/node-v6.11.0/out/Release/obj.target/v8_base/deps/v8/src/compiler/js-create-lowering.o ../deps/v8/src/compiler/js-create-lowering.cc
467  [06/09/2017 11:16PM]:                  from ../deps/v8/src/compiler/js-create-lowering.h:8,
468  [06/09/2017 11:16PM]:                  from ../deps/v8/src/compiler/js-create-lowering.cc:5:
469  [06/09/2017 11:16PM]:   g++ -DV8_TARGET_ARCH_X64 -DENABLE_DISASSEMBLER -DV8_I18N_SUPPORT -DV8_IMMINENT_DEPRECATION_WARNINGS -DICU_UTIL_DATA_IMPL=ICU_UTIL_DATA_STATIC -I../deps/v8 -I../deps  -pthread -Wall -Wextra -Wno-unused-parameter -m64 -fno-strict-aliasing -m64 -fdata-sections -ffunction-sections -O3 -O3 -fno-omit-frame-pointer -fno-rtti -fno-exceptions -std=gnu++0x -MMD -MF /pkg/src/node-v6.11.0/out/Release/.deps//pkg/src/node-v6.11.0/out/Release/obj.target/v8_base/deps/v8/src/compiler/js-frame-specialization.o.d.raw -D_FORTIFY_SOURCE=2 -march=x86-64 -mtune=generic -O2 -pipe -fstack-protector-strong -c -o /pkg/src/node-v6.11.0/out/Release/obj.target/v8_base/deps/v8/src/compiler/js-frame-specialization.o ../deps/v8/src/compiler/js-frame-specialization.cc
470  [06/09/2017 11:16PM]:                  from ../deps/v8/src/compiler/js-frame-specialization.h:8,
471  [06/09/2017 11:16PM]:                  from ../deps/v8/src/compiler/js-frame-specialization.cc:5:
472  [06/09/2017 11:16PM]:   g++ -DV8_TARGET_ARCH_X64 -DENABLE_DISASSEMBLER -DV8_I18N_SUPPORT -DV8_IMMINENT_DEPRECATION_WARNINGS -DICU_UTIL_DATA_IMPL=ICU_UTIL_DATA_STATIC -I../deps/v8 -I../deps  -pthread -Wall -Wextra -Wno-unused-parameter -m64 -fno-strict-aliasing -m64 -fdata-sections -ffunction-sections -O3 -O3 -fno-omit-frame-pointer -fno-rtti -fno-exceptions -std=gnu++0x -MMD -MF /pkg/src/node-v6.11.0/out/Release/.deps//pkg/src/node-v6.11.0/out/Release/obj.target/v8_base/deps/v8/src/compiler/js-generic-lowering.o.d.raw -D_FORTIFY_SOURCE=2 -march=x86-64 -mtune=generic -O2 -pipe -fstack-protector-strong -c -o /pkg/src/node-v6.11.0/out/Release/obj.target/v8_base/deps/v8/src/compiler/js-generic-lowering.o ../deps/v8/src/compiler/js-generic-lowering.cc
473  [06/09/2017 11:16PM]:                  from ../deps/v8/src/compiler/js-generic-lowering.cc:5:
474  [06/09/2017 11:16PM]:   g++ -DV8_TARGET_ARCH_X64 -DENABLE_DISASSEMBLER -DV8_I18N_SUPPORT -DV8_IMMINENT_DEPRECATION_WARNINGS -DICU_UTIL_DATA_IMPL=ICU_UTIL_DATA_STATIC -I../deps/v8 -I../deps  -pthread -Wall -Wextra -Wno-unused-parameter -m64 -fno-strict-aliasing -m64 -fdata-sections -ffunction-sections -O3 -O3 -fno-omit-frame-pointer -fno-rtti -fno-exceptions -std=gnu++0x -MMD -MF /pkg/src/node-v6.11.0/out/Release/.deps//pkg/src/node-v6.11.0/out/Release/obj.target/v8_base/deps/v8/src/compiler/js-global-object-specialization.o.d.raw -D_FORTIFY_SOURCE=2 -march=x86-64 -mtune=generic -O2 -pipe -fstack-protector-strong -c -o /pkg/src/node-v6.11.0/out/Release/obj.target/v8_base/deps/v8/src/compiler/js-global-object-specialization.o ../deps/v8/src/compiler/js-global-object-specialization.cc
475  [06/09/2017 11:16PM]:                  from ../deps/v8/src/compiler/js-global-object-specialization.h:8,
476  [06/09/2017 11:16PM]:                  from ../deps/v8/src/compiler/js-global-object-specialization.cc:5:
477  [06/09/2017 11:16PM]:   g++ -DV8_TARGET_ARCH_X64 -DENABLE_DISASSEMBLER -DV8_I18N_SUPPORT -DV8_IMMINENT_DEPRECATION_WARNINGS -DICU_UTIL_DATA_IMPL=ICU_UTIL_DATA_STATIC -I../deps/v8 -I../deps  -pthread -Wall -Wextra -Wno-unused-parameter -m64 -fno-strict-aliasing -m64 -fdata-sections -ffunction-sections -O3 -O3 -fno-omit-frame-pointer -fno-rtti -fno-exceptions -std=gnu++0x -MMD -MF /pkg/src/node-v6.11.0/out/Release/.deps//pkg/src/node-v6.11.0/out/Release/obj.target/v8_base/deps/v8/src/compiler/js-graph.o.d.raw -D_FORTIFY_SOURCE=2 -march=x86-64 -mtune=generic -O2 -pipe -fstack-protector-strong -c -o /pkg/src/node-v6.11.0/out/Release/obj.target/v8_base/deps/v8/src/compiler/js-graph.o ../deps/v8/src/compiler/js-graph.cc
478  [06/09/2017 11:16PM]:                  from ../deps/v8/src/compiler/js-graph.cc:5:
479  [06/09/2017 11:16PM]:   g++ -DV8_TARGET_ARCH_X64 -DENABLE_DISASSEMBLER -DV8_I18N_SUPPORT -DV8_IMMINENT_DEPRECATION_WARNINGS -DICU_UTIL_DATA_IMPL=ICU_UTIL_DATA_STATIC -I../deps/v8 -I../deps  -pthread -Wall -Wextra -Wno-unused-parameter -m64 -fno-strict-aliasing -m64 -fdata-sections -ffunction-sections -O3 -O3 -fno-omit-frame-pointer -fno-rtti -fno-exceptions -std=gnu++0x -MMD -MF /pkg/src/node-v6.11.0/out/Release/.deps//pkg/src/node-v6.11.0/out/Release/obj.target/v8_base/deps/v8/src/compiler/js-inlining.o.d.raw -D_FORTIFY_SOURCE=2 -march=x86-64 -mtune=generic -O2 -pipe -fstack-protector-strong -c -o /pkg/src/node-v6.11.0/out/Release/obj.target/v8_base/deps/v8/src/compiler/js-inlining.o ../deps/v8/src/compiler/js-inlining.cc
480  [06/09/2017 11:16PM]: In file included from ../deps/v8/src/runtime/runtime.h:10:0,
481  [06/09/2017 11:16PM]:                  from ../deps/v8/src/compiler/js-operator.h:9,
482  [06/09/2017 11:16PM]:                  from ../deps/v8/src/compiler/js-graph.h:11,
483  [06/09/2017 11:16PM]:                  from ../deps/v8/src/compiler/js-inlining.h:8,
484  [06/09/2017 11:16PM]:                  from ../deps/v8/src/compiler/js-inlining.cc:5:
485  [06/09/2017 11:16PM]:                  from ../deps/v8/src/compiler/js-graph.h:9,
486  [06/09/2017 11:16PM]:   g++ -DV8_TARGET_ARCH_X64 -DENABLE_DISASSEMBLER -DV8_I18N_SUPPORT -DV8_IMMINENT_DEPRECATION_WARNINGS -DICU_UTIL_DATA_IMPL=ICU_UTIL_DATA_STATIC -I../deps/v8 -I../deps  -pthread -Wall -Wextra -Wno-unused-parameter -m64 -fno-strict-aliasing -m64 -fdata-sections -ffunction-sections -O3 -O3 -fno-omit-frame-pointer -fno-rtti -fno-exceptions -std=gnu++0x -MMD -MF /pkg/src/node-v6.11.0/out/Release/.deps//pkg/src/node-v6.11.0/out/Release/obj.target/v8_base/deps/v8/src/compiler/js-inlining-heuristic.o.d.raw -D_FORTIFY_SOURCE=2 -march=x86-64 -mtune=generic -O2 -pipe -fstack-protector-strong -c -o /pkg/src/node-v6.11.0/out/Release/obj.target/v8_base/deps/v8/src/compiler/js-inlining-heuristic.o ../deps/v8/src/compiler/js-inlining-heuristic.cc
487  [06/09/2017 11:16PM]:                  from ../deps/v8/src/compiler/js-inlining-heuristic.h:8,
488  [06/09/2017 11:16PM]:                  from ../deps/v8/src/compiler/js-inlining-heuristic.cc:5:
489  [06/09/2017 11:16PM]:   g++ -DV8_TARGET_ARCH_X64 -DENABLE_DISASSEMBLER -DV8_I18N_SUPPORT -DV8_IMMINENT_DEPRECATION_WARNINGS -DICU_UTIL_DATA_IMPL=ICU_UTIL_DATA_STATIC -I../deps/v8 -I../deps  -pthread -Wall -Wextra -Wno-unused-parameter -m64 -fno-strict-aliasing -m64 -fdata-sections -ffunction-sections -O3 -O3 -fno-omit-frame-pointer -fno-rtti -fno-exceptions -std=gnu++0x -MMD -MF /pkg/src/node-v6.11.0/out/Release/.deps//pkg/src/node-v6.11.0/out/Release/obj.target/v8_base/deps/v8/src/compiler/js-intrinsic-lowering.o.d.raw -D_FORTIFY_SOURCE=2 -march=x86-64 -mtune=generic -O2 -pipe -fstack-protector-strong -c -o /pkg/src/node-v6.11.0/out/Release/obj.target/v8_base/deps/v8/src/compiler/js-intrinsic-lowering.o ../deps/v8/src/compiler/js-intrinsic-lowering.cc
490  [06/09/2017 11:16PM]:                  from ../deps/v8/src/compiler/js-intrinsic-lowering.h:9,
491  [06/09/2017 11:16PM]:                  from ../deps/v8/src/compiler/js-intrinsic-lowering.cc:5:
492  [06/09/2017 11:16PM]:                  from ../deps/v8/src/compiler/js-intrinsic-lowering.h:8,
493  [06/09/2017 11:16PM]:   g++ -DV8_TARGET_ARCH_X64 -DENABLE_DISASSEMBLER -DV8_I18N_SUPPORT -DV8_IMMINENT_DEPRECATION_WARNINGS -DICU_UTIL_DATA_IMPL=ICU_UTIL_DATA_STATIC -I../deps/v8 -I../deps  -pthread -Wall -Wextra -Wno-unused-parameter -m64 -fno-strict-aliasing -m64 -fdata-sections -ffunction-sections -O3 -O3 -fno-omit-frame-pointer -fno-rtti -fno-exceptions -std=gnu++0x -MMD -MF /pkg/src/node-v6.11.0/out/Release/.deps//pkg/src/node-v6.11.0/out/Release/obj.target/v8_base/deps/v8/src/compiler/js-native-context-specialization.o.d.raw -D_FORTIFY_SOURCE=2 -march=x86-64 -mtune=generic -O2 -pipe -fstack-protector-strong -c -o /pkg/src/node-v6.11.0/out/Release/obj.target/v8_base/deps/v8/src/compiler/js-native-context-specialization.o ../deps/v8/src/compiler/js-native-context-specialization.cc
494  [06/09/2017 11:16PM]:                  from ../deps/v8/src/compiler/js-native-context-specialization.h:9,
495  [06/09/2017 11:16PM]:                  from ../deps/v8/src/compiler/js-native-context-specialization.cc:5:
496  [06/09/2017 11:16PM]:   g++ -DV8_TARGET_ARCH_X64 -DENABLE_DISASSEMBLER -DV8_I18N_SUPPORT -DV8_IMMINENT_DEPRECATION_WARNINGS -DICU_UTIL_DATA_IMPL=ICU_UTIL_DATA_STATIC -I../deps/v8 -I../deps  -pthread -Wall -Wextra -Wno-unused-parameter -m64 -fno-strict-aliasing -m64 -fdata-sections -ffunction-sections -O3 -O3 -fno-omit-frame-pointer -fno-rtti -fno-exceptions -std=gnu++0x -MMD -MF /pkg/src/node-v6.11.0/out/Release/.deps//pkg/src/node-v6.11.0/out/Release/obj.target/v8_base/deps/v8/src/compiler/js-operator.o.d.raw -D_FORTIFY_SOURCE=2 -march=x86-64 -mtune=generic -O2 -pipe -fstack-protector-strong -c -o /pkg/src/node-v6.11.0/out/Release/obj.target/v8_base/deps/v8/src/compiler/js-operator.o ../deps/v8/src/compiler/js-operator.cc
497  [06/09/2017 11:16PM]:                  from ../deps/v8/src/compiler/js-operator.cc:5:
498  [06/09/2017 11:16PM]: In file included from ../deps/v8/src/utils.h:13:0,
499  [06/09/2017 11:16PM]:                  from ../deps/v8/src/compiler/type-hints.h:9,
500  [06/09/2017 11:16PM]:                  from ../deps/v8/src/compiler/js-operator.h:8,
501  [06/09/2017 11:16PM]:   g++ -DV8_TARGET_ARCH_X64 -DENABLE_DISASSEMBLER -DV8_I18N_SUPPORT -DV8_IMMINENT_DEPRECATION_WARNINGS -DICU_UTIL_DATA_IMPL=ICU_UTIL_DATA_STATIC -I../deps/v8 -I../deps  -pthread -Wall -Wextra -Wno-unused-parameter -m64 -fno-strict-aliasing -m64 -fdata-sections -ffunction-sections -O3 -O3 -fno-omit-frame-pointer -fno-rtti -fno-exceptions -std=gnu++0x -MMD -MF /pkg/src/node-v6.11.0/out/Release/.deps//pkg/src/node-v6.11.0/out/Release/obj.target/v8_base/deps/v8/src/compiler/js-typed-lowering.o.d.raw -D_FORTIFY_SOURCE=2 -march=x86-64 -mtune=generic -O2 -pipe -fstack-protector-strong -c -o /pkg/src/node-v6.11.0/out/Release/obj.target/v8_base/deps/v8/src/compiler/js-typed-lowering.o ../deps/v8/src/compiler/js-typed-lowering.cc
502  [06/09/2017 11:16PM]:                  from ../deps/v8/src/compiler/js-typed-lowering.cc:5:
503  [06/09/2017 11:16PM]:   g++ -DV8_TARGET_ARCH_X64 -DENABLE_DISASSEMBLER -DV8_I18N_SUPPORT -DV8_IMMINENT_DEPRECATION_WARNINGS -DICU_UTIL_DATA_IMPL=ICU_UTIL_DATA_STATIC -I../deps/v8 -I../deps  -pthread -Wall -Wextra -Wno-unused-parameter -m64 -fno-strict-aliasing -m64 -fdata-sections -ffunction-sections -O3 -O3 -fno-omit-frame-pointer -fno-rtti -fno-exceptions -std=gnu++0x -MMD -MF /pkg/src/node-v6.11.0/out/Release/.deps//pkg/src/node-v6.11.0/out/Release/obj.target/v8_base/deps/v8/src/compiler/jump-threading.o.d.raw -D_FORTIFY_SOURCE=2 -march=x86-64 -mtune=generic -O2 -pipe -fstack-protector-strong -c -o /pkg/src/node-v6.11.0/out/Release/obj.target/v8_base/deps/v8/src/compiler/jump-threading.o ../deps/v8/src/compiler/jump-threading.cc
504  [06/09/2017 11:16PM]:                  from ../deps/v8/src/compiler/jump-threading.h:8,
505  [06/09/2017 11:16PM]:                  from ../deps/v8/src/compiler/jump-threading.cc:5:
506  [06/09/2017 11:16PM]:   g++ -DV8_TARGET_ARCH_X64 -DENABLE_DISASSEMBLER -DV8_I18N_SUPPORT -DV8_IMMINENT_DEPRECATION_WARNINGS -DICU_UTIL_DATA_IMPL=ICU_UTIL_DATA_STATIC -I../deps/v8 -I../deps  -pthread -Wall -Wextra -Wno-unused-parameter -m64 -fno-strict-aliasing -m64 -fdata-sections -ffunction-sections -O3 -O3 -fno-omit-frame-pointer -fno-rtti -fno-exceptions -std=gnu++0x -MMD -MF /pkg/src/node-v6.11.0/out/Release/.deps//pkg/src/node-v6.11.0/out/Release/obj.target/v8_base/deps/v8/src/compiler/linkage.o.d.raw -D_FORTIFY_SOURCE=2 -march=x86-64 -mtune=generic -O2 -pipe -fstack-protector-strong -c -o /pkg/src/node-v6.11.0/out/Release/obj.target/v8_base/deps/v8/src/compiler/linkage.o ../deps/v8/src/compiler/linkage.cc
507  [06/09/2017 11:16PM]:                  from ../deps/v8/src/compiler/linkage.cc:5:
508  [06/09/2017 11:16PM]:   g++ -DV8_TARGET_ARCH_X64 -DENABLE_DISASSEMBLER -DV8_I18N_SUPPORT -DV8_IMMINENT_DEPRECATION_WARNINGS -DICU_UTIL_DATA_IMPL=ICU_UTIL_DATA_STATIC -I../deps/v8 -I../deps  -pthread -Wall -Wextra -Wno-unused-parameter -m64 -fno-strict-aliasing -m64 -fdata-sections -ffunction-sections -O3 -O3 -fno-omit-frame-pointer -fno-rtti -fno-exceptions -std=gnu++0x -MMD -MF /pkg/src/node-v6.11.0/out/Release/.deps//pkg/src/node-v6.11.0/out/Release/obj.target/v8_base/deps/v8/src/compiler/liveness-analyzer.o.d.raw -D_FORTIFY_SOURCE=2 -march=x86-64 -mtune=generic -O2 -pipe -fstack-protector-strong -c -o /pkg/src/node-v6.11.0/out/Release/obj.target/v8_base/deps/v8/src/compiler/liveness-analyzer.o ../deps/v8/src/compiler/liveness-analyzer.cc
509  [06/09/2017 11:16PM]:                  from ../deps/v8/src/compiler/liveness-analyzer.cc:6:
510  [06/09/2017 11:16PM]:   g++ -DV8_TARGET_ARCH_X64 -DENABLE_DISASSEMBLER -DV8_I18N_SUPPORT -DV8_IMMINENT_DEPRECATION_WARNINGS -DICU_UTIL_DATA_IMPL=ICU_UTIL_DATA_STATIC -I../deps/v8 -I../deps  -pthread -Wall -Wextra -Wno-unused-parameter -m64 -fno-strict-aliasing -m64 -fdata-sections -ffunction-sections -O3 -O3 -fno-omit-frame-pointer -fno-rtti -fno-exceptions -std=gnu++0x -MMD -MF /pkg/src/node-v6.11.0/out/Release/.deps//pkg/src/node-v6.11.0/out/Release/obj.target/v8_base/deps/v8/src/compiler/live-range-separator.o.d.raw -D_FORTIFY_SOURCE=2 -march=x86-64 -mtune=generic -O2 -pipe -fstack-protector-strong -c -o /pkg/src/node-v6.11.0/out/Release/obj.target/v8_base/deps/v8/src/compiler/live-range-separator.o ../deps/v8/src/compiler/live-range-separator.cc
511  [06/09/2017 11:16PM]:                  from ../deps/v8/src/compiler/live-range-separator.cc:6:
512  [06/09/2017 11:16PM]:                  from ../deps/v8/src/compiler/live-range-separator.h:9,
513  [06/09/2017 11:16PM]:                  from ../deps/v8/src/compiler/live-range-separator.cc:5:
514  [06/09/2017 11:16PM]:   g++ -DV8_TARGET_ARCH_X64 -DENABLE_DISASSEMBLER -DV8_I18N_SUPPORT -DV8_IMMINENT_DEPRECATION_WARNINGS -DICU_UTIL_DATA_IMPL=ICU_UTIL_DATA_STATIC -I../deps/v8 -I../deps  -pthread -Wall -Wextra -Wno-unused-parameter -m64 -fno-strict-aliasing -m64 -fdata-sections -ffunction-sections -O3 -O3 -fno-omit-frame-pointer -fno-rtti -fno-exceptions -std=gnu++0x -MMD -MF /pkg/src/node-v6.11.0/out/Release/.deps//pkg/src/node-v6.11.0/out/Release/obj.target/v8_base/deps/v8/src/compiler/load-elimination.o.d.raw -D_FORTIFY_SOURCE=2 -march=x86-64 -mtune=generic -O2 -pipe -fstack-protector-strong -c -o /pkg/src/node-v6.11.0/out/Release/obj.target/v8_base/deps/v8/src/compiler/load-elimination.o ../deps/v8/src/compiler/load-elimination.cc
515  [06/09/2017 11:16PM]:                  from ../deps/v8/src/compiler/load-elimination.h:8,
516  [06/09/2017 11:16PM]:                  from ../deps/v8/src/compiler/load-elimination.cc:5:
517  [06/09/2017 11:16PM]:   g++ -DV8_TARGET_ARCH_X64 -DENABLE_DISASSEMBLER -DV8_I18N_SUPPORT -DV8_IMMINENT_DEPRECATION_WARNINGS -DICU_UTIL_DATA_IMPL=ICU_UTIL_DATA_STATIC -I../deps/v8 -I../deps  -pthread -Wall -Wextra -Wno-unused-parameter -m64 -fno-strict-aliasing -m64 -fdata-sections -ffunction-sections -O3 -O3 -fno-omit-frame-pointer -fno-rtti -fno-exceptions -std=gnu++0x -MMD -MF /pkg/src/node-v6.11.0/out/Release/.deps//pkg/src/node-v6.11.0/out/Release/obj.target/v8_base/deps/v8/src/compiler/loop-analysis.o.d.raw -D_FORTIFY_SOURCE=2 -march=x86-64 -mtune=generic -O2 -pipe -fstack-protector-strong -c -o /pkg/src/node-v6.11.0/out/Release/obj.target/v8_base/deps/v8/src/compiler/loop-analysis.o ../deps/v8/src/compiler/loop-analysis.cc
518  [06/09/2017 11:16PM]:                  from ../deps/v8/src/compiler/loop-analysis.h:10,
519  [06/09/2017 11:16PM]:                  from ../deps/v8/src/compiler/loop-analysis.cc:5:
520  [06/09/2017 11:16PM]:                  from ../deps/v8/src/compiler/loop-analysis.h:9,
521  [06/09/2017 11:16PM]:   g++ -DV8_TARGET_ARCH_X64 -DENABLE_DISASSEMBLER -DV8_I18N_SUPPORT -DV8_IMMINENT_DEPRECATION_WARNINGS -DICU_UTIL_DATA_IMPL=ICU_UTIL_DATA_STATIC -I../deps/v8 -I../deps  -pthread -Wall -Wextra -Wno-unused-parameter -m64 -fno-strict-aliasing -m64 -fdata-sections -ffunction-sections -O3 -O3 -fno-omit-frame-pointer -fno-rtti -fno-exceptions -std=gnu++0x -MMD -MF /pkg/src/node-v6.11.0/out/Release/.deps//pkg/src/node-v6.11.0/out/Release/obj.target/v8_base/deps/v8/src/compiler/loop-peeling.o.d.raw -D_FORTIFY_SOURCE=2 -march=x86-64 -mtune=generic -O2 -pipe -fstack-protector-strong -c -o /pkg/src/node-v6.11.0/out/Release/obj.target/v8_base/deps/v8/src/compiler/loop-peeling.o ../deps/v8/src/compiler/loop-peeling.cc
522  [06/09/2017 11:16PM]:                  from ../deps/v8/src/compiler/loop-peeling.h:8,
523  [06/09/2017 11:16PM]:                  from ../deps/v8/src/compiler/loop-peeling.cc:7:
524  [06/09/2017 11:16PM]:                  from ../deps/v8/src/compiler/loop-peeling.cc:5:
525  [06/09/2017 11:16PM]:   g++ -DV8_TARGET_ARCH_X64 -DENABLE_DISASSEMBLER -DV8_I18N_SUPPORT -DV8_IMMINENT_DEPRECATION_WARNINGS -DICU_UTIL_DATA_IMPL=ICU_UTIL_DATA_STATIC -I../deps/v8 -I../deps  -pthread -Wall -Wextra -Wno-unused-parameter -m64 -fno-strict-aliasing -m64 -fdata-sections -ffunction-sections -O3 -O3 -fno-omit-frame-pointer -fno-rtti -fno-exceptions -std=gnu++0x -MMD -MF /pkg/src/node-v6.11.0/out/Release/.deps//pkg/src/node-v6.11.0/out/Release/obj.target/v8_base/deps/v8/src/compiler/machine-operator-reducer.o.d.raw -D_FORTIFY_SOURCE=2 -march=x86-64 -mtune=generic -O2 -pipe -fstack-protector-strong -c -o /pkg/src/node-v6.11.0/out/Release/obj.target/v8_base/deps/v8/src/compiler/machine-operator-reducer.o ../deps/v8/src/compiler/machine-operator-reducer.cc
526  [06/09/2017 11:16PM]:                  from ../deps/v8/src/compiler/machine-operator-reducer.h:8,
527  [06/09/2017 11:16PM]:                  from ../deps/v8/src/compiler/machine-operator-reducer.cc:5:
528  [06/09/2017 11:17PM]:   g++ -DV8_TARGET_ARCH_X64 -DENABLE_DISASSEMBLER -DV8_I18N_SUPPORT -DV8_IMMINENT_DEPRECATION_WARNINGS -DICU_UTIL_DATA_IMPL=ICU_UTIL_DATA_STATIC -I../deps/v8 -I../deps  -pthread -Wall -Wextra -Wno-unused-parameter -m64 -fno-strict-aliasing -m64 -fdata-sections -ffunction-sections -O3 -O3 -fno-omit-frame-pointer -fno-rtti -fno-exceptions -std=gnu++0x -MMD -MF /pkg/src/node-v6.11.0/out/Release/.deps//pkg/src/node-v6.11.0/out/Release/obj.target/v8_base/deps/v8/src/compiler/machine-operator.o.d.raw -D_FORTIFY_SOURCE=2 -march=x86-64 -mtune=generic -O2 -pipe -fstack-protector-strong -c -o /pkg/src/node-v6.11.0/out/Release/obj.target/v8_base/deps/v8/src/compiler/machine-operator.o ../deps/v8/src/compiler/machine-operator.cc
529  [06/09/2017 11:17PM]:   g++ -DV8_TARGET_ARCH_X64 -DENABLE_DISASSEMBLER -DV8_I18N_SUPPORT -DV8_IMMINENT_DEPRECATION_WARNINGS -DICU_UTIL_DATA_IMPL=ICU_UTIL_DATA_STATIC -I../deps/v8 -I../deps  -pthread -Wall -Wextra -Wno-unused-parameter -m64 -fno-strict-aliasing -m64 -fdata-sections -ffunction-sections -O3 -O3 -fno-omit-frame-pointer -fno-rtti -fno-exceptions -std=gnu++0x -MMD -MF /pkg/src/node-v6.11.0/out/Release/.deps//pkg/src/node-v6.11.0/out/Release/obj.target/v8_base/deps/v8/src/compiler/move-optimizer.o.d.raw -D_FORTIFY_SOURCE=2 -march=x86-64 -mtune=generic -O2 -pipe -fstack-protector-strong -c -o /pkg/src/node-v6.11.0/out/Release/obj.target/v8_base/deps/v8/src/compiler/move-optimizer.o ../deps/v8/src/compiler/move-optimizer.cc
530  [06/09/2017 11:17PM]:                  from ../deps/v8/src/compiler/move-optimizer.h:8,
531  [06/09/2017 11:17PM]:                  from ../deps/v8/src/compiler/move-optimizer.cc:5:
532  [06/09/2017 11:17PM]:   g++ -DV8_TARGET_ARCH_X64 -DENABLE_DISASSEMBLER -DV8_I18N_SUPPORT -DV8_IMMINENT_DEPRECATION_WARNINGS -DICU_UTIL_DATA_IMPL=ICU_UTIL_DATA_STATIC -I../deps/v8 -I../deps  -pthread -Wall -Wextra -Wno-unused-parameter -m64 -fno-strict-aliasing -m64 -fdata-sections -ffunction-sections -O3 -O3 -fno-omit-frame-pointer -fno-rtti -fno-exceptions -std=gnu++0x -MMD -MF /pkg/src/node-v6.11.0/out/Release/.deps//pkg/src/node-v6.11.0/out/Release/obj.target/v8_base/deps/v8/src/compiler/node-cache.o.d.raw -D_FORTIFY_SOURCE=2 -march=x86-64 -mtune=generic -O2 -pipe -fstack-protector-strong -c -o /pkg/src/node-v6.11.0/out/Release/obj.target/v8_base/deps/v8/src/compiler/node-cache.o ../deps/v8/src/compiler/node-cache.cc
533  [06/09/2017 11:17PM]:   g++ -DV8_TARGET_ARCH_X64 -DENABLE_DISASSEMBLER -DV8_I18N_SUPPORT -DV8_IMMINENT_DEPRECATION_WARNINGS -DICU_UTIL_DATA_IMPL=ICU_UTIL_DATA_STATIC -I../deps/v8 -I../deps  -pthread -Wall -Wextra -Wno-unused-parameter -m64 -fno-strict-aliasing -m64 -fdata-sections -ffunction-sections -O3 -O3 -fno-omit-frame-pointer -fno-rtti -fno-exceptions -std=gnu++0x -MMD -MF /pkg/src/node-v6.11.0/out/Release/.deps//pkg/src/node-v6.11.0/out/Release/obj.target/v8_base/deps/v8/src/compiler/node-marker.o.d.raw -D_FORTIFY_SOURCE=2 -march=x86-64 -mtune=generic -O2 -pipe -fstack-protector-strong -c -o /pkg/src/node-v6.11.0/out/Release/obj.target/v8_base/deps/v8/src/compiler/node-marker.o ../deps/v8/src/compiler/node-marker.cc
534  [06/09/2017 11:17PM]:                  from ../deps/v8/src/compiler/node-marker.cc:5:
535  [06/09/2017 11:17PM]:   g++ -DV8_TARGET_ARCH_X64 -DENABLE_DISASSEMBLER -DV8_I18N_SUPPORT -DV8_IMMINENT_DEPRECATION_WARNINGS -DICU_UTIL_DATA_IMPL=ICU_UTIL_DATA_STATIC -I../deps/v8 -I../deps  -pthread -Wall -Wextra -Wno-unused-parameter -m64 -fno-strict-aliasing -m64 -fdata-sections -ffunction-sections -O3 -O3 -fno-omit-frame-pointer -fno-rtti -fno-exceptions -std=gnu++0x -MMD -MF /pkg/src/node-v6.11.0/out/Release/.deps//pkg/src/node-v6.11.0/out/Release/obj.target/v8_base/deps/v8/src/compiler/node-matchers.o.d.raw -D_FORTIFY_SOURCE=2 -march=x86-64 -mtune=generic -O2 -pipe -fstack-protector-strong -c -o /pkg/src/node-v6.11.0/out/Release/obj.target/v8_base/deps/v8/src/compiler/node-matchers.o ../deps/v8/src/compiler/node-matchers.cc
536  [06/09/2017 11:17PM]:                  from ../deps/v8/src/compiler/node-matchers.h:11,
537  [06/09/2017 11:17PM]:                  from ../deps/v8/src/compiler/node-matchers.cc:5:
538  [06/09/2017 11:17PM]:   g++ -DV8_TARGET_ARCH_X64 -DENABLE_DISASSEMBLER -DV8_I18N_SUPPORT -DV8_IMMINENT_DEPRECATION_WARNINGS -DICU_UTIL_DATA_IMPL=ICU_UTIL_DATA_STATIC -I../deps/v8 -I../deps  -pthread -Wall -Wextra -Wno-unused-parameter -m64 -fno-strict-aliasing -m64 -fdata-sections -ffunction-sections -O3 -O3 -fno-omit-frame-pointer -fno-rtti -fno-exceptions -std=gnu++0x -MMD -MF /pkg/src/node-v6.11.0/out/Release/.deps//pkg/src/node-v6.11.0/out/Release/obj.target/v8_base/deps/v8/src/compiler/node-properties.o.d.raw -D_FORTIFY_SOURCE=2 -march=x86-64 -mtune=generic -O2 -pipe -fstack-protector-strong -c -o /pkg/src/node-v6.11.0/out/Release/obj.target/v8_base/deps/v8/src/compiler/node-properties.o ../deps/v8/src/compiler/node-properties.cc
539  [06/09/2017 11:17PM]:                  from ../deps/v8/src/compiler/node-properties.cc:7:
540  [06/09/2017 11:17PM]:                  from ../deps/v8/src/compiler/node-properties.cc:5:
541  [06/09/2017 11:17PM]:   g++ -DV8_TARGET_ARCH_X64 -DENABLE_DISASSEMBLER -DV8_I18N_SUPPORT -DV8_IMMINENT_DEPRECATION_WARNINGS -DICU_UTIL_DATA_IMPL=ICU_UTIL_DATA_STATIC -I../deps/v8 -I../deps  -pthread -Wall -Wextra -Wno-unused-parameter -m64 -fno-strict-aliasing -m64 -fdata-sections -ffunction-sections -O3 -O3 -fno-omit-frame-pointer -fno-rtti -fno-exceptions -std=gnu++0x -MMD -MF /pkg/src/node-v6.11.0/out/Release/.deps//pkg/src/node-v6.11.0/out/Release/obj.target/v8_base/deps/v8/src/compiler/node.o.d.raw -D_FORTIFY_SOURCE=2 -march=x86-64 -mtune=generic -O2 -pipe -fstack-protector-strong -c -o /pkg/src/node-v6.11.0/out/Release/obj.target/v8_base/deps/v8/src/compiler/node.o ../deps/v8/src/compiler/node.cc
542  [06/09/2017 11:17PM]:                  from ../deps/v8/src/compiler/node.cc:5:
543  [06/09/2017 11:17PM]:   g++ -DV8_TARGET_ARCH_X64 -DENABLE_DISASSEMBLER -DV8_I18N_SUPPORT -DV8_IMMINENT_DEPRECATION_WARNINGS -DICU_UTIL_DATA_IMPL=ICU_UTIL_DATA_STATIC -I../deps/v8 -I../deps  -pthread -Wall -Wextra -Wno-unused-parameter -m64 -fno-strict-aliasing -m64 -fdata-sections -ffunction-sections -O3 -O3 -fno-omit-frame-pointer -fno-rtti -fno-exceptions -std=gnu++0x -MMD -MF /pkg/src/node-v6.11.0/out/Release/.deps//pkg/src/node-v6.11.0/out/Release/obj.target/v8_base/deps/v8/src/compiler/opcodes.o.d.raw -D_FORTIFY_SOURCE=2 -march=x86-64 -mtune=generic -O2 -pipe -fstack-protector-strong -c -o /pkg/src/node-v6.11.0/out/Release/obj.target/v8_base/deps/v8/src/compiler/opcodes.o ../deps/v8/src/compiler/opcodes.cc
544  [06/09/2017 11:17PM]:   g++ -DV8_TARGET_ARCH_X64 -DENABLE_DISASSEMBLER -DV8_I18N_SUPPORT -DV8_IMMINENT_DEPRECATION_WARNINGS -DICU_UTIL_DATA_IMPL=ICU_UTIL_DATA_STATIC -I../deps/v8 -I../deps  -pthread -Wall -Wextra -Wno-unused-parameter -m64 -fno-strict-aliasing -m64 -fdata-sections -ffunction-sections -O3 -O3 -fno-omit-frame-pointer -fno-rtti -fno-exceptions -std=gnu++0x -MMD -MF /pkg/src/node-v6.11.0/out/Release/.deps//pkg/src/node-v6.11.0/out/Release/obj.target/v8_base/deps/v8/src/compiler/operator-properties.o.d.raw -D_FORTIFY_SOURCE=2 -march=x86-64 -mtune=generic -O2 -pipe -fstack-protector-strong -c -o /pkg/src/node-v6.11.0/out/Release/obj.target/v8_base/deps/v8/src/compiler/operator-properties.o ../deps/v8/src/compiler/operator-properties.cc
545  [06/09/2017 11:17PM]:                  from ../deps/v8/src/compiler/operator-properties.cc:7:
546  [06/09/2017 11:17PM]:   g++ -DV8_TARGET_ARCH_X64 -DENABLE_DISASSEMBLER -DV8_I18N_SUPPORT -DV8_IMMINENT_DEPRECATION_WARNINGS -DICU_UTIL_DATA_IMPL=ICU_UTIL_DATA_STATIC -I../deps/v8 -I../deps  -pthread -Wall -Wextra -Wno-unused-parameter -m64 -fno-strict-aliasing -m64 -fdata-sections -ffunction-sections -O3 -O3 -fno-omit-frame-pointer -fno-rtti -fno-exceptions -std=gnu++0x -MMD -MF /pkg/src/node-v6.11.0/out/Release/.deps//pkg/src/node-v6.11.0/out/Release/obj.target/v8_base/deps/v8/src/compiler/operator.o.d.raw -D_FORTIFY_SOURCE=2 -march=x86-64 -mtune=generic -O2 -pipe -fstack-protector-strong -c -o /pkg/src/node-v6.11.0/out/Release/obj.target/v8_base/deps/v8/src/compiler/operator.o ../deps/v8/src/compiler/operator.cc
547  [06/09/2017 11:17PM]:   g++ -DV8_TARGET_ARCH_X64 -DENABLE_DISASSEMBLER -DV8_I18N_SUPPORT -DV8_IMMINENT_DEPRECATION_WARNINGS -DICU_UTIL_DATA_IMPL=ICU_UTIL_DATA_STATIC -I../deps/v8 -I../deps  -pthread -Wall -Wextra -Wno-unused-parameter -m64 -fno-strict-aliasing -m64 -fdata-sections -ffunction-sections -O3 -O3 -fno-omit-frame-pointer -fno-rtti -fno-exceptions -std=gnu++0x -MMD -MF /pkg/src/node-v6.11.0/out/Release/.deps//pkg/src/node-v6.11.0/out/Release/obj.target/v8_base/deps/v8/src/compiler/osr.o.d.raw -D_FORTIFY_SOURCE=2 -march=x86-64 -mtune=generic -O2 -pipe -fstack-protector-strong -c -o /pkg/src/node-v6.11.0/out/Release/obj.target/v8_base/deps/v8/src/compiler/osr.o ../deps/v8/src/compiler/osr.cc
548  [06/09/2017 11:17PM]:                  from ../deps/v8/src/compiler/osr.cc:5:
549  [06/09/2017 11:17PM]:   g++ -DV8_TARGET_ARCH_X64 -DENABLE_DISASSEMBLER -DV8_I18N_SUPPORT -DV8_IMMINENT_DEPRECATION_WARNINGS -DICU_UTIL_DATA_IMPL=ICU_UTIL_DATA_STATIC -I../deps/v8 -I../deps  -pthread -Wall -Wextra -Wno-unused-parameter -m64 -fno-strict-aliasing -m64 -fdata-sections -ffunction-sections -O3 -O3 -fno-omit-frame-pointer -fno-rtti -fno-exceptions -std=gnu++0x -MMD -MF /pkg/src/node-v6.11.0/out/Release/.deps//pkg/src/node-v6.11.0/out/Release/obj.target/v8_base/deps/v8/src/compiler/pipeline.o.d.raw -D_FORTIFY_SOURCE=2 -march=x86-64 -mtune=generic -O2 -pipe -fstack-protector-strong -c -o /pkg/src/node-v6.11.0/out/Release/obj.target/v8_base/deps/v8/src/compiler/pipeline.o ../deps/v8/src/compiler/pipeline.cc
550  [06/09/2017 11:17PM]: In file included from ../deps/v8/src/compiler/pipeline.h:10:0,
551  [06/09/2017 11:17PM]:                  from ../deps/v8/src/compiler/pipeline.cc:5:
552  [06/09/2017 11:17PM]:                  from ../deps/v8/src/objects.h:15,
553  [06/09/2017 11:17PM]:                  from ../deps/v8/src/compiler/pipeline.h:10,
554  [06/09/2017 11:17PM]:   g++ -DV8_TARGET_ARCH_X64 -DENABLE_DISASSEMBLER -DV8_I18N_SUPPORT -DV8_IMMINENT_DEPRECATION_WARNINGS -DICU_UTIL_DATA_IMPL=ICU_UTIL_DATA_STATIC -I../deps/v8 -I../deps  -pthread -Wall -Wextra -Wno-unused-parameter -m64 -fno-strict-aliasing -m64 -fdata-sections -ffunction-sections -O3 -O3 -fno-omit-frame-pointer -fno-rtti -fno-exceptions -std=gnu++0x -MMD -MF /pkg/src/node-v6.11.0/out/Release/.deps//pkg/src/node-v6.11.0/out/Release/obj.target/v8_base/deps/v8/src/compiler/pipeline-statistics.o.d.raw -D_FORTIFY_SOURCE=2 -march=x86-64 -mtune=generic -O2 -pipe -fstack-protector-strong -c -o /pkg/src/node-v6.11.0/out/Release/obj.target/v8_base/deps/v8/src/compiler/pipeline-statistics.o ../deps/v8/src/compiler/pipeline-statistics.cc
555  [06/09/2017 11:17PM]:                  from ../deps/v8/src/compiler/pipeline-statistics.cc:5:
556  [06/09/2017 11:17PM]:   g++ -DV8_TARGET_ARCH_X64 -DENABLE_DISASSEMBLER -DV8_I18N_SUPPORT -DV8_IMMINENT_DEPRECATION_WARNINGS -DICU_UTIL_DATA_IMPL=ICU_UTIL_DATA_STATIC -I../deps/v8 -I../deps  -pthread -Wall -Wextra -Wno-unused-parameter -m64 -fno-strict-aliasing -m64 -fdata-sections -ffunction-sections -O3 -O3 -fno-omit-frame-pointer -fno-rtti -fno-exceptions -std=gnu++0x -MMD -MF /pkg/src/node-v6.11.0/out/Release/.deps//pkg/src/node-v6.11.0/out/Release/obj.target/v8_base/deps/v8/src/compiler/raw-machine-assembler.o.d.raw -D_FORTIFY_SOURCE=2 -march=x86-64 -mtune=generic -O2 -pipe -fstack-protector-strong -c -o /pkg/src/node-v6.11.0/out/Release/obj.target/v8_base/deps/v8/src/compiler/raw-machine-assembler.o ../deps/v8/src/compiler/raw-machine-assembler.cc
557  [06/09/2017 11:17PM]:                  from ../deps/v8/src/compiler/raw-machine-assembler.h:8,
558  [06/09/2017 11:17PM]:                  from ../deps/v8/src/compiler/raw-machine-assembler.cc:5:
559  [06/09/2017 11:17PM]:   g++ -DV8_TARGET_ARCH_X64 -DENABLE_DISASSEMBLER -DV8_I18N_SUPPORT -DV8_IMMINENT_DEPRECATION_WARNINGS -DICU_UTIL_DATA_IMPL=ICU_UTIL_DATA_STATIC -I../deps/v8 -I../deps  -pthread -Wall -Wextra -Wno-unused-parameter -m64 -fno-strict-aliasing -m64 -fdata-sections -ffunction-sections -O3 -O3 -fno-omit-frame-pointer -fno-rtti -fno-exceptions -std=gnu++0x -MMD -MF /pkg/src/node-v6.11.0/out/Release/.deps//pkg/src/node-v6.11.0/out/Release/obj.target/v8_base/deps/v8/src/compiler/register-allocator.o.d.raw -D_FORTIFY_SOURCE=2 -march=x86-64 -mtune=generic -O2 -pipe -fstack-protector-strong -c -o /pkg/src/node-v6.11.0/out/Release/obj.target/v8_base/deps/v8/src/compiler/register-allocator.o ../deps/v8/src/compiler/register-allocator.cc
560  [06/09/2017 11:17PM]:                  from ../deps/v8/src/compiler/linkage.h:9,
561  [06/09/2017 11:17PM]:                  from ../deps/v8/src/compiler/register-allocator.cc:6:
562  [06/09/2017 11:17PM]:   g++ -DV8_TARGET_ARCH_X64 -DENABLE_DISASSEMBLER -DV8_I18N_SUPPORT -DV8_IMMINENT_DEPRECATION_WARNINGS -DICU_UTIL_DATA_IMPL=ICU_UTIL_DATA_STATIC -I../deps/v8 -I../deps  -pthread -Wall -Wextra -Wno-unused-parameter -m64 -fno-strict-aliasing -m64 -fdata-sections -ffunction-sections -O3 -O3 -fno-omit-frame-pointer -fno-rtti -fno-exceptions -std=gnu++0x -MMD -MF /pkg/src/node-v6.11.0/out/Release/.deps//pkg/src/node-v6.11.0/out/Release/obj.target/v8_base/deps/v8/src/compiler/register-allocator-verifier.o.d.raw -D_FORTIFY_SOURCE=2 -march=x86-64 -mtune=generic -O2 -pipe -fstack-protector-strong -c -o /pkg/src/node-v6.11.0/out/Release/obj.target/v8_base/deps/v8/src/compiler/register-allocator-verifier.o ../deps/v8/src/compiler/register-allocator-verifier.cc
563  [06/09/2017 11:17PM]:                  from ../deps/v8/src/compiler/register-allocator-verifier.cc:6:
564  [06/09/2017 11:17PM]:                  from ../deps/v8/src/compiler/register-allocator-verifier.cc:5:
565  [06/09/2017 11:17PM]:   g++ -DV8_TARGET_ARCH_X64 -DENABLE_DISASSEMBLER -DV8_I18N_SUPPORT -DV8_IMMINENT_DEPRECATION_WARNINGS -DICU_UTIL_DATA_IMPL=ICU_UTIL_DATA_STATIC -I../deps/v8 -I../deps  -pthread -Wall -Wextra -Wno-unused-parameter -m64 -fno-strict-aliasing -m64 -fdata-sections -ffunction-sections -O3 -O3 -fno-omit-frame-pointer -fno-rtti -fno-exceptions -std=gnu++0x -MMD -MF /pkg/src/node-v6.11.0/out/Release/.deps//pkg/src/node-v6.11.0/out/Release/obj.target/v8_base/deps/v8/src/compiler/representation-change.o.d.raw -D_FORTIFY_SOURCE=2 -march=x86-64 -mtune=generic -O2 -pipe -fstack-protector-strong -c -o /pkg/src/node-v6.11.0/out/Release/obj.target/v8_base/deps/v8/src/compiler/representation-change.o ../deps/v8/src/compiler/representation-change.cc
566  [06/09/2017 11:17PM]:                  from ../deps/v8/src/compiler/representation-change.h:8,
567  [06/09/2017 11:17PM]:                  from ../deps/v8/src/compiler/representation-change.cc:5:
568  [06/09/2017 11:17PM]:   g++ -DV8_TARGET_ARCH_X64 -DENABLE_DISASSEMBLER -DV8_I18N_SUPPORT -DV8_IMMINENT_DEPRECATION_WARNINGS -DICU_UTIL_DATA_IMPL=ICU_UTIL_DATA_STATIC -I../deps/v8 -I../deps  -pthread -Wall -Wextra -Wno-unused-parameter -m64 -fno-strict-aliasing -m64 -fdata-sections -ffunction-sections -O3 -O3 -fno-omit-frame-pointer -fno-rtti -fno-exceptions -std=gnu++0x -MMD -MF /pkg/src/node-v6.11.0/out/Release/.deps//pkg/src/node-v6.11.0/out/Release/obj.target/v8_base/deps/v8/src/compiler/schedule.o.d.raw -D_FORTIFY_SOURCE=2 -march=x86-64 -mtune=generic -O2 -pipe -fstack-protector-strong -c -o /pkg/src/node-v6.11.0/out/Release/obj.target/v8_base/deps/v8/src/compiler/schedule.o ../deps/v8/src/compiler/schedule.cc
569  [06/09/2017 11:17PM]:                  from ../deps/v8/src/compiler/schedule.cc:7:
570  [06/09/2017 11:17PM]:                  from ../deps/v8/src/zone-allocator.h:10,
571  [06/09/2017 11:17PM]:                  from ../deps/v8/src/zone-containers.h:16,
572  [06/09/2017 11:17PM]:                  from ../deps/v8/src/compiler/schedule.h:10,
573  [06/09/2017 11:17PM]:                  from ../deps/v8/src/compiler/schedule.cc:5:
574  [06/09/2017 11:17PM]:   g++ -DV8_TARGET_ARCH_X64 -DENABLE_DISASSEMBLER -DV8_I18N_SUPPORT -DV8_IMMINENT_DEPRECATION_WARNINGS -DICU_UTIL_DATA_IMPL=ICU_UTIL_DATA_STATIC -I../deps/v8 -I../deps  -pthread -Wall -Wextra -Wno-unused-parameter -m64 -fno-strict-aliasing -m64 -fdata-sections -ffunction-sections -O3 -O3 -fno-omit-frame-pointer -fno-rtti -fno-exceptions -std=gnu++0x -MMD -MF /pkg/src/node-v6.11.0/out/Release/.deps//pkg/src/node-v6.11.0/out/Release/obj.target/v8_base/deps/v8/src/compiler/scheduler.o.d.raw -D_FORTIFY_SOURCE=2 -march=x86-64 -mtune=generic -O2 -pipe -fstack-protector-strong -c -o /pkg/src/node-v6.11.0/out/Release/obj.target/v8_base/deps/v8/src/compiler/scheduler.o ../deps/v8/src/compiler/scheduler.cc
575  [06/09/2017 11:17PM]:                  from ../deps/v8/src/compiler/scheduler.h:9,
576  [06/09/2017 11:17PM]:                  from ../deps/v8/src/compiler/scheduler.cc:5:
577  [06/09/2017 11:17PM]:   g++ -DV8_TARGET_ARCH_X64 -DENABLE_DISASSEMBLER -DV8_I18N_SUPPORT -DV8_IMMINENT_DEPRECATION_WARNINGS -DICU_UTIL_DATA_IMPL=ICU_UTIL_DATA_STATIC -I../deps/v8 -I../deps  -pthread -Wall -Wextra -Wno-unused-parameter -m64 -fno-strict-aliasing -m64 -fdata-sections -ffunction-sections -O3 -O3 -fno-omit-frame-pointer -fno-rtti -fno-exceptions -std=gnu++0x -MMD -MF /pkg/src/node-v6.11.0/out/Release/.deps//pkg/src/node-v6.11.0/out/Release/obj.target/v8_base/deps/v8/src/compiler/select-lowering.o.d.raw -D_FORTIFY_SOURCE=2 -march=x86-64 -mtune=generic -O2 -pipe -fstack-protector-strong -c -o /pkg/src/node-v6.11.0/out/Release/obj.target/v8_base/deps/v8/src/compiler/select-lowering.o ../deps/v8/src/compiler/select-lowering.cc
578  [06/09/2017 11:17PM]:                  from ../deps/v8/src/compiler/select-lowering.h:8,
579  [06/09/2017 11:17PM]:                  from ../deps/v8/src/compiler/select-lowering.cc:5:
580  [06/09/2017 11:17PM]:   g++ -DV8_TARGET_ARCH_X64 -DENABLE_DISASSEMBLER -DV8_I18N_SUPPORT -DV8_IMMINENT_DEPRECATION_WARNINGS -DICU_UTIL_DATA_IMPL=ICU_UTIL_DATA_STATIC -I../deps/v8 -I../deps  -pthread -Wall -Wextra -Wno-unused-parameter -m64 -fno-strict-aliasing -m64 -fdata-sections -ffunction-sections -O3 -O3 -fno-omit-frame-pointer -fno-rtti -fno-exceptions -std=gnu++0x -MMD -MF /pkg/src/node-v6.11.0/out/Release/.deps//pkg/src/node-v6.11.0/out/Release/obj.target/v8_base/deps/v8/src/compiler/simplified-lowering.o.d.raw -D_FORTIFY_SOURCE=2 -march=x86-64 -mtune=generic -O2 -pipe -fstack-protector-strong -c -o /pkg/src/node-v6.11.0/out/Release/obj.target/v8_base/deps/v8/src/compiler/simplified-lowering.o ../deps/v8/src/compiler/simplified-lowering.cc
581  [06/09/2017 11:17PM]:                  from ../deps/v8/src/compiler/simplified-lowering.h:8,
582  [06/09/2017 11:17PM]:                  from ../deps/v8/src/compiler/simplified-lowering.cc:5:
583  [06/09/2017 11:17PM]:   g++ -DV8_TARGET_ARCH_X64 -DENABLE_DISASSEMBLER -DV8_I18N_SUPPORT -DV8_IMMINENT_DEPRECATION_WARNINGS -DICU_UTIL_DATA_IMPL=ICU_UTIL_DATA_STATIC -I../deps/v8 -I../deps  -pthread -Wall -Wextra -Wno-unused-parameter -m64 -fno-strict-aliasing -m64 -fdata-sections -ffunction-sections -O3 -O3 -fno-omit-frame-pointer -fno-rtti -fno-exceptions -std=gnu++0x -MMD -MF /pkg/src/node-v6.11.0/out/Release/.deps//pkg/src/node-v6.11.0/out/Release/obj.target/v8_base/deps/v8/src/compiler/simplified-operator-reducer.o.d.raw -D_FORTIFY_SOURCE=2 -march=x86-64 -mtune=generic -O2 -pipe -fstack-protector-strong -c -o /pkg/src/node-v6.11.0/out/Release/obj.target/v8_base/deps/v8/src/compiler/simplified-operator-reducer.o ../deps/v8/src/compiler/simplified-operator-reducer.cc
584  [06/09/2017 11:17PM]:                  from ../deps/v8/src/compiler/simplified-operator-reducer.h:8,
585  [06/09/2017 11:17PM]:                  from ../deps/v8/src/compiler/simplified-operator-reducer.cc:5:
586  [06/09/2017 11:17PM]:   g++ -DV8_TARGET_ARCH_X64 -DENABLE_DISASSEMBLER -DV8_I18N_SUPPORT -DV8_IMMINENT_DEPRECATION_WARNINGS -DICU_UTIL_DATA_IMPL=ICU_UTIL_DATA_STATIC -I../deps/v8 -I../deps  -pthread -Wall -Wextra -Wno-unused-parameter -m64 -fno-strict-aliasing -m64 -fdata-sections -ffunction-sections -O3 -O3 -fno-omit-frame-pointer -fno-rtti -fno-exceptions -std=gnu++0x -MMD -MF /pkg/src/node-v6.11.0/out/Release/.deps//pkg/src/node-v6.11.0/out/Release/obj.target/v8_base/deps/v8/src/compiler/simplified-operator.o.d.raw -D_FORTIFY_SOURCE=2 -march=x86-64 -mtune=generic -O2 -pipe -fstack-protector-strong -c -o /pkg/src/node-v6.11.0/out/Release/obj.target/v8_base/deps/v8/src/compiler/simplified-operator.o ../deps/v8/src/compiler/simplified-operator.cc
587  [06/09/2017 11:17PM]:                  from ../deps/v8/src/compiler/simplified-operator.cc:5:
588  [06/09/2017 11:17PM]:   g++ -DV8_TARGET_ARCH_X64 -DENABLE_DISASSEMBLER -DV8_I18N_SUPPORT -DV8_IMMINENT_DEPRECATION_WARNINGS -DICU_UTIL_DATA_IMPL=ICU_UTIL_DATA_STATIC -I../deps/v8 -I../deps  -pthread -Wall -Wextra -Wno-unused-parameter -m64 -fno-strict-aliasing -m64 -fdata-sections -ffunction-sections -O3 -O3 -fno-omit-frame-pointer -fno-rtti -fno-exceptions -std=gnu++0x -MMD -MF /pkg/src/node-v6.11.0/out/Release/.deps//pkg/src/node-v6.11.0/out/Release/obj.target/v8_base/deps/v8/src/compiler/source-position.o.d.raw -D_FORTIFY_SOURCE=2 -march=x86-64 -mtune=generic -O2 -pipe -fstack-protector-strong -c -o /pkg/src/node-v6.11.0/out/Release/obj.target/v8_base/deps/v8/src/compiler/source-position.o ../deps/v8/src/compiler/source-position.cc
589  [06/09/2017 11:18PM]:                  from ../deps/v8/src/compiler/source-position.h:8,
590  [06/09/2017 11:18PM]:                  from ../deps/v8/src/compiler/source-position.cc:5:
591  [06/09/2017 11:18PM]:   g++ -DV8_TARGET_ARCH_X64 -DENABLE_DISASSEMBLER -DV8_I18N_SUPPORT -DV8_IMMINENT_DEPRECATION_WARNINGS -DICU_UTIL_DATA_IMPL=ICU_UTIL_DATA_STATIC -I../deps/v8 -I../deps  -pthread -Wall -Wextra -Wno-unused-parameter -m64 -fno-strict-aliasing -m64 -fdata-sections -ffunction-sections -O3 -O3 -fno-omit-frame-pointer -fno-rtti -fno-exceptions -std=gnu++0x -MMD -MF /pkg/src/node-v6.11.0/out/Release/.deps//pkg/src/node-v6.11.0/out/Release/obj.target/v8_base/deps/v8/src/compiler/state-values-utils.o.d.raw -D_FORTIFY_SOURCE=2 -march=x86-64 -mtune=generic -O2 -pipe -fstack-protector-strong -c -o /pkg/src/node-v6.11.0/out/Release/obj.target/v8_base/deps/v8/src/compiler/state-values-utils.o ../deps/v8/src/compiler/state-values-utils.cc
592  [06/09/2017 11:18PM]:                  from ../deps/v8/src/compiler/state-values-utils.h:8,
593  [06/09/2017 11:18PM]:                  from ../deps/v8/src/compiler/state-values-utils.cc:5:
594  [06/09/2017 11:18PM]:   g++ -DV8_TARGET_ARCH_X64 -DENABLE_DISASSEMBLER -DV8_I18N_SUPPORT -DV8_IMMINENT_DEPRECATION_WARNINGS -DICU_UTIL_DATA_IMPL=ICU_UTIL_DATA_STATIC -I../deps/v8 -I../deps  -pthread -Wall -Wextra -Wno-unused-parameter -m64 -fno-strict-aliasing -m64 -fdata-sections -ffunction-sections -O3 -O3 -fno-omit-frame-pointer -fno-rtti -fno-exceptions -std=gnu++0x -MMD -MF /pkg/src/node-v6.11.0/out/Release/.deps//pkg/src/node-v6.11.0/out/Release/obj.target/v8_base/deps/v8/src/compiler/tail-call-optimization.o.d.raw -D_FORTIFY_SOURCE=2 -march=x86-64 -mtune=generic -O2 -pipe -fstack-protector-strong -c -o /pkg/src/node-v6.11.0/out/Release/obj.target/v8_base/deps/v8/src/compiler/tail-call-optimization.o ../deps/v8/src/compiler/tail-call-optimization.cc
595  [06/09/2017 11:18PM]:                  from ../deps/v8/src/compiler/tail-call-optimization.h:8,
596  [06/09/2017 11:18PM]:                  from ../deps/v8/src/compiler/tail-call-optimization.cc:5:
597  [06/09/2017 11:18PM]:   g++ -DV8_TARGET_ARCH_X64 -DENABLE_DISASSEMBLER -DV8_I18N_SUPPORT -DV8_IMMINENT_DEPRECATION_WARNINGS -DICU_UTIL_DATA_IMPL=ICU_UTIL_DATA_STATIC -I../deps/v8 -I../deps  -pthread -Wall -Wextra -Wno-unused-parameter -m64 -fno-strict-aliasing -m64 -fdata-sections -ffunction-sections -O3 -O3 -fno-omit-frame-pointer -fno-rtti -fno-exceptions -std=gnu++0x -MMD -MF /pkg/src/node-v6.11.0/out/Release/.deps//pkg/src/node-v6.11.0/out/Release/obj.target/v8_base/deps/v8/src/compiler/type-hint-analyzer.o.d.raw -D_FORTIFY_SOURCE=2 -march=x86-64 -mtune=generic -O2 -pipe -fstack-protector-strong -c -o /pkg/src/node-v6.11.0/out/Release/obj.target/v8_base/deps/v8/src/compiler/type-hint-analyzer.o ../deps/v8/src/compiler/type-hint-analyzer.cc
598  [06/09/2017 11:18PM]:                  from ../deps/v8/src/compiler/type-hint-analyzer.cc:7:
599  [06/09/2017 11:18PM]:                  from ../deps/v8/src/compiler/type-hint-analyzer.h:8,
600  [06/09/2017 11:18PM]:                  from ../deps/v8/src/compiler/type-hint-analyzer.cc:5:
601  [06/09/2017 11:18PM]:   g++ -DV8_TARGET_ARCH_X64 -DENABLE_DISASSEMBLER -DV8_I18N_SUPPORT -DV8_IMMINENT_DEPRECATION_WARNINGS -DICU_UTIL_DATA_IMPL=ICU_UTIL_DATA_STATIC -I../deps/v8 -I../deps  -pthread -Wall -Wextra -Wno-unused-parameter -m64 -fno-strict-aliasing -m64 -fdata-sections -ffunction-sections -O3 -O3 -fno-omit-frame-pointer -fno-rtti -fno-exceptions -std=gnu++0x -MMD -MF /pkg/src/node-v6.11.0/out/Release/.deps//pkg/src/node-v6.11.0/out/Release/obj.target/v8_base/deps/v8/src/compiler/type-hints.o.d.raw -D_FORTIFY_SOURCE=2 -march=x86-64 -mtune=generic -O2 -pipe -fstack-protector-strong -c -o /pkg/src/node-v6.11.0/out/Release/obj.target/v8_base/deps/v8/src/compiler/type-hints.o ../deps/v8/src/compiler/type-hints.cc
602  [06/09/2017 11:18PM]:   g++ -DV8_TARGET_ARCH_X64 -DENABLE_DISASSEMBLER -DV8_I18N_SUPPORT -DV8_IMMINENT_DEPRECATION_WARNINGS -DICU_UTIL_DATA_IMPL=ICU_UTIL_DATA_STATIC -I../deps/v8 -I../deps  -pthread -Wall -Wextra -Wno-unused-parameter -m64 -fno-strict-aliasing -m64 -fdata-sections -ffunction-sections -O3 -O3 -fno-omit-frame-pointer -fno-rtti -fno-exceptions -std=gnu++0x -MMD -MF /pkg/src/node-v6.11.0/out/Release/.deps//pkg/src/node-v6.11.0/out/Release/obj.target/v8_base/deps/v8/src/compiler/typer.o.d.raw -D_FORTIFY_SOURCE=2 -march=x86-64 -mtune=generic -O2 -pipe -fstack-protector-strong -c -o /pkg/src/node-v6.11.0/out/Release/obj.target/v8_base/deps/v8/src/compiler/typer.o ../deps/v8/src/compiler/typer.cc
603  [06/09/2017 11:18PM]:                  from ../deps/v8/src/compiler/typer.h:10,
604  [06/09/2017 11:18PM]:                  from ../deps/v8/src/compiler/typer.cc:5:
605  [06/09/2017 11:18PM]:                  from ../deps/v8/src/compiler/typer.h:9,
606  [06/09/2017 11:18PM]:   g++ -DV8_TARGET_ARCH_X64 -DENABLE_DISASSEMBLER -DV8_I18N_SUPPORT -DV8_IMMINENT_DEPRECATION_WARNINGS -DICU_UTIL_DATA_IMPL=ICU_UTIL_DATA_STATIC -I../deps/v8 -I../deps  -pthread -Wall -Wextra -Wno-unused-parameter -m64 -fno-strict-aliasing -m64 -fdata-sections -ffunction-sections -O3 -O3 -fno-omit-frame-pointer -fno-rtti -fno-exceptions -std=gnu++0x -MMD -MF /pkg/src/node-v6.11.0/out/Release/.deps//pkg/src/node-v6.11.0/out/Release/obj.target/v8_base/deps/v8/src/compiler/value-numbering-reducer.o.d.raw -D_FORTIFY_SOURCE=2 -march=x86-64 -mtune=generic -O2 -pipe -fstack-protector-strong -c -o /pkg/src/node-v6.11.0/out/Release/obj.target/v8_base/deps/v8/src/compiler/value-numbering-reducer.o ../deps/v8/src/compiler/value-numbering-reducer.cc
607  [06/09/2017 11:18PM]:                  from ../deps/v8/src/compiler/value-numbering-reducer.h:8,
608  [06/09/2017 11:18PM]:                  from ../deps/v8/src/compiler/value-numbering-reducer.cc:5:
609  [06/09/2017 11:18PM]:   g++ -DV8_TARGET_ARCH_X64 -DENABLE_DISASSEMBLER -DV8_I18N_SUPPORT -DV8_IMMINENT_DEPRECATION_WARNINGS -DICU_UTIL_DATA_IMPL=ICU_UTIL_DATA_STATIC -I../deps/v8 -I../deps  -pthread -Wall -Wextra -Wno-unused-parameter -m64 -fno-strict-aliasing -m64 -fdata-sections -ffunction-sections -O3 -O3 -fno-omit-frame-pointer -fno-rtti -fno-exceptions -std=gnu++0x -MMD -MF /pkg/src/node-v6.11.0/out/Release/.deps//pkg/src/node-v6.11.0/out/Release/obj.target/v8_base/deps/v8/src/compiler/verifier.o.d.raw -D_FORTIFY_SOURCE=2 -march=x86-64 -mtune=generic -O2 -pipe -fstack-protector-strong -c -o /pkg/src/node-v6.11.0/out/Release/obj.target/v8_base/deps/v8/src/compiler/verifier.o ../deps/v8/src/compiler/verifier.cc
610  [06/09/2017 11:18PM]:                  from ../deps/v8/src/compiler/verifier.cc:14:
611  [06/09/2017 11:18PM]:                  from ../deps/v8/src/compiler/verifier.cc:13:
612  [06/09/2017 11:18PM]:   g++ -DV8_TARGET_ARCH_X64 -DENABLE_DISASSEMBLER -DV8_I18N_SUPPORT -DV8_IMMINENT_DEPRECATION_WARNINGS -DICU_UTIL_DATA_IMPL=ICU_UTIL_DATA_STATIC -I../deps/v8 -I../deps  -pthread -Wall -Wextra -Wno-unused-parameter -m64 -fno-strict-aliasing -m64 -fdata-sections -ffunction-sections -O3 -O3 -fno-omit-frame-pointer -fno-rtti -fno-exceptions -std=gnu++0x -MMD -MF /pkg/src/node-v6.11.0/out/Release/.deps//pkg/src/node-v6.11.0/out/Release/obj.target/v8_base/deps/v8/src/compiler/wasm-compiler.o.d.raw -D_FORTIFY_SOURCE=2 -march=x86-64 -mtune=generic -O2 -pipe -fstack-protector-strong -c -o /pkg/src/node-v6.11.0/out/Release/obj.target/v8_base/deps/v8/src/compiler/wasm-compiler.o ../deps/v8/src/compiler/wasm-compiler.cc
613  [06/09/2017 11:18PM]:                  from ../deps/v8/src/isolate-inl.h:8,
614  [06/09/2017 11:18PM]:                  from ../deps/v8/src/compiler/wasm-compiler.cc:7:
615  [06/09/2017 11:18PM]: In file included from ../deps/v8/src/machine-type.h:11:0,
616  [06/09/2017 11:18PM]:                  from ../deps/v8/src/wasm/wasm-opcodes.h:8,
617  [06/09/2017 11:18PM]:                  from ../deps/v8/src/compiler/wasm-compiler.h:10,
618  [06/09/2017 11:18PM]:                  from ../deps/v8/src/compiler/wasm-compiler.cc:5:
619  [06/09/2017 11:18PM]:   g++ -DV8_TARGET_ARCH_X64 -DENABLE_DISASSEMBLER -DV8_I18N_SUPPORT -DV8_IMMINENT_DEPRECATION_WARNINGS -DICU_UTIL_DATA_IMPL=ICU_UTIL_DATA_STATIC -I../deps/v8 -I../deps  -pthread -Wall -Wextra -Wno-unused-parameter -m64 -fno-strict-aliasing -m64 -fdata-sections -ffunction-sections -O3 -O3 -fno-omit-frame-pointer -fno-rtti -fno-exceptions -std=gnu++0x -MMD -MF /pkg/src/node-v6.11.0/out/Release/.deps//pkg/src/node-v6.11.0/out/Release/obj.target/v8_base/deps/v8/src/compiler/wasm-linkage.o.d.raw -D_FORTIFY_SOURCE=2 -march=x86-64 -mtune=generic -O2 -pipe -fstack-protector-strong -c -o /pkg/src/node-v6.11.0/out/Release/obj.target/v8_base/deps/v8/src/compiler/wasm-linkage.o ../deps/v8/src/compiler/wasm-linkage.cc
620  [06/09/2017 11:18PM]:                  from ../deps/v8/src/compiler/wasm-linkage.cc:5:
621  [06/09/2017 11:18PM]:   g++ -DV8_TARGET_ARCH_X64 -DENABLE_DISASSEMBLER -DV8_I18N_SUPPORT -DV8_IMMINENT_DEPRECATION_WARNINGS -DICU_UTIL_DATA_IMPL=ICU_UTIL_DATA_STATIC -I../deps/v8 -I../deps  -pthread -Wall -Wextra -Wno-unused-parameter -m64 -fno-strict-aliasing -m64 -fdata-sections -ffunction-sections -O3 -O3 -fno-omit-frame-pointer -fno-rtti -fno-exceptions -std=gnu++0x -MMD -MF /pkg/src/node-v6.11.0/out/Release/.deps//pkg/src/node-v6.11.0/out/Release/obj.target/v8_base/deps/v8/src/compiler/zone-pool.o.d.raw -D_FORTIFY_SOURCE=2 -march=x86-64 -mtune=generic -O2 -pipe -fstack-protector-strong -c -o /pkg/src/node-v6.11.0/out/Release/obj.target/v8_base/deps/v8/src/compiler/zone-pool.o ../deps/v8/src/compiler/zone-pool.cc
622  [06/09/2017 11:18PM]:   g++ -DV8_TARGET_ARCH_X64 -DENABLE_DISASSEMBLER -DV8_I18N_SUPPORT -DV8_IMMINENT_DEPRECATION_WARNINGS -DICU_UTIL_DATA_IMPL=ICU_UTIL_DATA_STATIC -I../deps/v8 -I../deps  -pthread -Wall -Wextra -Wno-unused-parameter -m64 -fno-strict-aliasing -m64 -fdata-sections -ffunction-sections -O3 -O3 -fno-omit-frame-pointer -fno-rtti -fno-exceptions -std=gnu++0x -MMD -MF /pkg/src/node-v6.11.0/out/Release/.deps//pkg/src/node-v6.11.0/out/Release/obj.target/v8_base/deps/v8/src/compiler.o.d.raw -D_FORTIFY_SOURCE=2 -march=x86-64 -mtune=generic -O2 -pipe -fstack-protector-strong -c -o /pkg/src/node-v6.11.0/out/Release/obj.target/v8_base/deps/v8/src/compiler.o ../deps/v8/src/compiler.cc
623  [06/09/2017 11:18PM]:                  from ../deps/v8/src/compiler.cc:5:
624  [06/09/2017 11:18PM]:   g++ -DV8_TARGET_ARCH_X64 -DENABLE_DISASSEMBLER -DV8_I18N_SUPPORT -DV8_IMMINENT_DEPRECATION_WARNINGS -DICU_UTIL_DATA_IMPL=ICU_UTIL_DATA_STATIC -I../deps/v8 -I../deps  -pthread -Wall -Wextra -Wno-unused-parameter -m64 -fno-strict-aliasing -m64 -fdata-sections -ffunction-sections -O3 -O3 -fno-omit-frame-pointer -fno-rtti -fno-exceptions -std=gnu++0x -MMD -MF /pkg/src/node-v6.11.0/out/Release/.deps//pkg/src/node-v6.11.0/out/Release/obj.target/v8_base/deps/v8/src/context-measure.o.d.raw -D_FORTIFY_SOURCE=2 -march=x86-64 -mtune=generic -O2 -pipe -fstack-protector-strong -c -o /pkg/src/node-v6.11.0/out/Release/obj.target/v8_base/deps/v8/src/context-measure.o ../deps/v8/src/context-measure.cc
625  [06/09/2017 11:18PM]:                  from ../deps/v8/src/context-measure.h:8,
626  [06/09/2017 11:18PM]:                  from ../deps/v8/src/context-measure.cc:5:
627  [06/09/2017 11:18PM]:   g++ -DV8_TARGET_ARCH_X64 -DENABLE_DISASSEMBLER -DV8_I18N_SUPPORT -DV8_IMMINENT_DEPRECATION_WARNINGS -DICU_UTIL_DATA_IMPL=ICU_UTIL_DATA_STATIC -I../deps/v8 -I../deps  -pthread -Wall -Wextra -Wno-unused-parameter -m64 -fno-strict-aliasing -m64 -fdata-sections -ffunction-sections -O3 -O3 -fno-omit-frame-pointer -fno-rtti -fno-exceptions -std=gnu++0x -MMD -MF /pkg/src/node-v6.11.0/out/Release/.deps//pkg/src/node-v6.11.0/out/Release/obj.target/v8_base/deps/v8/src/contexts.o.d.raw -D_FORTIFY_SOURCE=2 -march=x86-64 -mtune=generic -O2 -pipe -fstack-protector-strong -c -o /pkg/src/node-v6.11.0/out/Release/obj.target/v8_base/deps/v8/src/contexts.o ../deps/v8/src/contexts.cc
628  [06/09/2017 11:18PM]:                  from ../deps/v8/src/contexts.cc:5:
629  [06/09/2017 11:18PM]: In file included from ../deps/v8/src/heap/heap.h:13:0,
630  [06/09/2017 11:18PM]:   g++ -DV8_TARGET_ARCH_X64 -DENABLE_DISASSEMBLER -DV8_I18N_SUPPORT -DV8_IMMINENT_DEPRECATION_WARNINGS -DICU_UTIL_DATA_IMPL=ICU_UTIL_DATA_STATIC -I../deps/v8 -I../deps  -pthread -Wall -Wextra -Wno-unused-parameter -m64 -fno-strict-aliasing -m64 -fdata-sections -ffunction-sections -O3 -O3 -fno-omit-frame-pointer -fno-rtti -fno-exceptions -std=gnu++0x -MMD -MF /pkg/src/node-v6.11.0/out/Release/.deps//pkg/src/node-v6.11.0/out/Release/obj.target/v8_base/deps/v8/src/conversions.o.d.raw -D_FORTIFY_SOURCE=2 -march=x86-64 -mtune=generic -O2 -pipe -fstack-protector-strong -c -o /pkg/src/node-v6.11.0/out/Release/obj.target/v8_base/deps/v8/src/conversions.o ../deps/v8/src/conversions.cc
631  [06/09/2017 11:18PM]:                  from ../deps/v8/src/conversions.cc:13:
632  [06/09/2017 11:18PM]:                  from ../deps/v8/src/conversions.h:11,
633  [06/09/2017 11:18PM]:                  from ../deps/v8/src/conversions.cc:5:
634  [06/09/2017 11:18PM]: ../deps/v8/src/conversions.cc: At global scope:
635  [06/09/2017 11:18PM]: ../deps/v8/src/conversions.cc:57:10: warning: uint16_t v8::internal::{anonymous}::StringCharacterStreamIterator::operator*() const defined but not used [-Wunused-function]
636  [06/09/2017 11:18PM]:  uint16_t StringCharacterStreamIterator::operator*() const {
637  [06/09/2017 11:18PM]:           ^~~~~~~~~~~~~~~~~~~~~~~~~~~~~
638  [06/09/2017 11:18PM]: ../deps/v8/src/conversions.cc:52:1: warning: v8::internal::{anonymous}::StringCharacterStreamIterator::StringCharacterStreamIterator(v8::internal::StringCharacterStream*) defined but not used [-Wunused-function]
639  [06/09/2017 11:18PM]:  StringCharacterStreamIterator::StringCharacterStreamIterator(
640  [06/09/2017 11:18PM]:  ^~~~~~~~~~~~~~~~~~~~~~~~~~~~~
641  [06/09/2017 11:18PM]:   g++ -DV8_TARGET_ARCH_X64 -DENABLE_DISASSEMBLER -DV8_I18N_SUPPORT -DV8_IMMINENT_DEPRECATION_WARNINGS -DICU_UTIL_DATA_IMPL=ICU_UTIL_DATA_STATIC -I../deps/v8 -I../deps  -pthread -Wall -Wextra -Wno-unused-parameter -m64 -fno-strict-aliasing -m64 -fdata-sections -ffunction-sections -O3 -O3 -fno-omit-frame-pointer -fno-rtti -fno-exceptions -std=gnu++0x -MMD -MF /pkg/src/node-v6.11.0/out/Release/.deps//pkg/src/node-v6.11.0/out/Release/obj.target/v8_base/deps/v8/src/counters.o.d.raw -D_FORTIFY_SOURCE=2 -march=x86-64 -mtune=generic -O2 -pipe -fstack-protector-strong -c -o /pkg/src/node-v6.11.0/out/Release/obj.target/v8_base/deps/v8/src/counters.o ../deps/v8/src/counters.cc
642  [06/09/2017 11:18PM]: In file included from ../deps/v8/src/counters.h:14:0,
643  [06/09/2017 11:18PM]:                  from ../deps/v8/src/counters.cc:5:
644  [06/09/2017 11:18PM]: In file included from ../deps/v8/src/counters.h:8:0,
645  [06/09/2017 11:18PM]:   g++ -DV8_TARGET_ARCH_X64 -DENABLE_DISASSEMBLER -DV8_I18N_SUPPORT -DV8_IMMINENT_DEPRECATION_WARNINGS -DICU_UTIL_DATA_IMPL=ICU_UTIL_DATA_STATIC -I../deps/v8 -I../deps  -pthread -Wall -Wextra -Wno-unused-parameter -m64 -fno-strict-aliasing -m64 -fdata-sections -ffunction-sections -O3 -O3 -fno-omit-frame-pointer -fno-rtti -fno-exceptions -std=gnu++0x -MMD -MF /pkg/src/node-v6.11.0/out/Release/.deps//pkg/src/node-v6.11.0/out/Release/obj.target/v8_base/deps/v8/src/crankshaft/compilation-phase.o.d.raw -D_FORTIFY_SOURCE=2 -march=x86-64 -mtune=generic -O2 -pipe -fstack-protector-strong -c -o /pkg/src/node-v6.11.0/out/Release/obj.target/v8_base/deps/v8/src/crankshaft/compilation-phase.o ../deps/v8/src/crankshaft/compilation-phase.cc
646  [06/09/2017 11:18PM]:                  from ../deps/v8/src/crankshaft/compilation-phase.h:9,
647  [06/09/2017 11:18PM]:                  from ../deps/v8/src/crankshaft/compilation-phase.cc:5:
648  [06/09/2017 11:18PM]:                  from ../deps/v8/src/crankshaft/compilation-phase.h:8,
649  [06/09/2017 11:18PM]:   g++ -DV8_TARGET_ARCH_X64 -DENABLE_DISASSEMBLER -DV8_I18N_SUPPORT -DV8_IMMINENT_DEPRECATION_WARNINGS -DICU_UTIL_DATA_IMPL=ICU_UTIL_DATA_STATIC -I../deps/v8 -I../deps  -pthread -Wall -Wextra -Wno-unused-parameter -m64 -fno-strict-aliasing -m64 -fdata-sections -ffunction-sections -O3 -O3 -fno-omit-frame-pointer -fno-rtti -fno-exceptions -std=gnu++0x -MMD -MF /pkg/src/node-v6.11.0/out/Release/.deps//pkg/src/node-v6.11.0/out/Release/obj.target/v8_base/deps/v8/src/crankshaft/hydrogen-bce.o.d.raw -D_FORTIFY_SOURCE=2 -march=x86-64 -mtune=generic -O2 -pipe -fstack-protector-strong -c -o /pkg/src/node-v6.11.0/out/Release/obj.target/v8_base/deps/v8/src/crankshaft/hydrogen-bce.o ../deps/v8/src/crankshaft/hydrogen-bce.cc
650  [06/09/2017 11:18PM]:                  from ../deps/v8/src/crankshaft/hydrogen.h:10,
651  [06/09/2017 11:18PM]:                  from ../deps/v8/src/crankshaft/hydrogen-bce.h:8,
652  [06/09/2017 11:18PM]:                  from ../deps/v8/src/crankshaft/hydrogen-bce.cc:5:
653  [06/09/2017 11:18PM]:                  from ../deps/v8/src/crankshaft/hydrogen.h:8,
654  [06/09/2017 11:19PM]:   g++ -DV8_TARGET_ARCH_X64 -DENABLE_DISASSEMBLER -DV8_I18N_SUPPORT -DV8_IMMINENT_DEPRECATION_WARNINGS -DICU_UTIL_DATA_IMPL=ICU_UTIL_DATA_STATIC -I../deps/v8 -I../deps  -pthread -Wall -Wextra -Wno-unused-parameter -m64 -fno-strict-aliasing -m64 -fdata-sections -ffunction-sections -O3 -O3 -fno-omit-frame-pointer -fno-rtti -fno-exceptions -std=gnu++0x -MMD -MF /pkg/src/node-v6.11.0/out/Release/.deps//pkg/src/node-v6.11.0/out/Release/obj.target/v8_base/deps/v8/src/crankshaft/hydrogen-canonicalize.o.d.raw -D_FORTIFY_SOURCE=2 -march=x86-64 -mtune=generic -O2 -pipe -fstack-protector-strong -c -o /pkg/src/node-v6.11.0/out/Release/obj.target/v8_base/deps/v8/src/crankshaft/hydrogen-canonicalize.o ../deps/v8/src/crankshaft/hydrogen-canonicalize.cc
655  [06/09/2017 11:19PM]:                  from ../deps/v8/src/crankshaft/hydrogen-canonicalize.h:8,
656  [06/09/2017 11:19PM]:                  from ../deps/v8/src/crankshaft/hydrogen-canonicalize.cc:5:
657  [06/09/2017 11:19PM]:   g++ -DV8_TARGET_ARCH_X64 -DENABLE_DISASSEMBLER -DV8_I18N_SUPPORT -DV8_IMMINENT_DEPRECATION_WARNINGS -DICU_UTIL_DATA_IMPL=ICU_UTIL_DATA_STATIC -I../deps/v8 -I../deps  -pthread -Wall -Wextra -Wno-unused-parameter -m64 -fno-strict-aliasing -m64 -fdata-sections -ffunction-sections -O3 -O3 -fno-omit-frame-pointer -fno-rtti -fno-exceptions -std=gnu++0x -MMD -MF /pkg/src/node-v6.11.0/out/Release/.deps//pkg/src/node-v6.11.0/out/Release/obj.target/v8_base/deps/v8/src/crankshaft/hydrogen-check-elimination.o.d.raw -D_FORTIFY_SOURCE=2 -march=x86-64 -mtune=generic -O2 -pipe -fstack-protector-strong -c -o /pkg/src/node-v6.11.0/out/Release/obj.target/v8_base/deps/v8/src/crankshaft/hydrogen-check-elimination.o ../deps/v8/src/crankshaft/hydrogen-check-elimination.cc
658  [06/09/2017 11:19PM]:                  from ../deps/v8/src/crankshaft/hydrogen-check-elimination.h:8,
659  [06/09/2017 11:19PM]:                  from ../deps/v8/src/crankshaft/hydrogen-check-elimination.cc:5:
660  [06/09/2017 11:19PM]:   g++ -DV8_TARGET_ARCH_X64 -DENABLE_DISASSEMBLER -DV8_I18N_SUPPORT -DV8_IMMINENT_DEPRECATION_WARNINGS -DICU_UTIL_DATA_IMPL=ICU_UTIL_DATA_STATIC -I../deps/v8 -I../deps  -pthread -Wall -Wextra -Wno-unused-parameter -m64 -fno-strict-aliasing -m64 -fdata-sections -ffunction-sections -O3 -O3 -fno-omit-frame-pointer -fno-rtti -fno-exceptions -std=gnu++0x -MMD -MF /pkg/src/node-v6.11.0/out/Release/.deps//pkg/src/node-v6.11.0/out/Release/obj.target/v8_base/deps/v8/src/crankshaft/hydrogen-dce.o.d.raw -D_FORTIFY_SOURCE=2 -march=x86-64 -mtune=generic -O2 -pipe -fstack-protector-strong -c -o /pkg/src/node-v6.11.0/out/Release/obj.target/v8_base/deps/v8/src/crankshaft/hydrogen-dce.o ../deps/v8/src/crankshaft/hydrogen-dce.cc
661  [06/09/2017 11:19PM]:                  from ../deps/v8/src/crankshaft/hydrogen-dce.h:8,
662  [06/09/2017 11:19PM]:                  from ../deps/v8/src/crankshaft/hydrogen-dce.cc:5:
663  [06/09/2017 11:19PM]:   g++ -DV8_TARGET_ARCH_X64 -DENABLE_DISASSEMBLER -DV8_I18N_SUPPORT -DV8_IMMINENT_DEPRECATION_WARNINGS -DICU_UTIL_DATA_IMPL=ICU_UTIL_DATA_STATIC -I../deps/v8 -I../deps  -pthread -Wall -Wextra -Wno-unused-parameter -m64 -fno-strict-aliasing -m64 -fdata-sections -ffunction-sections -O3 -O3 -fno-omit-frame-pointer -fno-rtti -fno-exceptions -std=gnu++0x -MMD -MF /pkg/src/node-v6.11.0/out/Release/.deps//pkg/src/node-v6.11.0/out/Release/obj.target/v8_base/deps/v8/src/crankshaft/hydrogen-dehoist.o.d.raw -D_FORTIFY_SOURCE=2 -march=x86-64 -mtune=generic -O2 -pipe -fstack-protector-strong -c -o /pkg/src/node-v6.11.0/out/Release/obj.target/v8_base/deps/v8/src/crankshaft/hydrogen-dehoist.o ../deps/v8/src/crankshaft/hydrogen-dehoist.cc
664  [06/09/2017 11:19PM]:                  from ../deps/v8/src/crankshaft/hydrogen-dehoist.h:8,
665  [06/09/2017 11:19PM]:                  from ../deps/v8/src/crankshaft/hydrogen-dehoist.cc:5:
666  [06/09/2017 11:19PM]:   g++ -DV8_TARGET_ARCH_X64 -DENABLE_DISASSEMBLER -DV8_I18N_SUPPORT -DV8_IMMINENT_DEPRECATION_WARNINGS -DICU_UTIL_DATA_IMPL=ICU_UTIL_DATA_STATIC -I../deps/v8 -I../deps  -pthread -Wall -Wextra -Wno-unused-parameter -m64 -fno-strict-aliasing -m64 -fdata-sections -ffunction-sections -O3 -O3 -fno-omit-frame-pointer -fno-rtti -fno-exceptions -std=gnu++0x -MMD -MF /pkg/src/node-v6.11.0/out/Release/.deps//pkg/src/node-v6.11.0/out/Release/obj.target/v8_base/deps/v8/src/crankshaft/hydrogen-environment-liveness.o.d.raw -D_FORTIFY_SOURCE=2 -march=x86-64 -mtune=generic -O2 -pipe -fstack-protector-strong -c -o /pkg/src/node-v6.11.0/out/Release/obj.target/v8_base/deps/v8/src/crankshaft/hydrogen-environment-liveness.o ../deps/v8/src/crankshaft/hydrogen-environment-liveness.cc
667  [06/09/2017 11:19PM]:                  from ../deps/v8/src/crankshaft/hydrogen-environment-liveness.h:8,
668  [06/09/2017 11:19PM]:                  from ../deps/v8/src/crankshaft/hydrogen-environment-liveness.cc:6:
669  [06/09/2017 11:19PM]:   g++ -DV8_TARGET_ARCH_X64 -DENABLE_DISASSEMBLER -DV8_I18N_SUPPORT -DV8_IMMINENT_DEPRECATION_WARNINGS -DICU_UTIL_DATA_IMPL=ICU_UTIL_DATA_STATIC -I../deps/v8 -I../deps  -pthread -Wall -Wextra -Wno-unused-parameter -m64 -fno-strict-aliasing -m64 -fdata-sections -ffunction-sections -O3 -O3 -fno-omit-frame-pointer -fno-rtti -fno-exceptions -std=gnu++0x -MMD -MF /pkg/src/node-v6.11.0/out/Release/.deps//pkg/src/node-v6.11.0/out/Release/obj.target/v8_base/deps/v8/src/crankshaft/hydrogen-escape-analysis.o.d.raw -D_FORTIFY_SOURCE=2 -march=x86-64 -mtune=generic -O2 -pipe -fstack-protector-strong -c -o /pkg/src/node-v6.11.0/out/Release/obj.target/v8_base/deps/v8/src/crankshaft/hydrogen-escape-analysis.o ../deps/v8/src/crankshaft/hydrogen-escape-analysis.cc
670  [06/09/2017 11:19PM]:                  from ../deps/v8/src/crankshaft/hydrogen-escape-analysis.h:9,
671  [06/09/2017 11:19PM]:                  from ../deps/v8/src/crankshaft/hydrogen-escape-analysis.cc:5:
672  [06/09/2017 11:19PM]:                  from ../deps/v8/src/crankshaft/hydrogen-escape-analysis.h:8,
673  [06/09/2017 11:19PM]:   g++ -DV8_TARGET_ARCH_X64 -DENABLE_DISASSEMBLER -DV8_I18N_SUPPORT -DV8_IMMINENT_DEPRECATION_WARNINGS -DICU_UTIL_DATA_IMPL=ICU_UTIL_DATA_STATIC -I../deps/v8 -I../deps  -pthread -Wall -Wextra -Wno-unused-parameter -m64 -fno-strict-aliasing -m64 -fdata-sections -ffunction-sections -O3 -O3 -fno-omit-frame-pointer -fno-rtti -fno-exceptions -std=gnu++0x -MMD -MF /pkg/src/node-v6.11.0/out/Release/.deps//pkg/src/node-v6.11.0/out/Release/obj.target/v8_base/deps/v8/src/crankshaft/hydrogen-gvn.o.d.raw -D_FORTIFY_SOURCE=2 -march=x86-64 -mtune=generic -O2 -pipe -fstack-protector-strong -c -o /pkg/src/node-v6.11.0/out/Release/obj.target/v8_base/deps/v8/src/crankshaft/hydrogen-gvn.o ../deps/v8/src/crankshaft/hydrogen-gvn.cc
674  [06/09/2017 11:19PM]:                  from ../deps/v8/src/crankshaft/hydrogen-gvn.h:10,
675  [06/09/2017 11:19PM]:                  from ../deps/v8/src/crankshaft/hydrogen-gvn.cc:5:
676  [06/09/2017 11:19PM]:   g++ -DV8_TARGET_ARCH_X64 -DENABLE_DISASSEMBLER -DV8_I18N_SUPPORT -DV8_IMMINENT_DEPRECATION_WARNINGS -DICU_UTIL_DATA_IMPL=ICU_UTIL_DATA_STATIC -I../deps/v8 -I../deps  -pthread -Wall -Wextra -Wno-unused-parameter -m64 -fno-strict-aliasing -m64 -fdata-sections -ffunction-sections -O3 -O3 -fno-omit-frame-pointer -fno-rtti -fno-exceptions -std=gnu++0x -MMD -MF /pkg/src/node-v6.11.0/out/Release/.deps//pkg/src/node-v6.11.0/out/Release/obj.target/v8_base/deps/v8/src/crankshaft/hydrogen-infer-representation.o.d.raw -D_FORTIFY_SOURCE=2 -march=x86-64 -mtune=generic -O2 -pipe -fstack-protector-strong -c -o /pkg/src/node-v6.11.0/out/Release/obj.target/v8_base/deps/v8/src/crankshaft/hydrogen-infer-representation.o ../deps/v8/src/crankshaft/hydrogen-infer-representation.cc
677  [06/09/2017 11:19PM]:                  from ../deps/v8/src/crankshaft/hydrogen-infer-representation.h:8,
678  [06/09/2017 11:19PM]:                  from ../deps/v8/src/crankshaft/hydrogen-infer-representation.cc:5:
679  [06/09/2017 11:19PM]:   g++ -DV8_TARGET_ARCH_X64 -DENABLE_DISASSEMBLER -DV8_I18N_SUPPORT -DV8_IMMINENT_DEPRECATION_WARNINGS -DICU_UTIL_DATA_IMPL=ICU_UTIL_DATA_STATIC -I../deps/v8 -I../deps  -pthread -Wall -Wextra -Wno-unused-parameter -m64 -fno-strict-aliasing -m64 -fdata-sections -ffunction-sections -O3 -O3 -fno-omit-frame-pointer -fno-rtti -fno-exceptions -std=gnu++0x -MMD -MF /pkg/src/node-v6.11.0/out/Release/.deps//pkg/src/node-v6.11.0/out/Release/obj.target/v8_base/deps/v8/src/crankshaft/hydrogen-infer-types.o.d.raw -D_FORTIFY_SOURCE=2 -march=x86-64 -mtune=generic -O2 -pipe -fstack-protector-strong -c -o /pkg/src/node-v6.11.0/out/Release/obj.target/v8_base/deps/v8/src/crankshaft/hydrogen-infer-types.o ../deps/v8/src/crankshaft/hydrogen-infer-types.cc
680  [06/09/2017 11:19PM]:                  from ../deps/v8/src/crankshaft/hydrogen-infer-types.h:8,
681  [06/09/2017 11:19PM]:                  from ../deps/v8/src/crankshaft/hydrogen-infer-types.cc:5:
682  [06/09/2017 11:19PM]:   g++ -DV8_TARGET_ARCH_X64 -DENABLE_DISASSEMBLER -DV8_I18N_SUPPORT -DV8_IMMINENT_DEPRECATION_WARNINGS -DICU_UTIL_DATA_IMPL=ICU_UTIL_DATA_STATIC -I../deps/v8 -I../deps  -pthread -Wall -Wextra -Wno-unused-parameter -m64 -fno-strict-aliasing -m64 -fdata-sections -ffunction-sections -O3 -O3 -fno-omit-frame-pointer -fno-rtti -fno-exceptions -std=gnu++0x -MMD -MF /pkg/src/node-v6.11.0/out/Release/.deps//pkg/src/node-v6.11.0/out/Release/obj.target/v8_base/deps/v8/src/crankshaft/hydrogen-instructions.o.d.raw -D_FORTIFY_SOURCE=2 -march=x86-64 -mtune=generic -O2 -pipe -fstack-protector-strong -c -o /pkg/src/node-v6.11.0/out/Release/obj.target/v8_base/deps/v8/src/crankshaft/hydrogen-instructions.o ../deps/v8/src/crankshaft/hydrogen-instructions.cc
683  [06/09/2017 11:19PM]:                  from ../deps/v8/src/crankshaft/hydrogen-instructions.h:14,
684  [06/09/2017 11:19PM]:                  from ../deps/v8/src/crankshaft/hydrogen-instructions.cc:5:
685  [06/09/2017 11:19PM]:                  from ../deps/v8/src/crankshaft/hydrogen-instructions.h:11,
686  [06/09/2017 11:19PM]:   g++ -DV8_TARGET_ARCH_X64 -DENABLE_DISASSEMBLER -DV8_I18N_SUPPORT -DV8_IMMINENT_DEPRECATION_WARNINGS -DICU_UTIL_DATA_IMPL=ICU_UTIL_DATA_STATIC -I../deps/v8 -I../deps  -pthread -Wall -Wextra -Wno-unused-parameter -m64 -fno-strict-aliasing -m64 -fdata-sections -ffunction-sections -O3 -O3 -fno-omit-frame-pointer -fno-rtti -fno-exceptions -std=gnu++0x -MMD -MF /pkg/src/node-v6.11.0/out/Release/.deps//pkg/src/node-v6.11.0/out/Release/obj.target/v8_base/deps/v8/src/crankshaft/hydrogen-load-elimination.o.d.raw -D_FORTIFY_SOURCE=2 -march=x86-64 -mtune=generic -O2 -pipe -fstack-protector-strong -c -o /pkg/src/node-v6.11.0/out/Release/obj.target/v8_base/deps/v8/src/crankshaft/hydrogen-load-elimination.o ../deps/v8/src/crankshaft/hydrogen-load-elimination.cc
687  [06/09/2017 11:19PM]:                  from ../deps/v8/src/crankshaft/hydrogen-load-elimination.h:8,
688  [06/09/2017 11:19PM]:                  from ../deps/v8/src/crankshaft/hydrogen-load-elimination.cc:5:
689  [06/09/2017 11:19PM]:   g++ -DV8_TARGET_ARCH_X64 -DENABLE_DISASSEMBLER -DV8_I18N_SUPPORT -DV8_IMMINENT_DEPRECATION_WARNINGS -DICU_UTIL_DATA_IMPL=ICU_UTIL_DATA_STATIC -I../deps/v8 -I../deps  -pthread -Wall -Wextra -Wno-unused-parameter -m64 -fno-strict-aliasing -m64 -fdata-sections -ffunction-sections -O3 -O3 -fno-omit-frame-pointer -fno-rtti -fno-exceptions -std=gnu++0x -MMD -MF /pkg/src/node-v6.11.0/out/Release/.deps//pkg/src/node-v6.11.0/out/Release/obj.target/v8_base/deps/v8/src/crankshaft/hydrogen-mark-deoptimize.o.d.raw -D_FORTIFY_SOURCE=2 -march=x86-64 -mtune=generic -O2 -pipe -fstack-protector-strong -c -o /pkg/src/node-v6.11.0/out/Release/obj.target/v8_base/deps/v8/src/crankshaft/hydrogen-mark-deoptimize.o ../deps/v8/src/crankshaft/hydrogen-mark-deoptimize.cc
690  [06/09/2017 11:19PM]:                  from ../deps/v8/src/crankshaft/hydrogen-mark-deoptimize.h:8,
691  [06/09/2017 11:19PM]:                  from ../deps/v8/src/crankshaft/hydrogen-mark-deoptimize.cc:5:
692  [06/09/2017 11:19PM]:   g++ -DV8_TARGET_ARCH_X64 -DENABLE_DISASSEMBLER -DV8_I18N_SUPPORT -DV8_IMMINENT_DEPRECATION_WARNINGS -DICU_UTIL_DATA_IMPL=ICU_UTIL_DATA_STATIC -I../deps/v8 -I../deps  -pthread -Wall -Wextra -Wno-unused-parameter -m64 -fno-strict-aliasing -m64 -fdata-sections -ffunction-sections -O3 -O3 -fno-omit-frame-pointer -fno-rtti -fno-exceptions -std=gnu++0x -MMD -MF /pkg/src/node-v6.11.0/out/Release/.deps//pkg/src/node-v6.11.0/out/Release/obj.target/v8_base/deps/v8/src/crankshaft/hydrogen-mark-unreachable.o.d.raw -D_FORTIFY_SOURCE=2 -march=x86-64 -mtune=generic -O2 -pipe -fstack-protector-strong -c -o /pkg/src/node-v6.11.0/out/Release/obj.target/v8_base/deps/v8/src/crankshaft/hydrogen-mark-unreachable.o ../deps/v8/src/crankshaft/hydrogen-mark-unreachable.cc
693  [06/09/2017 11:19PM]:                  from ../deps/v8/src/crankshaft/hydrogen-mark-unreachable.h:8,
694  [06/09/2017 11:19PM]:                  from ../deps/v8/src/crankshaft/hydrogen-mark-unreachable.cc:5:
695  [06/09/2017 11:19PM]:   g++ -DV8_TARGET_ARCH_X64 -DENABLE_DISASSEMBLER -DV8_I18N_SUPPORT -DV8_IMMINENT_DEPRECATION_WARNINGS -DICU_UTIL_DATA_IMPL=ICU_UTIL_DATA_STATIC -I../deps/v8 -I../deps  -pthread -Wall -Wextra -Wno-unused-parameter -m64 -fno-strict-aliasing -m64 -fdata-sections -ffunction-sections -O3 -O3 -fno-omit-frame-pointer -fno-rtti -fno-exceptions -std=gnu++0x -MMD -MF /pkg/src/node-v6.11.0/out/Release/.deps//pkg/src/node-v6.11.0/out/Release/obj.target/v8_base/deps/v8/src/crankshaft/hydrogen-osr.o.d.raw -D_FORTIFY_SOURCE=2 -march=x86-64 -mtune=generic -O2 -pipe -fstack-protector-strong -c -o /pkg/src/node-v6.11.0/out/Release/obj.target/v8_base/deps/v8/src/crankshaft/hydrogen-osr.o ../deps/v8/src/crankshaft/hydrogen-osr.cc
696  [06/09/2017 11:19PM]:                  from ../deps/v8/src/crankshaft/hydrogen-osr.h:8,
697  [06/09/2017 11:19PM]:                  from ../deps/v8/src/crankshaft/hydrogen-osr.cc:5:
698  [06/09/2017 11:19PM]:   g++ -DV8_TARGET_ARCH_X64 -DENABLE_DISASSEMBLER -DV8_I18N_SUPPORT -DV8_IMMINENT_DEPRECATION_WARNINGS -DICU_UTIL_DATA_IMPL=ICU_UTIL_DATA_STATIC -I../deps/v8 -I../deps  -pthread -Wall -Wextra -Wno-unused-parameter -m64 -fno-strict-aliasing -m64 -fdata-sections -ffunction-sections -O3 -O3 -fno-omit-frame-pointer -fno-rtti -fno-exceptions -std=gnu++0x -MMD -MF /pkg/src/node-v6.11.0/out/Release/.deps//pkg/src/node-v6.11.0/out/Release/obj.target/v8_base/deps/v8/src/crankshaft/hydrogen-range-analysis.o.d.raw -D_FORTIFY_SOURCE=2 -march=x86-64 -mtune=generic -O2 -pipe -fstack-protector-strong -c -o /pkg/src/node-v6.11.0/out/Release/obj.target/v8_base/deps/v8/src/crankshaft/hydrogen-range-analysis.o ../deps/v8/src/crankshaft/hydrogen-range-analysis.cc
699  [06/09/2017 11:20PM]:                  from ../deps/v8/src/crankshaft/hydrogen-range-analysis.h:8,
700  [06/09/2017 11:20PM]:                  from ../deps/v8/src/crankshaft/hydrogen-range-analysis.cc:5:
701  [06/09/2017 11:20PM]:   g++ -DV8_TARGET_ARCH_X64 -DENABLE_DISASSEMBLER -DV8_I18N_SUPPORT -DV8_IMMINENT_DEPRECATION_WARNINGS -DICU_UTIL_DATA_IMPL=ICU_UTIL_DATA_STATIC -I../deps/v8 -I../deps  -pthread -Wall -Wextra -Wno-unused-parameter -m64 -fno-strict-aliasing -m64 -fdata-sections -ffunction-sections -O3 -O3 -fno-omit-frame-pointer -fno-rtti -fno-exceptions -std=gnu++0x -MMD -MF /pkg/src/node-v6.11.0/out/Release/.deps//pkg/src/node-v6.11.0/out/Release/obj.target/v8_base/deps/v8/src/crankshaft/hydrogen-redundant-phi.o.d.raw -D_FORTIFY_SOURCE=2 -march=x86-64 -mtune=generic -O2 -pipe -fstack-protector-strong -c -o /pkg/src/node-v6.11.0/out/Release/obj.target/v8_base/deps/v8/src/crankshaft/hydrogen-redundant-phi.o ../deps/v8/src/crankshaft/hydrogen-redundant-phi.cc
702  [06/09/2017 11:20PM]:                  from ../deps/v8/src/crankshaft/hydrogen-redundant-phi.h:8,
703  [06/09/2017 11:20PM]:                  from ../deps/v8/src/crankshaft/hydrogen-redundant-phi.cc:5:
704  [06/09/2017 11:20PM]:   g++ -DV8_TARGET_ARCH_X64 -DENABLE_DISASSEMBLER -DV8_I18N_SUPPORT -DV8_IMMINENT_DEPRECATION_WARNINGS -DICU_UTIL_DATA_IMPL=ICU_UTIL_DATA_STATIC -I../deps/v8 -I../deps  -pthread -Wall -Wextra -Wno-unused-parameter -m64 -fno-strict-aliasing -m64 -fdata-sections -ffunction-sections -O3 -O3 -fno-omit-frame-pointer -fno-rtti -fno-exceptions -std=gnu++0x -MMD -MF /pkg/src/node-v6.11.0/out/Release/.deps//pkg/src/node-v6.11.0/out/Release/obj.target/v8_base/deps/v8/src/crankshaft/hydrogen-removable-simulates.o.d.raw -D_FORTIFY_SOURCE=2 -march=x86-64 -mtune=generic -O2 -pipe -fstack-protector-strong -c -o /pkg/src/node-v6.11.0/out/Release/obj.target/v8_base/deps/v8/src/crankshaft/hydrogen-removable-simulates.o ../deps/v8/src/crankshaft/hydrogen-removable-simulates.cc
705  [06/09/2017 11:20PM]:                  from ../deps/v8/src/crankshaft/hydrogen-removable-simulates.h:8,
706  [06/09/2017 11:20PM]:                  from ../deps/v8/src/crankshaft/hydrogen-removable-simulates.cc:5:
707  [06/09/2017 11:20PM]:   g++ -DV8_TARGET_ARCH_X64 -DENABLE_DISASSEMBLER -DV8_I18N_SUPPORT -DV8_IMMINENT_DEPRECATION_WARNINGS -DICU_UTIL_DATA_IMPL=ICU_UTIL_DATA_STATIC -I../deps/v8 -I../deps  -pthread -Wall -Wextra -Wno-unused-parameter -m64 -fno-strict-aliasing -m64 -fdata-sections -ffunction-sections -O3 -O3 -fno-omit-frame-pointer -fno-rtti -fno-exceptions -std=gnu++0x -MMD -MF /pkg/src/node-v6.11.0/out/Release/.deps//pkg/src/node-v6.11.0/out/Release/obj.target/v8_base/deps/v8/src/crankshaft/hydrogen-representation-changes.o.d.raw -D_FORTIFY_SOURCE=2 -march=x86-64 -mtune=generic -O2 -pipe -fstack-protector-strong -c -o /pkg/src/node-v6.11.0/out/Release/obj.target/v8_base/deps/v8/src/crankshaft/hydrogen-representation-changes.o ../deps/v8/src/crankshaft/hydrogen-representation-changes.cc
708  [06/09/2017 11:20PM]:                  from ../deps/v8/src/crankshaft/hydrogen-representation-changes.h:8,
709  [06/09/2017 11:20PM]:                  from ../deps/v8/src/crankshaft/hydrogen-representation-changes.cc:5:
710  [06/09/2017 11:20PM]:   g++ -DV8_TARGET_ARCH_X64 -DENABLE_DISASSEMBLER -DV8_I18N_SUPPORT -DV8_IMMINENT_DEPRECATION_WARNINGS -DICU_UTIL_DATA_IMPL=ICU_UTIL_DATA_STATIC -I../deps/v8 -I../deps  -pthread -Wall -Wextra -Wno-unused-parameter -m64 -fno-strict-aliasing -m64 -fdata-sections -ffunction-sections -O3 -O3 -fno-omit-frame-pointer -fno-rtti -fno-exceptions -std=gnu++0x -MMD -MF /pkg/src/node-v6.11.0/out/Release/.deps//pkg/src/node-v6.11.0/out/Release/obj.target/v8_base/deps/v8/src/crankshaft/hydrogen-sce.o.d.raw -D_FORTIFY_SOURCE=2 -march=x86-64 -mtune=generic -O2 -pipe -fstack-protector-strong -c -o /pkg/src/node-v6.11.0/out/Release/obj.target/v8_base/deps/v8/src/crankshaft/hydrogen-sce.o ../deps/v8/src/crankshaft/hydrogen-sce.cc
711  [06/09/2017 11:20PM]:                  from ../deps/v8/src/crankshaft/hydrogen-sce.h:8,
712  [06/09/2017 11:20PM]:                  from ../deps/v8/src/crankshaft/hydrogen-sce.cc:5:
713  [06/09/2017 11:20PM]:   g++ -DV8_TARGET_ARCH_X64 -DENABLE_DISASSEMBLER -DV8_I18N_SUPPORT -DV8_IMMINENT_DEPRECATION_WARNINGS -DICU_UTIL_DATA_IMPL=ICU_UTIL_DATA_STATIC -I../deps/v8 -I../deps  -pthread -Wall -Wextra -Wno-unused-parameter -m64 -fno-strict-aliasing -m64 -fdata-sections -ffunction-sections -O3 -O3 -fno-omit-frame-pointer -fno-rtti -fno-exceptions -std=gnu++0x -MMD -MF /pkg/src/node-v6.11.0/out/Release/.deps//pkg/src/node-v6.11.0/out/Release/obj.target/v8_base/deps/v8/src/crankshaft/hydrogen-store-elimination.o.d.raw -D_FORTIFY_SOURCE=2 -march=x86-64 -mtune=generic -O2 -pipe -fstack-protector-strong -c -o /pkg/src/node-v6.11.0/out/Release/obj.target/v8_base/deps/v8/src/crankshaft/hydrogen-store-elimination.o ../deps/v8/src/crankshaft/hydrogen-store-elimination.cc
714  [06/09/2017 11:20PM]:                  from ../deps/v8/src/crankshaft/hydrogen-store-elimination.h:8,
715  [06/09/2017 11:20PM]:                  from ../deps/v8/src/crankshaft/hydrogen-store-elimination.cc:5:
716  [06/09/2017 11:20PM]:   g++ -DV8_TARGET_ARCH_X64 -DENABLE_DISASSEMBLER -DV8_I18N_SUPPORT -DV8_IMMINENT_DEPRECATION_WARNINGS -DICU_UTIL_DATA_IMPL=ICU_UTIL_DATA_STATIC -I../deps/v8 -I../deps  -pthread -Wall -Wextra -Wno-unused-parameter -m64 -fno-strict-aliasing -m64 -fdata-sections -ffunction-sections -O3 -O3 -fno-omit-frame-pointer -fno-rtti -fno-exceptions -std=gnu++0x -MMD -MF /pkg/src/node-v6.11.0/out/Release/.deps//pkg/src/node-v6.11.0/out/Release/obj.target/v8_base/deps/v8/src/crankshaft/hydrogen-types.o.d.raw -D_FORTIFY_SOURCE=2 -march=x86-64 -mtune=generic -O2 -pipe -fstack-protector-strong -c -o /pkg/src/node-v6.11.0/out/Release/obj.target/v8_base/deps/v8/src/crankshaft/hydrogen-types.o ../deps/v8/src/crankshaft/hydrogen-types.cc
717  [06/09/2017 11:20PM]:                  from ../deps/v8/src/crankshaft/hydrogen-types.h:12,
718  [06/09/2017 11:20PM]:                  from ../deps/v8/src/crankshaft/hydrogen-types.cc:5:
719  [06/09/2017 11:20PM]:                  from ../deps/v8/src/types.h:8,
720  [06/09/2017 11:20PM]:   g++ -DV8_TARGET_ARCH_X64 -DENABLE_DISASSEMBLER -DV8_I18N_SUPPORT -DV8_IMMINENT_DEPRECATION_WARNINGS -DICU_UTIL_DATA_IMPL=ICU_UTIL_DATA_STATIC -I../deps/v8 -I../deps  -pthread -Wall -Wextra -Wno-unused-parameter -m64 -fno-strict-aliasing -m64 -fdata-sections -ffunction-sections -O3 -O3 -fno-omit-frame-pointer -fno-rtti -fno-exceptions -std=gnu++0x -MMD -MF /pkg/src/node-v6.11.0/out/Release/.deps//pkg/src/node-v6.11.0/out/Release/obj.target/v8_base/deps/v8/src/crankshaft/hydrogen-uint32-analysis.o.d.raw -D_FORTIFY_SOURCE=2 -march=x86-64 -mtune=generic -O2 -pipe -fstack-protector-strong -c -o /pkg/src/node-v6.11.0/out/Release/obj.target/v8_base/deps/v8/src/crankshaft/hydrogen-uint32-analysis.o ../deps/v8/src/crankshaft/hydrogen-uint32-analysis.cc
721  [06/09/2017 11:20PM]:                  from ../deps/v8/src/crankshaft/hydrogen-uint32-analysis.h:8,
722  [06/09/2017 11:20PM]:                  from ../deps/v8/src/crankshaft/hydrogen-uint32-analysis.cc:5:
723  [06/09/2017 11:20PM]:   g++ -DV8_TARGET_ARCH_X64 -DENABLE_DISASSEMBLER -DV8_I18N_SUPPORT -DV8_IMMINENT_DEPRECATION_WARNINGS -DICU_UTIL_DATA_IMPL=ICU_UTIL_DATA_STATIC -I../deps/v8 -I../deps  -pthread -Wall -Wextra -Wno-unused-parameter -m64 -fno-strict-aliasing -m64 -fdata-sections -ffunction-sections -O3 -O3 -fno-omit-frame-pointer -fno-rtti -fno-exceptions -std=gnu++0x -MMD -MF /pkg/src/node-v6.11.0/out/Release/.deps//pkg/src/node-v6.11.0/out/Release/obj.target/v8_base/deps/v8/src/crankshaft/hydrogen.o.d.raw -D_FORTIFY_SOURCE=2 -march=x86-64 -mtune=generic -O2 -pipe -fstack-protector-strong -c -o /pkg/src/node-v6.11.0/out/Release/obj.target/v8_base/deps/v8/src/crankshaft/hydrogen.o ../deps/v8/src/crankshaft/hydrogen.cc
724  [06/09/2017 11:20PM]:                  from ../deps/v8/src/crankshaft/hydrogen.cc:5:
725  [06/09/2017 11:20PM]: ../deps/v8/src/crankshaft/hydrogen.cc: In member function bool v8::internal::HOptimizedGraphBuilder::TryInlineBuiltinFunctionCall(v8::internal::Call*):
726  [06/09/2017 11:20PM]: ../deps/v8/src/crankshaft/hydrogen.cc:8706:7: warning: this statement may fall through [-Wimplicit-fallthrough=]
727  [06/09/2017 11:20PM]:        if (!FLAG_fast_math) break;
728  [06/09/2017 11:20PM]: ../deps/v8/src/crankshaft/hydrogen.cc:8708:5: note: here
729  [06/09/2017 11:20PM]: ../deps/v8/src/crankshaft/hydrogen.cc: In member function bool v8::internal::HOptimizedGraphBuilder::TryInlineBuiltinMethodCall(v8::internal::Call*, v8::internal::Handle<v8::internal::JSFunction>, v8::internal::Handle<v8::internal::Map>, int):
730  [06/09/2017 11:20PM]: ../deps/v8/src/crankshaft/hydrogen.cc:8837:7: warning: this statement may fall through [-Wimplicit-fallthrough=]
731  [06/09/2017 11:20PM]: ../deps/v8/src/crankshaft/hydrogen.cc:8839:5: note: here
732  [06/09/2017 11:20PM]:   g++ -DV8_TARGET_ARCH_X64 -DENABLE_DISASSEMBLER -DV8_I18N_SUPPORT -DV8_IMMINENT_DEPRECATION_WARNINGS -DICU_UTIL_DATA_IMPL=ICU_UTIL_DATA_STATIC -I../deps/v8 -I../deps  -pthread -Wall -Wextra -Wno-unused-parameter -m64 -fno-strict-aliasing -m64 -fdata-sections -ffunction-sections -O3 -O3 -fno-omit-frame-pointer -fno-rtti -fno-exceptions -std=gnu++0x -MMD -MF /pkg/src/node-v6.11.0/out/Release/.deps//pkg/src/node-v6.11.0/out/Release/obj.target/v8_base/deps/v8/src/crankshaft/lithium-allocator.o.d.raw -D_FORTIFY_SOURCE=2 -march=x86-64 -mtune=generic -O2 -pipe -fstack-protector-strong -c -o /pkg/src/node-v6.11.0/out/Release/obj.target/v8_base/deps/v8/src/crankshaft/lithium-allocator.o ../deps/v8/src/crankshaft/lithium-allocator.cc
733  [06/09/2017 11:20PM]:                  from ../deps/v8/src/crankshaft/lithium-allocator.h:9,
734  [06/09/2017 11:20PM]:                  from ../deps/v8/src/crankshaft/lithium-allocator.cc:5:
735  [06/09/2017 11:20PM]:                  from ../deps/v8/src/crankshaft/lithium-allocator.h:8,
736  [06/09/2017 11:20PM]:   g++ -DV8_TARGET_ARCH_X64 -DENABLE_DISASSEMBLER -DV8_I18N_SUPPORT -DV8_IMMINENT_DEPRECATION_WARNINGS -DICU_UTIL_DATA_IMPL=ICU_UTIL_DATA_STATIC -I../deps/v8 -I../deps  -pthread -Wall -Wextra -Wno-unused-parameter -m64 -fno-strict-aliasing -m64 -fdata-sections -ffunction-sections -O3 -O3 -fno-omit-frame-pointer -fno-rtti -fno-exceptions -std=gnu++0x -MMD -MF /pkg/src/node-v6.11.0/out/Release/.deps//pkg/src/node-v6.11.0/out/Release/obj.target/v8_base/deps/v8/src/crankshaft/lithium-codegen.o.d.raw -D_FORTIFY_SOURCE=2 -march=x86-64 -mtune=generic -O2 -pipe -fstack-protector-strong -c -o /pkg/src/node-v6.11.0/out/Release/obj.target/v8_base/deps/v8/src/crankshaft/lithium-codegen.o ../deps/v8/src/crankshaft/lithium-codegen.cc
737  [06/09/2017 11:20PM]:                  from ../deps/v8/src/crankshaft/lithium-codegen.h:9,
738  [06/09/2017 11:20PM]:                  from ../deps/v8/src/crankshaft/lithium-codegen.cc:5:
739  [06/09/2017 11:20PM]:   g++ -DV8_TARGET_ARCH_X64 -DENABLE_DISASSEMBLER -DV8_I18N_SUPPORT -DV8_IMMINENT_DEPRECATION_WARNINGS -DICU_UTIL_DATA_IMPL=ICU_UTIL_DATA_STATIC -I../deps/v8 -I../deps  -pthread -Wall -Wextra -Wno-unused-parameter -m64 -fno-strict-aliasing -m64 -fdata-sections -ffunction-sections -O3 -O3 -fno-omit-frame-pointer -fno-rtti -fno-exceptions -std=gnu++0x -MMD -MF /pkg/src/node-v6.11.0/out/Release/.deps//pkg/src/node-v6.11.0/out/Release/obj.target/v8_base/deps/v8/src/crankshaft/lithium.o.d.raw -D_FORTIFY_SOURCE=2 -march=x86-64 -mtune=generic -O2 -pipe -fstack-protector-strong -c -o /pkg/src/node-v6.11.0/out/Release/obj.target/v8_base/deps/v8/src/crankshaft/lithium.o ../deps/v8/src/crankshaft/lithium.cc
740  [06/09/2017 11:20PM]:                  from ../deps/v8/src/crankshaft/lithium.h:12,
741  [06/09/2017 11:20PM]:                  from ../deps/v8/src/crankshaft/lithium.cc:5:
742  [06/09/2017 11:20PM]:                  from ../deps/v8/src/crankshaft/lithium.h:10,
743  [06/09/2017 11:20PM]:   g++ -DV8_TARGET_ARCH_X64 -DENABLE_DISASSEMBLER -DV8_I18N_SUPPORT -DV8_IMMINENT_DEPRECATION_WARNINGS -DICU_UTIL_DATA_IMPL=ICU_UTIL_DATA_STATIC -I../deps/v8 -I../deps  -pthread -Wall -Wextra -Wno-unused-parameter -m64 -fno-strict-aliasing -m64 -fdata-sections -ffunction-sections -O3 -O3 -fno-omit-frame-pointer -fno-rtti -fno-exceptions -std=gnu++0x -MMD -MF /pkg/src/node-v6.11.0/out/Release/.deps//pkg/src/node-v6.11.0/out/Release/obj.target/v8_base/deps/v8/src/crankshaft/typing.o.d.raw -D_FORTIFY_SOURCE=2 -march=x86-64 -mtune=generic -O2 -pipe -fstack-protector-strong -c -o /pkg/src/node-v6.11.0/out/Release/obj.target/v8_base/deps/v8/src/crankshaft/typing.o ../deps/v8/src/crankshaft/typing.cc
744  [06/09/2017 11:20PM]:                  from ../deps/v8/src/crankshaft/typing.h:9,
745  [06/09/2017 11:20PM]:                  from ../deps/v8/src/crankshaft/typing.cc:5:
746  [06/09/2017 11:20PM]:                  from ../deps/v8/src/crankshaft/typing.h:8,
747  [06/09/2017 11:21PM]:   g++ -DV8_TARGET_ARCH_X64 -DENABLE_DISASSEMBLER -DV8_I18N_SUPPORT -DV8_IMMINENT_DEPRECATION_WARNINGS -DICU_UTIL_DATA_IMPL=ICU_UTIL_DATA_STATIC -I../deps/v8 -I../deps  -pthread -Wall -Wextra -Wno-unused-parameter -m64 -fno-strict-aliasing -m64 -fdata-sections -ffunction-sections -O3 -O3 -fno-omit-frame-pointer -fno-rtti -fno-exceptions -std=gnu++0x -MMD -MF /pkg/src/node-v6.11.0/out/Release/.deps//pkg/src/node-v6.11.0/out/Release/obj.target/v8_base/deps/v8/src/date.o.d.raw -D_FORTIFY_SOURCE=2 -march=x86-64 -mtune=generic -O2 -pipe -fstack-protector-strong -c -o /pkg/src/node-v6.11.0/out/Release/obj.target/v8_base/deps/v8/src/date.o ../deps/v8/src/date.cc
748  [06/09/2017 11:21PM]: In file included from ../deps/v8/src/date.cc:7:0:
749  [06/09/2017 11:21PM]:                  from ../deps/v8/src/date.h:8,
750  [06/09/2017 11:21PM]:                  from ../deps/v8/src/date.cc:5:
751  [06/09/2017 11:21PM]:   g++ -DV8_TARGET_ARCH_X64 -DENABLE_DISASSEMBLER -DV8_I18N_SUPPORT -DV8_IMMINENT_DEPRECATION_WARNINGS -DICU_UTIL_DATA_IMPL=ICU_UTIL_DATA_STATIC -I../deps/v8 -I../deps  -pthread -Wall -Wextra -Wno-unused-parameter -m64 -fno-strict-aliasing -m64 -fdata-sections -ffunction-sections -O3 -O3 -fno-omit-frame-pointer -fno-rtti -fno-exceptions -std=gnu++0x -MMD -MF /pkg/src/node-v6.11.0/out/Release/.deps//pkg/src/node-v6.11.0/out/Release/obj.target/v8_base/deps/v8/src/dateparser.o.d.raw -D_FORTIFY_SOURCE=2 -march=x86-64 -mtune=generic -O2 -pipe -fstack-protector-strong -c -o /pkg/src/node-v6.11.0/out/Release/obj.target/v8_base/deps/v8/src/dateparser.o ../deps/v8/src/dateparser.cc
752  [06/09/2017 11:21PM]:                  from ../deps/v8/src/dateparser.cc:8:
753  [06/09/2017 11:21PM]:                  from ../deps/v8/src/dateparser.h:8,
754  [06/09/2017 11:21PM]:                  from ../deps/v8/src/dateparser.cc:5:
755  [06/09/2017 11:21PM]:   g++ -DV8_TARGET_ARCH_X64 -DENABLE_DISASSEMBLER -DV8_I18N_SUPPORT -DV8_IMMINENT_DEPRECATION_WARNINGS -DICU_UTIL_DATA_IMPL=ICU_UTIL_DATA_STATIC -I../deps/v8 -I../deps  -pthread -Wall -Wextra -Wno-unused-parameter -m64 -fno-strict-aliasing -m64 -fdata-sections -ffunction-sections -O3 -O3 -fno-omit-frame-pointer -fno-rtti -fno-exceptions -std=gnu++0x -MMD -MF /pkg/src/node-v6.11.0/out/Release/.deps//pkg/src/node-v6.11.0/out/Release/obj.target/v8_base/deps/v8/src/debug/debug-evaluate.o.d.raw -D_FORTIFY_SOURCE=2 -march=x86-64 -mtune=generic -O2 -pipe -fstack-protector-strong -c -o /pkg/src/node-v6.11.0/out/Release/obj.target/v8_base/deps/v8/src/debug/debug-evaluate.o ../deps/v8/src/debug/debug-evaluate.cc
756  [06/09/2017 11:21PM]:                  from ../deps/v8/src/debug/debug-evaluate.h:8,
757  [06/09/2017 11:21PM]:                  from ../deps/v8/src/debug/debug-evaluate.cc:5:
758  [06/09/2017 11:21PM]:                  from ../deps/v8/src/frames.h:8,
759  [06/09/2017 11:21PM]:   g++ -DV8_TARGET_ARCH_X64 -DENABLE_DISASSEMBLER -DV8_I18N_SUPPORT -DV8_IMMINENT_DEPRECATION_WARNINGS -DICU_UTIL_DATA_IMPL=ICU_UTIL_DATA_STATIC -I../deps/v8 -I../deps  -pthread -Wall -Wextra -Wno-unused-parameter -m64 -fno-strict-aliasing -m64 -fdata-sections -ffunction-sections -O3 -O3 -fno-omit-frame-pointer -fno-rtti -fno-exceptions -std=gnu++0x -MMD -MF /pkg/src/node-v6.11.0/out/Release/.deps//pkg/src/node-v6.11.0/out/Release/obj.target/v8_base/deps/v8/src/debug/debug-frames.o.d.raw -D_FORTIFY_SOURCE=2 -march=x86-64 -mtune=generic -O2 -pipe -fstack-protector-strong -c -o /pkg/src/node-v6.11.0/out/Release/obj.target/v8_base/deps/v8/src/debug/debug-frames.o ../deps/v8/src/debug/debug-frames.cc
760  [06/09/2017 11:21PM]:                  from ../deps/v8/src/macro-assembler.h:8,
761  [06/09/2017 11:21PM]:                  from ../deps/v8/src/deoptimizer.h:9,
762  [06/09/2017 11:21PM]:                  from ../deps/v8/src/debug/debug-frames.h:8,
763  [06/09/2017 11:21PM]:                  from ../deps/v8/src/debug/debug-frames.cc:5:
764  [06/09/2017 11:21PM]:                  from ../deps/v8/src/deoptimizer.h:8,
765  [06/09/2017 11:21PM]:   g++ -DV8_TARGET_ARCH_X64 -DENABLE_DISASSEMBLER -DV8_I18N_SUPPORT -DV8_IMMINENT_DEPRECATION_WARNINGS -DICU_UTIL_DATA_IMPL=ICU_UTIL_DATA_STATIC -I../deps/v8 -I../deps  -pthread -Wall -Wextra -Wno-unused-parameter -m64 -fno-strict-aliasing -m64 -fdata-sections -ffunction-sections -O3 -O3 -fno-omit-frame-pointer -fno-rtti -fno-exceptions -std=gnu++0x -MMD -MF /pkg/src/node-v6.11.0/out/Release/.deps//pkg/src/node-v6.11.0/out/Release/obj.target/v8_base/deps/v8/src/debug/debug-scopes.o.d.raw -D_FORTIFY_SOURCE=2 -march=x86-64 -mtune=generic -O2 -pipe -fstack-protector-strong -c -o /pkg/src/node-v6.11.0/out/Release/obj.target/v8_base/deps/v8/src/debug/debug-scopes.o ../deps/v8/src/debug/debug-scopes.cc
766  [06/09/2017 11:21PM]:                  from ../deps/v8/src/debug/debug-scopes.h:8,
767  [06/09/2017 11:21PM]:                  from ../deps/v8/src/debug/debug-scopes.cc:5:
768  [06/09/2017 11:21PM]:   g++ -DV8_TARGET_ARCH_X64 -DENABLE_DISASSEMBLER -DV8_I18N_SUPPORT -DV8_IMMINENT_DEPRECATION_WARNINGS -DICU_UTIL_DATA_IMPL=ICU_UTIL_DATA_STATIC -I../deps/v8 -I../deps  -pthread -Wall -Wextra -Wno-unused-parameter -m64 -fno-strict-aliasing -m64 -fdata-sections -ffunction-sections -O3 -O3 -fno-omit-frame-pointer -fno-rtti -fno-exceptions -std=gnu++0x -MMD -MF /pkg/src/node-v6.11.0/out/Release/.deps//pkg/src/node-v6.11.0/out/Release/obj.target/v8_base/deps/v8/src/debug/debug.o.d.raw -D_FORTIFY_SOURCE=2 -march=x86-64 -mtune=generic -O2 -pipe -fstack-protector-strong -c -o /pkg/src/node-v6.11.0/out/Release/obj.target/v8_base/deps/v8/src/debug/debug.o ../deps/v8/src/debug/debug.cc
769  [06/09/2017 11:21PM]:                  from ../deps/v8/src/debug/debug.cc:5:
770  [06/09/2017 11:21PM]:   g++ -DV8_TARGET_ARCH_X64 -DENABLE_DISASSEMBLER -DV8_I18N_SUPPORT -DV8_IMMINENT_DEPRECATION_WARNINGS -DICU_UTIL_DATA_IMPL=ICU_UTIL_DATA_STATIC -I../deps/v8 -I../deps  -pthread -Wall -Wextra -Wno-unused-parameter -m64 -fno-strict-aliasing -m64 -fdata-sections -ffunction-sections -O3 -O3 -fno-omit-frame-pointer -fno-rtti -fno-exceptions -std=gnu++0x -MMD -MF /pkg/src/node-v6.11.0/out/Release/.deps//pkg/src/node-v6.11.0/out/Release/obj.target/v8_base/deps/v8/src/debug/liveedit.o.d.raw -D_FORTIFY_SOURCE=2 -march=x86-64 -mtune=generic -O2 -pipe -fstack-protector-strong -c -o /pkg/src/node-v6.11.0/out/Release/obj.target/v8_base/deps/v8/src/debug/liveedit.o ../deps/v8/src/debug/liveedit.cc
771  [06/09/2017 11:21PM]:                  from ../deps/v8/src/debug/liveedit.h:29,
772  [06/09/2017 11:21PM]:                  from ../deps/v8/src/debug/liveedit.cc:5:
773  [06/09/2017 11:21PM]:                  from ../deps/v8/src/debug/liveedit.h:28,
774  [06/09/2017 11:21PM]:   g++ -DV8_TARGET_ARCH_X64 -DENABLE_DISASSEMBLER -DV8_I18N_SUPPORT -DV8_IMMINENT_DEPRECATION_WARNINGS -DICU_UTIL_DATA_IMPL=ICU_UTIL_DATA_STATIC -I../deps/v8 -I../deps  -pthread -Wall -Wextra -Wno-unused-parameter -m64 -fno-strict-aliasing -m64 -fdata-sections -ffunction-sections -O3 -O3 -fno-omit-frame-pointer -fno-rtti -fno-exceptions -std=gnu++0x -MMD -MF /pkg/src/node-v6.11.0/out/Release/.deps//pkg/src/node-v6.11.0/out/Release/obj.target/v8_base/deps/v8/src/deoptimizer.o.d.raw -D_FORTIFY_SOURCE=2 -march=x86-64 -mtune=generic -O2 -pipe -fstack-protector-strong -c -o /pkg/src/node-v6.11.0/out/Release/obj.target/v8_base/deps/v8/src/deoptimizer.o ../deps/v8/src/deoptimizer.cc
775  [06/09/2017 11:21PM]:                  from ../deps/v8/src/deoptimizer.cc:5:
776  [06/09/2017 11:21PM]:   g++ -DV8_TARGET_ARCH_X64 -DENABLE_DISASSEMBLER -DV8_I18N_SUPPORT -DV8_IMMINENT_DEPRECATION_WARNINGS -DICU_UTIL_DATA_IMPL=ICU_UTIL_DATA_STATIC -I../deps/v8 -I../deps  -pthread -Wall -Wextra -Wno-unused-parameter -m64 -fno-strict-aliasing -m64 -fdata-sections -ffunction-sections -O3 -O3 -fno-omit-frame-pointer -fno-rtti -fno-exceptions -std=gnu++0x -MMD -MF /pkg/src/node-v6.11.0/out/Release/.deps//pkg/src/node-v6.11.0/out/Release/obj.target/v8_base/deps/v8/src/disassembler.o.d.raw -D_FORTIFY_SOURCE=2 -march=x86-64 -mtune=generic -O2 -pipe -fstack-protector-strong -c -o /pkg/src/node-v6.11.0/out/Release/obj.target/v8_base/deps/v8/src/disassembler.o ../deps/v8/src/disassembler.cc
777  [06/09/2017 11:21PM]:                  from ../deps/v8/src/disassembler.cc:7:
778  [06/09/2017 11:21PM]:                  from ../deps/v8/src/disassembler.h:8,
779  [06/09/2017 11:21PM]:                  from ../deps/v8/src/disassembler.cc:5:
780  [06/09/2017 11:21PM]:   g++ -DV8_TARGET_ARCH_X64 -DENABLE_DISASSEMBLER -DV8_I18N_SUPPORT -DV8_IMMINENT_DEPRECATION_WARNINGS -DICU_UTIL_DATA_IMPL=ICU_UTIL_DATA_STATIC -I../deps/v8 -I../deps  -pthread -Wall -Wextra -Wno-unused-parameter -m64 -fno-strict-aliasing -m64 -fdata-sections -ffunction-sections -O3 -O3 -fno-omit-frame-pointer -fno-rtti -fno-exceptions -std=gnu++0x -MMD -MF /pkg/src/node-v6.11.0/out/Release/.deps//pkg/src/node-v6.11.0/out/Release/obj.target/v8_base/deps/v8/src/diy-fp.o.d.raw -D_FORTIFY_SOURCE=2 -march=x86-64 -mtune=generic -O2 -pipe -fstack-protector-strong -c -o /pkg/src/node-v6.11.0/out/Release/obj.target/v8_base/deps/v8/src/diy-fp.o ../deps/v8/src/diy-fp.cc
781  [06/09/2017 11:21PM]:   g++ -DV8_TARGET_ARCH_X64 -DENABLE_DISASSEMBLER -DV8_I18N_SUPPORT -DV8_IMMINENT_DEPRECATION_WARNINGS -DICU_UTIL_DATA_IMPL=ICU_UTIL_DATA_STATIC -I../deps/v8 -I../deps  -pthread -Wall -Wextra -Wno-unused-parameter -m64 -fno-strict-aliasing -m64 -fdata-sections -ffunction-sections -O3 -O3 -fno-omit-frame-pointer -fno-rtti -fno-exceptions -std=gnu++0x -MMD -MF /pkg/src/node-v6.11.0/out/Release/.deps//pkg/src/node-v6.11.0/out/Release/obj.target/v8_base/deps/v8/src/dtoa.o.d.raw -D_FORTIFY_SOURCE=2 -march=x86-64 -mtune=generic -O2 -pipe -fstack-protector-strong -c -o /pkg/src/node-v6.11.0/out/Release/obj.target/v8_base/deps/v8/src/dtoa.o ../deps/v8/src/dtoa.cc
782  [06/09/2017 11:21PM]:   g++ -DV8_TARGET_ARCH_X64 -DENABLE_DISASSEMBLER -DV8_I18N_SUPPORT -DV8_IMMINENT_DEPRECATION_WARNINGS -DICU_UTIL_DATA_IMPL=ICU_UTIL_DATA_STATIC -I../deps/v8 -I../deps  -pthread -Wall -Wextra -Wno-unused-parameter -m64 -fno-strict-aliasing -m64 -fdata-sections -ffunction-sections -O3 -O3 -fno-omit-frame-pointer -fno-rtti -fno-exceptions -std=gnu++0x -MMD -MF /pkg/src/node-v6.11.0/out/Release/.deps//pkg/src/node-v6.11.0/out/Release/obj.target/v8_base/deps/v8/src/elements-kind.o.d.raw -D_FORTIFY_SOURCE=2 -march=x86-64 -mtune=generic -O2 -pipe -fstack-protector-strong -c -o /pkg/src/node-v6.11.0/out/Release/obj.target/v8_base/deps/v8/src/elements-kind.o ../deps/v8/src/elements-kind.cc
783  [06/09/2017 11:21PM]:                  from ../deps/v8/src/elements-kind.cc:7:
784  [06/09/2017 11:21PM]: In file included from ../deps/v8/src/checks.h:8:0,
785  [06/09/2017 11:21PM]:                  from ../deps/v8/src/elements-kind.h:9,
786  [06/09/2017 11:21PM]:                  from ../deps/v8/src/elements-kind.cc:5:
787  [06/09/2017 11:21PM]:   g++ -DV8_TARGET_ARCH_X64 -DENABLE_DISASSEMBLER -DV8_I18N_SUPPORT -DV8_IMMINENT_DEPRECATION_WARNINGS -DICU_UTIL_DATA_IMPL=ICU_UTIL_DATA_STATIC -I../deps/v8 -I../deps  -pthread -Wall -Wextra -Wno-unused-parameter -m64 -fno-strict-aliasing -m64 -fdata-sections -ffunction-sections -O3 -O3 -fno-omit-frame-pointer -fno-rtti -fno-exceptions -std=gnu++0x -MMD -MF /pkg/src/node-v6.11.0/out/Release/.deps//pkg/src/node-v6.11.0/out/Release/obj.target/v8_base/deps/v8/src/elements.o.d.raw -D_FORTIFY_SOURCE=2 -march=x86-64 -mtune=generic -O2 -pipe -fstack-protector-strong -c -o /pkg/src/node-v6.11.0/out/Release/obj.target/v8_base/deps/v8/src/elements.o ../deps/v8/src/elements.cc
788  [06/09/2017 11:21PM]:                  from ../deps/v8/src/elements.h:9,
789  [06/09/2017 11:21PM]:                  from ../deps/v8/src/elements.cc:5:
790  [06/09/2017 11:21PM]:                  from ../deps/v8/src/elements.h:8,
791  [06/09/2017 11:21PM]:   g++ -DV8_TARGET_ARCH_X64 -DENABLE_DISASSEMBLER -DV8_I18N_SUPPORT -DV8_IMMINENT_DEPRECATION_WARNINGS -DICU_UTIL_DATA_IMPL=ICU_UTIL_DATA_STATIC -I../deps/v8 -I../deps  -pthread -Wall -Wextra -Wno-unused-parameter -m64 -fno-strict-aliasing -m64 -fdata-sections -ffunction-sections -O3 -O3 -fno-omit-frame-pointer -fno-rtti -fno-exceptions -std=gnu++0x -MMD -MF /pkg/src/node-v6.11.0/out/Release/.deps//pkg/src/node-v6.11.0/out/Release/obj.target/v8_base/deps/v8/src/execution.o.d.raw -D_FORTIFY_SOURCE=2 -march=x86-64 -mtune=generic -O2 -pipe -fstack-protector-strong -c -o /pkg/src/node-v6.11.0/out/Release/obj.target/v8_base/deps/v8/src/execution.o ../deps/v8/src/execution.cc
792  [06/09/2017 11:21PM]:                  from ../deps/v8/src/execution.cc:7:
793  [06/09/2017 11:21PM]:                  from ../deps/v8/src/execution.h:8,
794  [06/09/2017 11:21PM]:                  from ../deps/v8/src/execution.cc:5:
795  [06/09/2017 11:21PM]:   g++ -DV8_TARGET_ARCH_X64 -DENABLE_DISASSEMBLER -DV8_I18N_SUPPORT -DV8_IMMINENT_DEPRECATION_WARNINGS -DICU_UTIL_DATA_IMPL=ICU_UTIL_DATA_STATIC -I../deps/v8 -I../deps  -pthread -Wall -Wextra -Wno-unused-parameter -m64 -fno-strict-aliasing -m64 -fdata-sections -ffunction-sections -O3 -O3 -fno-omit-frame-pointer -fno-rtti -fno-exceptions -std=gnu++0x -MMD -MF /pkg/src/node-v6.11.0/out/Release/.deps//pkg/src/node-v6.11.0/out/Release/obj.target/v8_base/deps/v8/src/extensions/externalize-string-extension.o.d.raw -D_FORTIFY_SOURCE=2 -march=x86-64 -mtune=generic -O2 -pipe -fstack-protector-strong -c -o /pkg/src/node-v6.11.0/out/Release/obj.target/v8_base/deps/v8/src/extensions/externalize-string-extension.o ../deps/v8/src/extensions/externalize-string-extension.cc
796  [06/09/2017 11:21PM]:                  from ../deps/v8/src/extensions/externalize-string-extension.cc:7:
797  [06/09/2017 11:21PM]: In file included from ../deps/v8/src/extensions/externalize-string-extension.h:8:0,
798  [06/09/2017 11:21PM]:                  from ../deps/v8/src/extensions/externalize-string-extension.cc:5:
799  [06/09/2017 11:21PM]:   g++ -DV8_TARGET_ARCH_X64 -DENABLE_DISASSEMBLER -DV8_I18N_SUPPORT -DV8_IMMINENT_DEPRECATION_WARNINGS -DICU_UTIL_DATA_IMPL=ICU_UTIL_DATA_STATIC -I../deps/v8 -I../deps  -pthread -Wall -Wextra -Wno-unused-parameter -m64 -fno-strict-aliasing -m64 -fdata-sections -ffunction-sections -O3 -O3 -fno-omit-frame-pointer -fno-rtti -fno-exceptions -std=gnu++0x -MMD -MF /pkg/src/node-v6.11.0/out/Release/.deps//pkg/src/node-v6.11.0/out/Release/obj.target/v8_base/deps/v8/src/extensions/free-buffer-extension.o.d.raw -D_FORTIFY_SOURCE=2 -march=x86-64 -mtune=generic -O2 -pipe -fstack-protector-strong -c -o /pkg/src/node-v6.11.0/out/Release/obj.target/v8_base/deps/v8/src/extensions/free-buffer-extension.o ../deps/v8/src/extensions/free-buffer-extension.cc
800  [06/09/2017 11:21PM]:                  from ../deps/v8/src/extensions/free-buffer-extension.cc:8:
801  [06/09/2017 11:21PM]: In file included from ../deps/v8/src/extensions/free-buffer-extension.h:8:0,
802  [06/09/2017 11:21PM]:                  from ../deps/v8/src/extensions/free-buffer-extension.cc:5:
803  [06/09/2017 11:21PM]:   g++ -DV8_TARGET_ARCH_X64 -DENABLE_DISASSEMBLER -DV8_I18N_SUPPORT -DV8_IMMINENT_DEPRECATION_WARNINGS -DICU_UTIL_DATA_IMPL=ICU_UTIL_DATA_STATIC -I../deps/v8 -I../deps  -pthread -Wall -Wextra -Wno-unused-parameter -m64 -fno-strict-aliasing -m64 -fdata-sections -ffunction-sections -O3 -O3 -fno-omit-frame-pointer -fno-rtti -fno-exceptions -std=gnu++0x -MMD -MF /pkg/src/node-v6.11.0/out/Release/.deps//pkg/src/node-v6.11.0/out/Release/obj.target/v8_base/deps/v8/src/extensions/gc-extension.o.d.raw -D_FORTIFY_SOURCE=2 -march=x86-64 -mtune=generic -O2 -pipe -fstack-protector-strong -c -o /pkg/src/node-v6.11.0/out/Release/obj.target/v8_base/deps/v8/src/extensions/gc-extension.o ../deps/v8/src/extensions/gc-extension.cc
804  [06/09/2017 11:21PM]:   g++ -DV8_TARGET_ARCH_X64 -DENABLE_DISASSEMBLER -DV8_I18N_SUPPORT -DV8_IMMINENT_DEPRECATION_WARNINGS -DICU_UTIL_DATA_IMPL=ICU_UTIL_DATA_STATIC -I../deps/v8 -I../deps  -pthread -Wall -Wextra -Wno-unused-parameter -m64 -fno-strict-aliasing -m64 -fdata-sections -ffunction-sections -O3 -O3 -fno-omit-frame-pointer -fno-rtti -fno-exceptions -std=gnu++0x -MMD -MF /pkg/src/node-v6.11.0/out/Release/.deps//pkg/src/node-v6.11.0/out/Release/obj.target/v8_base/deps/v8/src/extensions/statistics-extension.o.d.raw -D_FORTIFY_SOURCE=2 -march=x86-64 -mtune=generic -O2 -pipe -fstack-protector-strong -c -o /pkg/src/node-v6.11.0/out/Release/obj.target/v8_base/deps/v8/src/extensions/statistics-extension.o ../deps/v8/src/extensions/statistics-extension.cc
805  [06/09/2017 11:21PM]:                  from ../deps/v8/src/extensions/statistics-extension.cc:7:
806  [06/09/2017 11:21PM]: In file included from ../deps/v8/src/extensions/statistics-extension.h:8:0,
807  [06/09/2017 11:21PM]:                  from ../deps/v8/src/extensions/statistics-extension.cc:5:
808  [06/09/2017 11:21PM]:   g++ -DV8_TARGET_ARCH_X64 -DENABLE_DISASSEMBLER -DV8_I18N_SUPPORT -DV8_IMMINENT_DEPRECATION_WARNINGS -DICU_UTIL_DATA_IMPL=ICU_UTIL_DATA_STATIC -I../deps/v8 -I../deps  -pthread -Wall -Wextra -Wno-unused-parameter -m64 -fno-strict-aliasing -m64 -fdata-sections -ffunction-sections -O3 -O3 -fno-omit-frame-pointer -fno-rtti -fno-exceptions -std=gnu++0x -MMD -MF /pkg/src/node-v6.11.0/out/Release/.deps//pkg/src/node-v6.11.0/out/Release/obj.target/v8_base/deps/v8/src/extensions/trigger-failure-extension.o.d.raw -D_FORTIFY_SOURCE=2 -march=x86-64 -mtune=generic -O2 -pipe -fstack-protector-strong -c -o /pkg/src/node-v6.11.0/out/Release/obj.target/v8_base/deps/v8/src/extensions/trigger-failure-extension.o ../deps/v8/src/extensions/trigger-failure-extension.cc
809  [06/09/2017 11:21PM]:   g++ -DV8_TARGET_ARCH_X64 -DENABLE_DISASSEMBLER -DV8_I18N_SUPPORT -DV8_IMMINENT_DEPRECATION_WARNINGS -DICU_UTIL_DATA_IMPL=ICU_UTIL_DATA_STATIC -I../deps/v8 -I../deps  -pthread -Wall -Wextra -Wno-unused-parameter -m64 -fno-strict-aliasing -m64 -fdata-sections -ffunction-sections -O3 -O3 -fno-omit-frame-pointer -fno-rtti -fno-exceptions -std=gnu++0x -MMD -MF /pkg/src/node-v6.11.0/out/Release/.deps//pkg/src/node-v6.11.0/out/Release/obj.target/v8_base/deps/v8/src/external-reference-table.o.d.raw -D_FORTIFY_SOURCE=2 -march=x86-64 -mtune=generic -O2 -pipe -fstack-protector-strong -c -o /pkg/src/node-v6.11.0/out/Release/obj.target/v8_base/deps/v8/src/external-reference-table.o ../deps/v8/src/external-reference-table.cc
810  [06/09/2017 11:21PM]:                  from ../deps/v8/src/external-reference-table.h:8,
811  [06/09/2017 11:21PM]:                  from ../deps/v8/src/external-reference-table.cc:5:
812  [06/09/2017 11:22PM]:   g++ -DV8_TARGET_ARCH_X64 -DENABLE_DISASSEMBLER -DV8_I18N_SUPPORT -DV8_IMMINENT_DEPRECATION_WARNINGS -DICU_UTIL_DATA_IMPL=ICU_UTIL_DATA_STATIC -I../deps/v8 -I../deps  -pthread -Wall -Wextra -Wno-unused-parameter -m64 -fno-strict-aliasing -m64 -fdata-sections -ffunction-sections -O3 -O3 -fno-omit-frame-pointer -fno-rtti -fno-exceptions -std=gnu++0x -MMD -MF /pkg/src/node-v6.11.0/out/Release/.deps//pkg/src/node-v6.11.0/out/Release/obj.target/v8_base/deps/v8/src/factory.o.d.raw -D_FORTIFY_SOURCE=2 -march=x86-64 -mtune=generic -O2 -pipe -fstack-protector-strong -c -o /pkg/src/node-v6.11.0/out/Release/obj.target/v8_base/deps/v8/src/factory.o ../deps/v8/src/factory.cc
813  [06/09/2017 11:22PM]:                  from ../deps/v8/src/factory.cc:5:
814  [06/09/2017 11:22PM]:   g++ -DV8_TARGET_ARCH_X64 -DENABLE_DISASSEMBLER -DV8_I18N_SUPPORT -DV8_IMMINENT_DEPRECATION_WARNINGS -DICU_UTIL_DATA_IMPL=ICU_UTIL_DATA_STATIC -I../deps/v8 -I../deps  -pthread -Wall -Wextra -Wno-unused-parameter -m64 -fno-strict-aliasing -m64 -fdata-sections -ffunction-sections -O3 -O3 -fno-omit-frame-pointer -fno-rtti -fno-exceptions -std=gnu++0x -MMD -MF /pkg/src/node-v6.11.0/out/Release/.deps//pkg/src/node-v6.11.0/out/Release/obj.target/v8_base/deps/v8/src/fast-accessor-assembler.o.d.raw -D_FORTIFY_SOURCE=2 -march=x86-64 -mtune=generic -O2 -pipe -fstack-protector-strong -c -o /pkg/src/node-v6.11.0/out/Release/obj.target/v8_base/deps/v8/src/fast-accessor-assembler.o ../deps/v8/src/fast-accessor-assembler.cc
815  [06/09/2017 11:22PM]:                  from ../deps/v8/src/fast-accessor-assembler.h:17,
816  [06/09/2017 11:22PM]:                  from ../deps/v8/src/fast-accessor-assembler.cc:5:
817  [06/09/2017 11:22PM]: In file included from ../deps/v8/include/v8-experimental.h:13:0,
818  [06/09/2017 11:22PM]:                  from ../deps/v8/src/fast-accessor-assembler.h:11,
819  [06/09/2017 11:22PM]:   g++ -DV8_TARGET_ARCH_X64 -DENABLE_DISASSEMBLER -DV8_I18N_SUPPORT -DV8_IMMINENT_DEPRECATION_WARNINGS -DICU_UTIL_DATA_IMPL=ICU_UTIL_DATA_STATIC -I../deps/v8 -I../deps  -pthread -Wall -Wextra -Wno-unused-parameter -m64 -fno-strict-aliasing -m64 -fdata-sections -ffunction-sections -O3 -O3 -fno-omit-frame-pointer -fno-rtti -fno-exceptions -std=gnu++0x -MMD -MF /pkg/src/node-v6.11.0/out/Release/.deps//pkg/src/node-v6.11.0/out/Release/obj.target/v8_base/deps/v8/src/fast-dtoa.o.d.raw -D_FORTIFY_SOURCE=2 -march=x86-64 -mtune=generic -O2 -pipe -fstack-protector-strong -c -o /pkg/src/node-v6.11.0/out/Release/obj.target/v8_base/deps/v8/src/fast-dtoa.o ../deps/v8/src/fast-dtoa.cc
820  [06/09/2017 11:22PM]:   g++ -DV8_TARGET_ARCH_X64 -DENABLE_DISASSEMBLER -DV8_I18N_SUPPORT -DV8_IMMINENT_DEPRECATION_WARNINGS -DICU_UTIL_DATA_IMPL=ICU_UTIL_DATA_STATIC -I../deps/v8 -I../deps  -pthread -Wall -Wextra -Wno-unused-parameter -m64 -fno-strict-aliasing -m64 -fdata-sections -ffunction-sections -O3 -O3 -fno-omit-frame-pointer -fno-rtti -fno-exceptions -std=gnu++0x -MMD -MF /pkg/src/node-v6.11.0/out/Release/.deps//pkg/src/node-v6.11.0/out/Release/obj.target/v8_base/deps/v8/src/field-type.o.d.raw -D_FORTIFY_SOURCE=2 -march=x86-64 -mtune=generic -O2 -pipe -fstack-protector-strong -c -o /pkg/src/node-v6.11.0/out/Release/obj.target/v8_base/deps/v8/src/field-type.o ../deps/v8/src/field-type.cc
821  [06/09/2017 11:22PM]: In file included from ../deps/v8/src/field-type.h:9:0,
822  [06/09/2017 11:22PM]:                  from ../deps/v8/src/field-type.cc:5:
823  [06/09/2017 11:22PM]:                  from ../deps/v8/src/field-type.h:8,
824  [06/09/2017 11:22PM]:   g++ -DV8_TARGET_ARCH_X64 -DENABLE_DISASSEMBLER -DV8_I18N_SUPPORT -DV8_IMMINENT_DEPRECATION_WARNINGS -DICU_UTIL_DATA_IMPL=ICU_UTIL_DATA_STATIC -I../deps/v8 -I../deps  -pthread -Wall -Wextra -Wno-unused-parameter -m64 -fno-strict-aliasing -m64 -fdata-sections -ffunction-sections -O3 -O3 -fno-omit-frame-pointer -fno-rtti -fno-exceptions -std=gnu++0x -MMD -MF /pkg/src/node-v6.11.0/out/Release/.deps//pkg/src/node-v6.11.0/out/Release/obj.target/v8_base/deps/v8/src/fixed-dtoa.o.d.raw -D_FORTIFY_SOURCE=2 -march=x86-64 -mtune=generic -O2 -pipe -fstack-protector-strong -c -o /pkg/src/node-v6.11.0/out/Release/obj.target/v8_base/deps/v8/src/fixed-dtoa.o ../deps/v8/src/fixed-dtoa.cc
825  [06/09/2017 11:22PM]:   g++ -DV8_TARGET_ARCH_X64 -DENABLE_DISASSEMBLER -DV8_I18N_SUPPORT -DV8_IMMINENT_DEPRECATION_WARNINGS -DICU_UTIL_DATA_IMPL=ICU_UTIL_DATA_STATIC -I../deps/v8 -I../deps  -pthread -Wall -Wextra -Wno-unused-parameter -m64 -fno-strict-aliasing -m64 -fdata-sections -ffunction-sections -O3 -O3 -fno-omit-frame-pointer -fno-rtti -fno-exceptions -std=gnu++0x -MMD -MF /pkg/src/node-v6.11.0/out/Release/.deps//pkg/src/node-v6.11.0/out/Release/obj.target/v8_base/deps/v8/src/flags.o.d.raw -D_FORTIFY_SOURCE=2 -march=x86-64 -mtune=generic -O2 -pipe -fstack-protector-strong -c -o /pkg/src/node-v6.11.0/out/Release/obj.target/v8_base/deps/v8/src/flags.o ../deps/v8/src/flags.cc
826  [06/09/2017 11:22PM]:                  from ../deps/v8/src/flags.cc:12:
827  [06/09/2017 11:22PM]: In file included from ../deps/v8/src/flags.h:8:0,
828  [06/09/2017 11:22PM]:                  from ../deps/v8/src/flags.cc:5:
829  [06/09/2017 11:22PM]:   g++ -DV8_TARGET_ARCH_X64 -DENABLE_DISASSEMBLER -DV8_I18N_SUPPORT -DV8_IMMINENT_DEPRECATION_WARNINGS -DICU_UTIL_DATA_IMPL=ICU_UTIL_DATA_STATIC -I../deps/v8 -I../deps  -pthread -Wall -Wextra -Wno-unused-parameter -m64 -fno-strict-aliasing -m64 -fdata-sections -ffunction-sections -O3 -O3 -fno-omit-frame-pointer -fno-rtti -fno-exceptions -std=gnu++0x -MMD -MF /pkg/src/node-v6.11.0/out/Release/.deps//pkg/src/node-v6.11.0/out/Release/obj.target/v8_base/deps/v8/src/frames.o.d.raw -D_FORTIFY_SOURCE=2 -march=x86-64 -mtune=generic -O2 -pipe -fstack-protector-strong -c -o /pkg/src/node-v6.11.0/out/Release/obj.target/v8_base/deps/v8/src/frames.o ../deps/v8/src/frames.cc
830  [06/09/2017 11:22PM]:                  from ../deps/v8/src/frames.cc:5:
831  [06/09/2017 11:22PM]:   g++ -DV8_TARGET_ARCH_X64 -DENABLE_DISASSEMBLER -DV8_I18N_SUPPORT -DV8_IMMINENT_DEPRECATION_WARNINGS -DICU_UTIL_DATA_IMPL=ICU_UTIL_DATA_STATIC -I../deps/v8 -I../deps  -pthread -Wall -Wextra -Wno-unused-parameter -m64 -fno-strict-aliasing -m64 -fdata-sections -ffunction-sections -O3 -O3 -fno-omit-frame-pointer -fno-rtti -fno-exceptions -std=gnu++0x -MMD -MF /pkg/src/node-v6.11.0/out/Release/.deps//pkg/src/node-v6.11.0/out/Release/obj.target/v8_base/deps/v8/src/full-codegen/full-codegen.o.d.raw -D_FORTIFY_SOURCE=2 -march=x86-64 -mtune=generic -O2 -pipe -fstack-protector-strong -c -o /pkg/src/node-v6.11.0/out/Release/obj.target/v8_base/deps/v8/src/full-codegen/full-codegen.o ../deps/v8/src/full-codegen/full-codegen.cc
832  [06/09/2017 11:22PM]:                  from ../deps/v8/src/full-codegen/full-codegen.h:10,
833  [06/09/2017 11:22PM]:                  from ../deps/v8/src/full-codegen/full-codegen.cc:5:
834  [06/09/2017 11:22PM]:                  from ../deps/v8/src/full-codegen/full-codegen.h:8,
835  [06/09/2017 11:22PM]:   g++ -DV8_TARGET_ARCH_X64 -DENABLE_DISASSEMBLER -DV8_I18N_SUPPORT -DV8_IMMINENT_DEPRECATION_WARNINGS -DICU_UTIL_DATA_IMPL=ICU_UTIL_DATA_STATIC -I../deps/v8 -I../deps  -pthread -Wall -Wextra -Wno-unused-parameter -m64 -fno-strict-aliasing -m64 -fdata-sections -ffunction-sections -O3 -O3 -fno-omit-frame-pointer -fno-rtti -fno-exceptions -std=gnu++0x -MMD -MF /pkg/src/node-v6.11.0/out/Release/.deps//pkg/src/node-v6.11.0/out/Release/obj.target/v8_base/deps/v8/src/futex-emulation.o.d.raw -D_FORTIFY_SOURCE=2 -march=x86-64 -mtune=generic -O2 -pipe -fstack-protector-strong -c -o /pkg/src/node-v6.11.0/out/Release/obj.target/v8_base/deps/v8/src/futex-emulation.o ../deps/v8/src/futex-emulation.cc
836  [06/09/2017 11:22PM]:                  from ../deps/v8/src/futex-emulation.cc:12:
837  [06/09/2017 11:22PM]:                  from ../deps/v8/src/futex-emulation.h:10,
838  [06/09/2017 11:22PM]:                  from ../deps/v8/src/futex-emulation.cc:5:
839  [06/09/2017 11:22PM]:   g++ -DV8_TARGET_ARCH_X64 -DENABLE_DISASSEMBLER -DV8_I18N_SUPPORT -DV8_IMMINENT_DEPRECATION_WARNINGS -DICU_UTIL_DATA_IMPL=ICU_UTIL_DATA_STATIC -I../deps/v8 -I../deps  -pthread -Wall -Wextra -Wno-unused-parameter -m64 -fno-strict-aliasing -m64 -fdata-sections -ffunction-sections -O3 -O3 -fno-omit-frame-pointer -fno-rtti -fno-exceptions -std=gnu++0x -MMD -MF /pkg/src/node-v6.11.0/out/Release/.deps//pkg/src/node-v6.11.0/out/Release/obj.target/v8_base/deps/v8/src/gdb-jit.o.d.raw -D_FORTIFY_SOURCE=2 -march=x86-64 -mtune=generic -O2 -pipe -fstack-protector-strong -c -o /pkg/src/node-v6.11.0/out/Release/obj.target/v8_base/deps/v8/src/gdb-jit.o ../deps/v8/src/gdb-jit.cc
840  [06/09/2017 11:22PM]:                  from ../deps/v8/src/gdb-jit.cc:9:
841  [06/09/2017 11:22PM]: In file included from ../deps/v8/src/gdb-jit.h:8:0,
842  [06/09/2017 11:22PM]:                  from ../deps/v8/src/gdb-jit.cc:5:
843  [06/09/2017 11:22PM]:   g++ -DV8_TARGET_ARCH_X64 -DENABLE_DISASSEMBLER -DV8_I18N_SUPPORT -DV8_IMMINENT_DEPRECATION_WARNINGS -DICU_UTIL_DATA_IMPL=ICU_UTIL_DATA_STATIC -I../deps/v8 -I../deps  -pthread -Wall -Wextra -Wno-unused-parameter -m64 -fno-strict-aliasing -m64 -fdata-sections -ffunction-sections -O3 -O3 -fno-omit-frame-pointer -fno-rtti -fno-exceptions -std=gnu++0x -MMD -MF /pkg/src/node-v6.11.0/out/Release/.deps//pkg/src/node-v6.11.0/out/Release/obj.target/v8_base/deps/v8/src/global-handles.o.d.raw -D_FORTIFY_SOURCE=2 -march=x86-64 -mtune=generic -O2 -pipe -fstack-protector-strong -c -o /pkg/src/node-v6.11.0/out/Release/obj.target/v8_base/deps/v8/src/global-handles.o ../deps/v8/src/global-handles.cc
844  [06/09/2017 11:22PM]:                  from ../deps/v8/src/global-handles.cc:7:
845  [06/09/2017 11:22PM]: In file included from ../deps/v8/src/global-handles.h:8:0,
846  [06/09/2017 11:22PM]:                  from ../deps/v8/src/global-handles.cc:5:
847  [06/09/2017 11:22PM]:   g++ -DV8_TARGET_ARCH_X64 -DENABLE_DISASSEMBLER -DV8_I18N_SUPPORT -DV8_IMMINENT_DEPRECATION_WARNINGS -DICU_UTIL_DATA_IMPL=ICU_UTIL_DATA_STATIC -I../deps/v8 -I../deps  -pthread -Wall -Wextra -Wno-unused-parameter -m64 -fno-strict-aliasing -m64 -fdata-sections -ffunction-sections -O3 -O3 -fno-omit-frame-pointer -fno-rtti -fno-exceptions -std=gnu++0x -MMD -MF /pkg/src/node-v6.11.0/out/Release/.deps//pkg/src/node-v6.11.0/out/Release/obj.target/v8_base/deps/v8/src/handles.o.d.raw -D_FORTIFY_SOURCE=2 -march=x86-64 -mtune=generic -O2 -pipe -fstack-protector-strong -c -o /pkg/src/node-v6.11.0/out/Release/obj.target/v8_base/deps/v8/src/handles.o ../deps/v8/src/handles.cc
848  [06/09/2017 11:22PM]:                  from ../deps/v8/src/handles.cc:7:
849  [06/09/2017 11:22PM]:                  from ../deps/v8/src/handles.cc:5:
850  [06/09/2017 11:22PM]:   g++ -DV8_TARGET_ARCH_X64 -DENABLE_DISASSEMBLER -DV8_I18N_SUPPORT -DV8_IMMINENT_DEPRECATION_WARNINGS -DICU_UTIL_DATA_IMPL=ICU_UTIL_DATA_STATIC -I../deps/v8 -I../deps  -pthread -Wall -Wextra -Wno-unused-parameter -m64 -fno-strict-aliasing -m64 -fdata-sections -ffunction-sections -O3 -O3 -fno-omit-frame-pointer -fno-rtti -fno-exceptions -std=gnu++0x -MMD -MF /pkg/src/node-v6.11.0/out/Release/.deps//pkg/src/node-v6.11.0/out/Release/obj.target/v8_base/deps/v8/src/heap/array-buffer-tracker.o.d.raw -D_FORTIFY_SOURCE=2 -march=x86-64 -mtune=generic -O2 -pipe -fstack-protector-strong -c -o /pkg/src/node-v6.11.0/out/Release/obj.target/v8_base/deps/v8/src/heap/array-buffer-tracker.o ../deps/v8/src/heap/array-buffer-tracker.cc
851  [06/09/2017 11:22PM]:                  from ../deps/v8/src/heap/array-buffer-tracker.cc:6:
852  [06/09/2017 11:22PM]: In file included from ../deps/v8/src/heap/array-buffer-tracker.h:11:0,
853  [06/09/2017 11:22PM]:                  from ../deps/v8/src/heap/array-buffer-tracker.cc:5:
854  [06/09/2017 11:22PM]:   g++ -DV8_TARGET_ARCH_X64 -DENABLE_DISASSEMBLER -DV8_I18N_SUPPORT -DV8_IMMINENT_DEPRECATION_WARNINGS -DICU_UTIL_DATA_IMPL=ICU_UTIL_DATA_STATIC -I../deps/v8 -I../deps  -pthread -Wall -Wextra -Wno-unused-parameter -m64 -fno-strict-aliasing -m64 -fdata-sections -ffunction-sections -O3 -O3 -fno-omit-frame-pointer -fno-rtti -fno-exceptions -std=gnu++0x -MMD -MF /pkg/src/node-v6.11.0/out/Release/.deps//pkg/src/node-v6.11.0/out/Release/obj.target/v8_base/deps/v8/src/heap/memory-reducer.o.d.raw -D_FORTIFY_SOURCE=2 -march=x86-64 -mtune=generic -O2 -pipe -fstack-protector-strong -c -o /pkg/src/node-v6.11.0/out/Release/obj.target/v8_base/deps/v8/src/heap/memory-reducer.o ../deps/v8/src/heap/memory-reducer.cc
855  [06/09/2017 11:22PM]:                  from ../deps/v8/src/heap/gc-tracer.h:9,
856  [06/09/2017 11:22PM]:                  from ../deps/v8/src/heap/memory-reducer.cc:8:
857  [06/09/2017 11:22PM]:                  from ../deps/v8/src/heap/memory-reducer.h:10,
858  [06/09/2017 11:22PM]:                  from ../deps/v8/src/heap/memory-reducer.cc:5:
859  [06/09/2017 11:22PM]:   g++ -DV8_TARGET_ARCH_X64 -DENABLE_DISASSEMBLER -DV8_I18N_SUPPORT -DV8_IMMINENT_DEPRECATION_WARNINGS -DICU_UTIL_DATA_IMPL=ICU_UTIL_DATA_STATIC -I../deps/v8 -I../deps  -pthread -Wall -Wextra -Wno-unused-parameter -m64 -fno-strict-aliasing -m64 -fdata-sections -ffunction-sections -O3 -O3 -fno-omit-frame-pointer -fno-rtti -fno-exceptions -std=gnu++0x -MMD -MF /pkg/src/node-v6.11.0/out/Release/.deps//pkg/src/node-v6.11.0/out/Release/obj.target/v8_base/deps/v8/src/heap/gc-idle-time-handler.o.d.raw -D_FORTIFY_SOURCE=2 -march=x86-64 -mtune=generic -O2 -pipe -fstack-protector-strong -c -o /pkg/src/node-v6.11.0/out/Release/obj.target/v8_base/deps/v8/src/heap/gc-idle-time-handler.o ../deps/v8/src/heap/gc-idle-time-handler.cc
860  [06/09/2017 11:22PM]:                  from ../deps/v8/src/heap/gc-idle-time-handler.cc:8:
861  [06/09/2017 11:22PM]: In file included from ../deps/v8/src/heap/gc-idle-time-handler.h:8:0,
862  [06/09/2017 11:22PM]:                  from ../deps/v8/src/heap/gc-idle-time-handler.cc:5:
863  [06/09/2017 11:22PM]:   g++ -DV8_TARGET_ARCH_X64 -DENABLE_DISASSEMBLER -DV8_I18N_SUPPORT -DV8_IMMINENT_DEPRECATION_WARNINGS -DICU_UTIL_DATA_IMPL=ICU_UTIL_DATA_STATIC -I../deps/v8 -I../deps  -pthread -Wall -Wextra -Wno-unused-parameter -m64 -fno-strict-aliasing -m64 -fdata-sections -ffunction-sections -O3 -O3 -fno-omit-frame-pointer -fno-rtti -fno-exceptions -std=gnu++0x -MMD -MF /pkg/src/node-v6.11.0/out/Release/.deps//pkg/src/node-v6.11.0/out/Release/obj.target/v8_base/deps/v8/src/heap/gc-tracer.o.d.raw -D_FORTIFY_SOURCE=2 -march=x86-64 -mtune=generic -O2 -pipe -fstack-protector-strong -c -o /pkg/src/node-v6.11.0/out/Release/obj.target/v8_base/deps/v8/src/heap/gc-tracer.o ../deps/v8/src/heap/gc-tracer.cc
864  [06/09/2017 11:22PM]:                  from ../deps/v8/src/heap/gc-tracer.cc:5:
865  [06/09/2017 11:22PM]:   g++ -DV8_TARGET_ARCH_X64 -DENABLE_DISASSEMBLER -DV8_I18N_SUPPORT -DV8_IMMINENT_DEPRECATION_WARNINGS -DICU_UTIL_DATA_IMPL=ICU_UTIL_DATA_STATIC -I../deps/v8 -I../deps  -pthread -Wall -Wextra -Wno-unused-parameter -m64 -fno-strict-aliasing -m64 -fdata-sections -ffunction-sections -O3 -O3 -fno-omit-frame-pointer -fno-rtti -fno-exceptions -std=gnu++0x -MMD -MF /pkg/src/node-v6.11.0/out/Release/.deps//pkg/src/node-v6.11.0/out/Release/obj.target/v8_base/deps/v8/src/heap/heap.o.d.raw -D_FORTIFY_SOURCE=2 -march=x86-64 -mtune=generic -O2 -pipe -fstack-protector-strong -c -o /pkg/src/node-v6.11.0/out/Release/obj.target/v8_base/deps/v8/src/heap/heap.o ../deps/v8/src/heap/heap.cc
866  [06/09/2017 11:22PM]:                  from ../deps/v8/src/heap/heap.cc:5:
867  [06/09/2017 11:22PM]: In file included from ../deps/v8/src/heap/objects-visiting.h:12:0,
868  [06/09/2017 11:22PM]:                  from ../deps/v8/src/heap/object-stats.h:9,
869  [06/09/2017 11:22PM]:                  from ../deps/v8/src/heap/heap.cc:27:
870  [06/09/2017 11:22PM]: ../deps/v8/src/objects-body-descriptors.h: In static member function static void v8::internal::FixedBodyDescriptor<start_offset, end_offset, size>::IterateBody(v8::internal::HeapObject*, int):
871  [06/09/2017 11:22PM]: ../deps/v8/src/objects-body-descriptors.h:102:20: error: no matching function for call to v8::internal::FixedBodyDescriptor<start_offset, end_offset, size>::IterateBody(v8::internal::HeapObject*&)
872  [06/09/2017 11:22PM]: ../deps/v8/src/objects-body-descriptors.h:84:22: note: candidate: template<int start_offset, int end_offset, int size> template<class ObjectVisitor> static void v8::internal::FixedBodyDescriptor<start_offset, end_offset, size>::IterateBody(v8::internal::HeapObject*, ObjectVisitor*)
873  [06/09/2017 11:22PM]:    static inline void IterateBody(HeapObject* obj, ObjectVisitor* v) {
874  [06/09/2017 11:22PM]:                       ^~~~~~~~~~~
875  [06/09/2017 11:22PM]: ../deps/v8/src/objects-body-descriptors.h:84:22: note:   template argument deduction/substitution failed:
876  [06/09/2017 11:22PM]: ../deps/v8/src/objects-body-descriptors.h:102:20: note:   candidate expects 2 arguments, 1 provided
877  [06/09/2017 11:22PM]: ../deps/v8/src/objects-body-descriptors.h:89:22: note: candidate: template<int start_offset, int end_offset, int size> template<class ObjectVisitor> static void v8::internal::FixedBodyDescriptor<start_offset, end_offset, size>::IterateBody(v8::internal::HeapObject*, int, ObjectVisitor*)
878  [06/09/2017 11:22PM]:    static inline void IterateBody(HeapObject* obj, int object_size,
879  [06/09/2017 11:22PM]: ../deps/v8/src/objects-body-descriptors.h:89:22: note:   template argument deduction/substitution failed:
880  [06/09/2017 11:22PM]: ../deps/v8/src/objects-body-descriptors.h:102:20: note:   candidate expects 3 arguments, 1 provided
881  [06/09/2017 11:22PM]: ../deps/v8/src/objects-body-descriptors.h:95:22: note: candidate: template<int start_offset, int end_offset, int size> template<class StaticVisitor> static void v8::internal::FixedBodyDescriptor<start_offset, end_offset, size>::IterateBody(v8::internal::HeapObject*)
882  [06/09/2017 11:22PM]:    static inline void IterateBody(HeapObject* obj) {
883  [06/09/2017 11:22PM]: ../deps/v8/src/objects-body-descriptors.h:95:22: note:   template argument deduction/substitution failed:
884  [06/09/2017 11:22PM]: ../deps/v8/src/objects-body-descriptors.h:102:20: note:   couldnt deduce template parameter StaticVisitor
885  [06/09/2017 11:22PM]: ../deps/v8/src/objects-body-descriptors.h:101:22: note: candidate: template<int start_offset, int end_offset, int size> template<class StaticVisitor> static void v8::internal::FixedBodyDescriptor<start_offset, end_offset, size>::IterateBody(v8::internal::HeapObject*, int)
886  [06/09/2017 11:22PM]:    static inline void IterateBody(HeapObject* obj, int object_size) {
887  [06/09/2017 11:22PM]: ../deps/v8/src/objects-body-descriptors.h:101:22: note:   template argument deduction/substitution failed:
888  [06/09/2017 11:22PM]: In file included from ../deps/v8/src/heap/heap-inl.h:16:0,
889  [06/09/2017 11:22PM]:                  from ../deps/v8/src/objects-inl.h:23,
890  [06/09/2017 11:22PM]:                  from ../deps/v8/src/api.h:13,
891  [06/09/2017 11:22PM]:                  from ../deps/v8/src/heap/heap.cc:8:
892  [06/09/2017 11:22PM]: ../deps/v8/src/heap/spaces-inl.h: In member function v8::internal::MemoryChunk* v8::internal::MemoryChunkIterator::next():
893  [06/09/2017 11:22PM]: ../deps/v8/src/heap/spaces-inl.h:405:14: warning: this statement may fall through [-Wimplicit-fallthrough=]
894  [06/09/2017 11:22PM]:        state_ = kMapState;
895  [06/09/2017 11:22PM]: ../deps/v8/src/heap/spaces-inl.h:408:5: note: here
896  [06/09/2017 11:22PM]: ../deps/v8/src/heap/spaces-inl.h:412:14: warning: this statement may fall through [-Wimplicit-fallthrough=]
897  [06/09/2017 11:22PM]:        state_ = kCodeState;
898  [06/09/2017 11:22PM]:        ~~~~~~~^~~~~~~~~~~~
899  [06/09/2017 11:22PM]: ../deps/v8/src/heap/spaces-inl.h:415:5: note: here
900  [06/09/2017 11:22PM]: ../deps/v8/src/heap/spaces-inl.h:419:14: warning: this statement may fall through [-Wimplicit-fallthrough=]
901  [06/09/2017 11:22PM]:        state_ = kLargeObjectState;
902  [06/09/2017 11:22PM]: ../deps/v8/src/heap/spaces-inl.h:422:5: note: here
903  [06/09/2017 11:22PM]:      case kLargeObjectState: {
904  [06/09/2017 11:22PM]: ../deps/v8/src/heap/spaces-inl.h:427:14: warning: this statement may fall through [-Wimplicit-fallthrough=]
905  [06/09/2017 11:22PM]:        state_ = kFinishedState;
906  [06/09/2017 11:22PM]: ../deps/v8/src/heap/spaces-inl.h:430:5: note: here
907  [06/09/2017 11:22PM]: make[1]: *** [deps/v8/tools/gyp/v8_base.target.mk:480: /pkg/src/node-v6.11.0/out/Release/obj.target/v8_base/deps/v8/src/heap/heap.o] Error 1
908  [06/09/2017 11:22PM]: make[1]: Leaving directory /pkg/src/node-v6.11.0/out
909  [06/09/2017 11:22PM]: make: *** [Makefile:73: node] Error 2
910  [06/09/2017 11:22PM]: ==> ERROR: A failure occurred in build().
911  [06/09/2017 11:22PM]: rm: cannot remove **.pkg.**: No such file or directory
912  [06/09/2017 11:22PM]: [\^/\^/^\^/^\^/\^/\^/^\^/^\^/]  BUILD FAILED  [\^/\^/^\^/^\^/\^/\^/^\^/^\^/]