Build Record

Build Number: 6654

Transaction: 2960
Package: nodejs-lts
Version: 6.11.0-1
Start: 06/09/2017 11:55PM
Finish: 06/10/2017 12:06AM
Result: failed
 nodejs-lts/PKGBUILD CHANGED

Build Log

  1 [06/09/2017 11:55PM]: [\^/\^/^\^/^\^/\^/\^/^\^/^\^/]  SETTING UP ENVIRONMENT  [\^/\^/^\^/^\^/\^/\^/^\^/^\^/]
  2  [06/09/2017 11:55PM]: [\^/\^/^\^/^\^/\^/\^/^\^/^\^/]  ADDING UPSTREAM PGP KEYS TO KEYRING  [\^/\^/^\^/^\^/\^/\^/^\^/^\^/]
  3  [06/09/2017 11:55PM]: gpg: WARNING: unsafe ownership on homedir /tmp/antbs/.gnupg
  4  [06/09/2017 11:55PM]: gpg: keybox /tmp/antbs/.gnupg/pubring.kbx created
  5  [06/09/2017 11:55PM]: gpg: /tmp/antbs/.gnupg/trustdb.gpg: trustdb created
  6  [06/09/2017 11:55PM]: gpg: key 23EFEFE93C4CFFFE: public key Italo A. Casas <[email protected]> imported
  7  [06/09/2017 11:55PM]: gpg: key B63B535A4C206CA9: public key Evan Lucas <[email protected]> imported
  8  [06/09/2017 11:55PM]: gpg: key E73BC641CC11F4C8: public key Myles Borins <[email protected]> imported
  9  [06/09/2017 11:55PM]: gpg: key C273792F7D83545D: public key Rod Vagg <[email protected]> imported
 10  [06/09/2017 11:55PM]: gpg: key C97EC7A07EDE3FC1: public key keybase.io/jasnell <[email protected]> imported
 11  [06/09/2017 11:55PM]: gpg: key 09FE44734EB7990E: public key Jeremiah Senkpiel <[email protected]> imported
 12  [06/09/2017 11:55PM]: gpg: key 7434390BDBE9B9C5: public key Colin Ihrig <[email protected]> imported
 13  [06/09/2017 11:55PM]: gpg: key 61B7B526D98F0353: public key Mozilla Software Releases <[email protected]> imported
 14  [06/09/2017 11:55PM]: gpg: key 61B7B526D98F0353: Mozilla Software Releases <[email protected]> not changed
 15  [06/09/2017 11:55PM]: gpg: no ultimately trusted keys found
 16  [06/09/2017 11:55PM]: gpg: Total number processed: 9
 17  [06/09/2017 11:55PM]: gpg:               imported: 8
 18  [06/09/2017 11:55PM]: gpg:              unchanged: 1
 19  [06/09/2017 11:55PM]: [\^/\^/^\^/^\^/\^/\^/^\^/^\^/]  SYNCING REPO DATABASES  [\^/\^/^\^/^\^/\^/\^/^\^/^\^/]
 20  [06/09/2017 11:55PM]: :: Synchronizing package databases...
 21  [06/09/2017 11:55PM]: downloading antergos-staging.db...
 22  [06/09/2017 11:55PM]: downloading antergos.db...
 23  [06/09/2017 11:55PM]: downloading core.db...
 24  [06/09/2017 11:55PM]: downloading community.db...
 25  [06/09/2017 11:55PM]: :: Starting full system upgrade...
 26  [06/09/2017 11:55PM]: [\^/\^/^\^/^\^/\^/\^/^\^/^\^/]  TRYING BUILD  [\^/\^/^\^/^\^/\^/\^/^\^/^\^/]
 27  [06/09/2017 11:55PM]: [\^/\^/^\^/^\^/\^/\^/^\^/^\^/]  UPDATING SOURCE CHECKSUMS  [\^/\^/^\^/^\^/\^/\^/^\^/^\^/]
 28  [06/09/2017 11:55PM]: ==> Making package: nodejs-lts 6.11.0-1 (Sat Jun 10 04:55:19 UTC 2017)
 29  [06/09/2017 11:55PM]: ==> Checking runtime dependencies...
 30  [06/09/2017 11:55PM]: ==> Installing missing dependencies...
 31  [06/09/2017 11:55PM]: looking for conflicting packages...
 32  [06/09/2017 11:55PM]: Packages (4) c-ares-1.12.0-1  http-parser-2.7.1-1  libuv-1.12.0-1  openssl-1.0-1.0.2.l-1
 33  [06/09/2017 11:55PM]: Total Installed Size:  6.41 MiB
 34  [06/09/2017 11:55PM]: :: Proceed with installation? [Y/n]
 35  [06/09/2017 11:55PM]: checking package integrity...
 36  [06/09/2017 11:55PM]: checking for file conflicts...
 37  [06/09/2017 11:55PM]: :: Processing package changes...
 38  [06/09/2017 11:55PM]: Optional dependencies for openssl-1.0
 39  [06/09/2017 11:55PM]:     ca-certificates [installed]
 40  [06/09/2017 11:55PM]: :: Running post-transaction hooks...
 41  [06/09/2017 11:55PM]: (1/1) Arming ConditionNeedsUpdate...
 42  [06/09/2017 11:55PM]: Packages (2) procps-ng-3.3.12-1  python2-2.7.13-2
 43  [06/09/2017 11:55PM]: Total Installed Size:  72.54 MiB
 44  [06/09/2017 11:55PM]: Optional dependencies for python2
 45  [06/09/2017 11:55PM]:   -> Downloading node-v6.11.0.tar.xz...
 46  [06/09/2017 11:55PM]:   % Total    % Received % Xferd  Average Speed   Time    Time     Time  Current
 47  [06/09/2017 11:55PM]:                                  Dload  Upload   Total   Spent    Left  Speed
 48  [06/09/2017 11:55PM]: 
 49   0     0    0     0    0     0      0      0 --:--:-- --:--:-- --:--:--     0
 50 100 15.0M  100 15.0M    0     0  34.2M      0 --:--:-- --:--:-- --:--:-- 34.2M
 51  [06/09/2017 11:55PM]:   -> Downloading SHASUMS256.txt.sig...
 52  [06/09/2017 11:55PM]: 
 53   0     0    0     0    0     0      0      0 --:--:-- --:--:-- --:--:--     0
 54 100   287    0   287    0     0   2089      0 --:--:-- --:--:-- --:--:--  2094
 55  [06/09/2017 11:55PM]: ==> Validating source files with sha256sums...
 56  [06/09/2017 11:55PM]:     node-v6.11.0.tar.xz ... Passed
 57  [06/09/2017 11:55PM]:     SHASUMS256.txt ... Skipped
 58  [06/09/2017 11:55PM]:     SHASUMS256.txt.sig ... Skipped
 59  [06/09/2017 11:55PM]: ==> Verifying source file signatures with gpg...
 60  [06/09/2017 11:55PM]:     SHASUMS256.txt ... Passed
 61  [06/09/2017 11:55PM]:   -> Extracting node-v6.11.0.tar.xz with bsdtar
 62  [06/09/2017 11:55PM]: creating ./icu_config.gypi
 63  [06/09/2017 11:55PM]: { target_defaults: { cflags: [],
 64  [06/09/2017 11:55PM]:                        default_configuration: Release,
 65  [06/09/2017 11:55PM]:                        defines: [],
 66  [06/09/2017 11:55PM]:                        include_dirs: [/usr/include/openssl-1.0],
 67  [06/09/2017 11:55PM]:                        libraries: [ -lz,
 68  [06/09/2017 11:55PM]:                                       -lhttp_parser,
 69  [06/09/2017 11:55PM]:                                       -luv,
 70  [06/09/2017 11:55PM]:                                       -lcares,
 71  [06/09/2017 11:55PM]:                                       -L/usr/lib/openssl-1.0,
 72  [06/09/2017 11:55PM]:                                       -lcrypto,
 73  [06/09/2017 11:55PM]:                                       -lssl,
 74  [06/09/2017 11:55PM]:                                       -licui18n,
 75  [06/09/2017 11:55PM]:                                       -licuuc,
 76  [06/09/2017 11:55PM]:                                       -licudata]},
 77  [06/09/2017 11:55PM]:   variables: { asan: 0,
 78  [06/09/2017 11:55PM]:                  coverage: false,
 79  [06/09/2017 11:55PM]:                  debug_devtools: node,
 80  [06/09/2017 11:55PM]:                  force_dynamic_crt: 0,
 81  [06/09/2017 11:55PM]:                  host_arch: x64,
 82  [06/09/2017 11:55PM]:                  icu_gyp_path: tools/icu/icu-system.gyp,
 83  [06/09/2017 11:55PM]:                  icu_small: false,
 84  [06/09/2017 11:55PM]:                  node_byteorder: little,
 85  [06/09/2017 11:55PM]:                  node_enable_d8: false,
 86  [06/09/2017 11:55PM]:                  node_enable_v8_vtunejit: false,
 87  [06/09/2017 11:55PM]:                  node_install_npm: true,
 88  [06/09/2017 11:55PM]:                  node_module_version: 48,
 89  [06/09/2017 11:55PM]:                  node_no_browser_globals: false,
 90  [06/09/2017 11:55PM]:                  node_prefix: /usr,
 91  [06/09/2017 11:55PM]:                  node_release_urlbase: ,
 92  [06/09/2017 11:55PM]:                  node_shared: false,
 93  [06/09/2017 11:55PM]:                  node_shared_cares: true,
 94  [06/09/2017 11:55PM]:                  node_shared_http_parser: true,
 95  [06/09/2017 11:55PM]:                  node_shared_libuv: true,
 96  [06/09/2017 11:55PM]:                  node_shared_openssl: true,
 97  [06/09/2017 11:55PM]:                  node_shared_zlib: true,
 98  [06/09/2017 11:55PM]:                  node_tag: ,
 99  [06/09/2017 11:55PM]:                  node_use_bundled_v8: true,
100  [06/09/2017 11:55PM]:                  node_use_dtrace: false,
101  [06/09/2017 11:55PM]:                  node_use_etw: false,
102  [06/09/2017 11:55PM]:                  node_use_lttng: false,
103  [06/09/2017 11:55PM]:                  node_use_openssl: true,
104  [06/09/2017 11:55PM]:                  node_use_perfctr: false,
105  [06/09/2017 11:55PM]:                  node_use_v8_platform: true,
106  [06/09/2017 11:55PM]:                  openssl_fips: ,
107  [06/09/2017 11:55PM]:                  openssl_no_asm: 0,
108  [06/09/2017 11:55PM]:                  shlib_suffix: so.48,
109  [06/09/2017 11:55PM]:                  target_arch: x64,
110  [06/09/2017 11:55PM]:                  uv_parent_path: /deps/uv/,
111  [06/09/2017 11:55PM]:                  uv_use_dtrace: false,
112  [06/09/2017 11:55PM]:                  v8_enable_gdbjit: 0,
113  [06/09/2017 11:55PM]:                  v8_enable_i18n_support: 1,
114  [06/09/2017 11:55PM]:                  v8_inspector: true,
115  [06/09/2017 11:55PM]:                  v8_no_strict_aliasing: 1,
116  [06/09/2017 11:55PM]:                  v8_optimized_debug: 0,
117  [06/09/2017 11:55PM]:                  v8_random_seed: 0,
118  [06/09/2017 11:55PM]:                  v8_use_snapshot: true,
119  [06/09/2017 11:55PM]:                  want_separate_host_toolset: 0}}
120  [06/09/2017 11:55PM]: make -C out BUILDTYPE=Release V=1
121  [06/09/2017 11:55PM]: make[1]: Entering directory /pkg/src/node-v6.11.0/out
122  [06/09/2017 11:55PM]:   g++  -I/usr/include/openssl-1.0 -I../deps/gtest -I../deps/gtest/include  -pthread -Wall -Wextra -Wno-unused-parameter -m64 -Wno-missing-field-initializers -O3 -fno-omit-frame-pointer -fno-rtti -fno-exceptions -std=gnu++0x -MMD -MF /pkg/src/node-v6.11.0/out/Release/.deps//pkg/src/node-v6.11.0/out/Release/obj.target/gtest/deps/gtest/src/gtest-death-test.o.d.raw -D_FORTIFY_SOURCE=2 -march=x86-64 -mtune=generic -O2 -pipe -fstack-protector-strong -c -o /pkg/src/node-v6.11.0/out/Release/obj.target/gtest/deps/gtest/src/gtest-death-test.o ../deps/gtest/src/gtest-death-test.cc
123  [06/09/2017 11:55PM]:   g++  -I/usr/include/openssl-1.0 -I../deps/gtest -I../deps/gtest/include  -pthread -Wall -Wextra -Wno-unused-parameter -m64 -Wno-missing-field-initializers -O3 -fno-omit-frame-pointer -fno-rtti -fno-exceptions -std=gnu++0x -MMD -MF /pkg/src/node-v6.11.0/out/Release/.deps//pkg/src/node-v6.11.0/out/Release/obj.target/gtest/deps/gtest/src/gtest-filepath.o.d.raw -D_FORTIFY_SOURCE=2 -march=x86-64 -mtune=generic -O2 -pipe -fstack-protector-strong -c -o /pkg/src/node-v6.11.0/out/Release/obj.target/gtest/deps/gtest/src/gtest-filepath.o ../deps/gtest/src/gtest-filepath.cc
124  [06/09/2017 11:55PM]:   g++  -I/usr/include/openssl-1.0 -I../deps/gtest -I../deps/gtest/include  -pthread -Wall -Wextra -Wno-unused-parameter -m64 -Wno-missing-field-initializers -O3 -fno-omit-frame-pointer -fno-rtti -fno-exceptions -std=gnu++0x -MMD -MF /pkg/src/node-v6.11.0/out/Release/.deps//pkg/src/node-v6.11.0/out/Release/obj.target/gtest/deps/gtest/src/gtest-port.o.d.raw -D_FORTIFY_SOURCE=2 -march=x86-64 -mtune=generic -O2 -pipe -fstack-protector-strong -c -o /pkg/src/node-v6.11.0/out/Release/obj.target/gtest/deps/gtest/src/gtest-port.o ../deps/gtest/src/gtest-port.cc
125  [06/09/2017 11:55PM]:   g++  -I/usr/include/openssl-1.0 -I../deps/gtest -I../deps/gtest/include  -pthread -Wall -Wextra -Wno-unused-parameter -m64 -Wno-missing-field-initializers -O3 -fno-omit-frame-pointer -fno-rtti -fno-exceptions -std=gnu++0x -MMD -MF /pkg/src/node-v6.11.0/out/Release/.deps//pkg/src/node-v6.11.0/out/Release/obj.target/gtest/deps/gtest/src/gtest-printers.o.d.raw -D_FORTIFY_SOURCE=2 -march=x86-64 -mtune=generic -O2 -pipe -fstack-protector-strong -c -o /pkg/src/node-v6.11.0/out/Release/obj.target/gtest/deps/gtest/src/gtest-printers.o ../deps/gtest/src/gtest-printers.cc
126  [06/09/2017 11:55PM]:   g++  -I/usr/include/openssl-1.0 -I../deps/gtest -I../deps/gtest/include  -pthread -Wall -Wextra -Wno-unused-parameter -m64 -Wno-missing-field-initializers -O3 -fno-omit-frame-pointer -fno-rtti -fno-exceptions -std=gnu++0x -MMD -MF /pkg/src/node-v6.11.0/out/Release/.deps//pkg/src/node-v6.11.0/out/Release/obj.target/gtest/deps/gtest/src/gtest-test-part.o.d.raw -D_FORTIFY_SOURCE=2 -march=x86-64 -mtune=generic -O2 -pipe -fstack-protector-strong -c -o /pkg/src/node-v6.11.0/out/Release/obj.target/gtest/deps/gtest/src/gtest-test-part.o ../deps/gtest/src/gtest-test-part.cc
127  [06/09/2017 11:55PM]:   g++  -I/usr/include/openssl-1.0 -I../deps/gtest -I../deps/gtest/include  -pthread -Wall -Wextra -Wno-unused-parameter -m64 -Wno-missing-field-initializers -O3 -fno-omit-frame-pointer -fno-rtti -fno-exceptions -std=gnu++0x -MMD -MF /pkg/src/node-v6.11.0/out/Release/.deps//pkg/src/node-v6.11.0/out/Release/obj.target/gtest/deps/gtest/src/gtest-typed-test.o.d.raw -D_FORTIFY_SOURCE=2 -march=x86-64 -mtune=generic -O2 -pipe -fstack-protector-strong -c -o /pkg/src/node-v6.11.0/out/Release/obj.target/gtest/deps/gtest/src/gtest-typed-test.o ../deps/gtest/src/gtest-typed-test.cc
128  [06/09/2017 11:55PM]:   g++  -I/usr/include/openssl-1.0 -I../deps/gtest -I../deps/gtest/include  -pthread -Wall -Wextra -Wno-unused-parameter -m64 -Wno-missing-field-initializers -O3 -fno-omit-frame-pointer -fno-rtti -fno-exceptions -std=gnu++0x -MMD -MF /pkg/src/node-v6.11.0/out/Release/.deps//pkg/src/node-v6.11.0/out/Release/obj.target/gtest/deps/gtest/src/gtest.o.d.raw -D_FORTIFY_SOURCE=2 -march=x86-64 -mtune=generic -O2 -pipe -fstack-protector-strong -c -o /pkg/src/node-v6.11.0/out/Release/obj.target/gtest/deps/gtest/src/gtest.o ../deps/gtest/src/gtest.cc
129  [06/09/2017 11:56PM]:   g++  -I/usr/include/openssl-1.0 -I../deps/gtest -I../deps/gtest/include  -pthread -Wall -Wextra -Wno-unused-parameter -m64 -Wno-missing-field-initializers -O3 -fno-omit-frame-pointer -fno-rtti -fno-exceptions -std=gnu++0x -MMD -MF /pkg/src/node-v6.11.0/out/Release/.deps//pkg/src/node-v6.11.0/out/Release/obj.target/gtest/deps/gtest/src/gtest_main.o.d.raw -D_FORTIFY_SOURCE=2 -march=x86-64 -mtune=generic -O2 -pipe -fstack-protector-strong -c -o /pkg/src/node-v6.11.0/out/Release/obj.target/gtest/deps/gtest/src/gtest_main.o ../deps/gtest/src/gtest_main.cc
130  [06/09/2017 11:56PM]:   rm -f /pkg/src/node-v6.11.0/out/Release/obj.target/deps/gtest/libgtest.a && ar crsT /pkg/src/node-v6.11.0/out/Release/obj.target/deps/gtest/libgtest.a /pkg/src/node-v6.11.0/out/Release/obj.target/gtest/deps/gtest/src/gtest-death-test.o /pkg/src/node-v6.11.0/out/Release/obj.target/gtest/deps/gtest/src/gtest-filepath.o /pkg/src/node-v6.11.0/out/Release/obj.target/gtest/deps/gtest/src/gtest-port.o /pkg/src/node-v6.11.0/out/Release/obj.target/gtest/deps/gtest/src/gtest-printers.o /pkg/src/node-v6.11.0/out/Release/obj.target/gtest/deps/gtest/src/gtest-test-part.o /pkg/src/node-v6.11.0/out/Release/obj.target/gtest/deps/gtest/src/gtest-typed-test.o /pkg/src/node-v6.11.0/out/Release/obj.target/gtest/deps/gtest/src/gtest.o /pkg/src/node-v6.11.0/out/Release/obj.target/gtest/deps/gtest/src/gtest_main.o
131  [06/09/2017 11:56PM]:   g++ -DV8_TARGET_ARCH_X64 -DENABLE_DISASSEMBLER -DV8_I18N_SUPPORT -I../deps/v8 -I/usr/include/openssl-1.0  -pthread -Wall -Wextra -Wno-unused-parameter -m64 -fno-strict-aliasing -m64 -fdata-sections -ffunction-sections -O3 -O3 -fno-omit-frame-pointer -fno-rtti -fno-exceptions -std=gnu++0x -MMD -MF /pkg/src/node-v6.11.0/out/Release/.deps//pkg/src/node-v6.11.0/out/Release/obj.target/v8_libplatform/deps/v8/src/libplatform/default-platform.o.d.raw -D_FORTIFY_SOURCE=2 -march=x86-64 -mtune=generic -O2 -pipe -fstack-protector-strong -c -o /pkg/src/node-v6.11.0/out/Release/obj.target/v8_libplatform/deps/v8/src/libplatform/default-platform.o ../deps/v8/src/libplatform/default-platform.cc
132  [06/09/2017 11:56PM]:   g++ -DV8_TARGET_ARCH_X64 -DENABLE_DISASSEMBLER -DV8_I18N_SUPPORT -I../deps/v8 -I/usr/include/openssl-1.0  -pthread -Wall -Wextra -Wno-unused-parameter -m64 -fno-strict-aliasing -m64 -fdata-sections -ffunction-sections -O3 -O3 -fno-omit-frame-pointer -fno-rtti -fno-exceptions -std=gnu++0x -MMD -MF /pkg/src/node-v6.11.0/out/Release/.deps//pkg/src/node-v6.11.0/out/Release/obj.target/v8_libplatform/deps/v8/src/libplatform/task-queue.o.d.raw -D_FORTIFY_SOURCE=2 -march=x86-64 -mtune=generic -O2 -pipe -fstack-protector-strong -c -o /pkg/src/node-v6.11.0/out/Release/obj.target/v8_libplatform/deps/v8/src/libplatform/task-queue.o ../deps/v8/src/libplatform/task-queue.cc
133  [06/09/2017 11:56PM]:   g++ -DV8_TARGET_ARCH_X64 -DENABLE_DISASSEMBLER -DV8_I18N_SUPPORT -I../deps/v8 -I/usr/include/openssl-1.0  -pthread -Wall -Wextra -Wno-unused-parameter -m64 -fno-strict-aliasing -m64 -fdata-sections -ffunction-sections -O3 -O3 -fno-omit-frame-pointer -fno-rtti -fno-exceptions -std=gnu++0x -MMD -MF /pkg/src/node-v6.11.0/out/Release/.deps//pkg/src/node-v6.11.0/out/Release/obj.target/v8_libplatform/deps/v8/src/libplatform/worker-thread.o.d.raw -D_FORTIFY_SOURCE=2 -march=x86-64 -mtune=generic -O2 -pipe -fstack-protector-strong -c -o /pkg/src/node-v6.11.0/out/Release/obj.target/v8_libplatform/deps/v8/src/libplatform/worker-thread.o ../deps/v8/src/libplatform/worker-thread.cc
134  [06/09/2017 11:56PM]:   rm -f /pkg/src/node-v6.11.0/out/Release/obj.target/deps/v8/tools/gyp/libv8_libplatform.a && ar crsT /pkg/src/node-v6.11.0/out/Release/obj.target/deps/v8/tools/gyp/libv8_libplatform.a /pkg/src/node-v6.11.0/out/Release/obj.target/v8_libplatform/deps/v8/src/libplatform/default-platform.o /pkg/src/node-v6.11.0/out/Release/obj.target/v8_libplatform/deps/v8/src/libplatform/task-queue.o /pkg/src/node-v6.11.0/out/Release/obj.target/v8_libplatform/deps/v8/src/libplatform/worker-thread.o
135  [06/09/2017 11:56PM]:   touch /pkg/src/node-v6.11.0/out/Release/obj.target/tools/icu/icui18n.stamp
136  [06/09/2017 11:56PM]:   touch /pkg/src/node-v6.11.0/out/Release/obj.target/tools/icu/icuuc.stamp
137  [06/09/2017 11:56PM]:   g++ -DV8_TARGET_ARCH_X64 -DENABLE_DISASSEMBLER -DV8_I18N_SUPPORT -DV8_IMMINENT_DEPRECATION_WARNINGS -DICU_UTIL_DATA_IMPL=ICU_UTIL_DATA_STATIC -I../deps/v8 -I../deps -I/usr/include/openssl-1.0  -pthread -Wall -Wextra -Wno-unused-parameter -m64 -fno-strict-aliasing -m64 -fdata-sections -ffunction-sections -O3 -O3 -fno-omit-frame-pointer -fno-rtti -fno-exceptions -std=gnu++0x -MMD -MF /pkg/src/node-v6.11.0/out/Release/.deps//pkg/src/node-v6.11.0/out/Release/obj.target/v8_base/deps/v8/src/accessors.o.d.raw -D_FORTIFY_SOURCE=2 -march=x86-64 -mtune=generic -O2 -pipe -fstack-protector-strong -c -o /pkg/src/node-v6.11.0/out/Release/obj.target/v8_base/deps/v8/src/accessors.o ../deps/v8/src/accessors.cc
138  [06/09/2017 11:56PM]: In file included from ../deps/v8/src/heap/spaces.h:16:0,
139  [06/09/2017 11:56PM]:                  from ../deps/v8/src/heap/heap.h:20,
140  [06/09/2017 11:56PM]:                  from ../deps/v8/src/contexts.h:8,
141  [06/09/2017 11:56PM]:                  from ../deps/v8/src/api.h:9,
142  [06/09/2017 11:56PM]:                  from ../deps/v8/src/accessors.cc:7:
143  [06/09/2017 11:56PM]: ../deps/v8/src/objects.h: In member function uint32_t v8::internal::HashTable<Derived, Shape, Key>::Hash(Key):
144  [06/09/2017 11:56PM]: ../deps/v8/src/objects.h:3267:46: warning: invalid use of incomplete type class v8::internal::Heap
145  [06/09/2017 11:56PM]:        return Shape::SeededHash(key, GetHeap()->HashSeed());
146  [06/09/2017 11:56PM]:                                               ^~
147  [06/09/2017 11:56PM]: In file included from ../deps/v8/src/accessors.h:8:0,
148  [06/09/2017 11:56PM]:                  from ../deps/v8/src/accessors.cc:5:
149  [06/09/2017 11:56PM]: ../deps/v8/include/v8.h:148:7: note: forward declaration of class v8::internal::Heap
150  [06/09/2017 11:56PM]: ../deps/v8/src/objects.h: In member function uint32_t v8::internal::HashTable<Derived, Shape, Key>::HashForObject(Key, v8::internal::Object*):
151  [06/09/2017 11:56PM]: ../deps/v8/src/objects.h:3275:55: warning: invalid use of incomplete type class v8::internal::Heap
152  [06/09/2017 11:56PM]:        return Shape::SeededHashForObject(key, GetHeap()->HashSeed(), object);
153  [06/09/2017 11:56PM]:                                                        ^~
154  [06/09/2017 11:56PM]:   g++ -DV8_TARGET_ARCH_X64 -DENABLE_DISASSEMBLER -DV8_I18N_SUPPORT -DV8_IMMINENT_DEPRECATION_WARNINGS -DICU_UTIL_DATA_IMPL=ICU_UTIL_DATA_STATIC -I../deps/v8 -I../deps -I/usr/include/openssl-1.0  -pthread -Wall -Wextra -Wno-unused-parameter -m64 -fno-strict-aliasing -m64 -fdata-sections -ffunction-sections -O3 -O3 -fno-omit-frame-pointer -fno-rtti -fno-exceptions -std=gnu++0x -MMD -MF /pkg/src/node-v6.11.0/out/Release/.deps//pkg/src/node-v6.11.0/out/Release/obj.target/v8_base/deps/v8/src/address-map.o.d.raw -D_FORTIFY_SOURCE=2 -march=x86-64 -mtune=generic -O2 -pipe -fstack-protector-strong -c -o /pkg/src/node-v6.11.0/out/Release/obj.target/v8_base/deps/v8/src/address-map.o ../deps/v8/src/address-map.cc
155  [06/09/2017 11:56PM]: In file included from ../deps/v8/src/address-map.h:10:0,
156  [06/09/2017 11:56PM]:                  from ../deps/v8/src/address-map.cc:5:
157  [06/09/2017 11:56PM]: In file included from ../deps/v8/src/allocation.h:8:0,
158  [06/09/2017 11:56PM]:                  from ../deps/v8/src/hashmap.h:8,
159  [06/09/2017 11:56PM]:                  from ../deps/v8/src/address-map.h:9,
160  [06/09/2017 11:56PM]: ../deps/v8/src/globals.h:393:7: note: forward declaration of class v8::internal::Heap
161  [06/09/2017 11:56PM]:   g++ -DV8_TARGET_ARCH_X64 -DENABLE_DISASSEMBLER -DV8_I18N_SUPPORT -DV8_IMMINENT_DEPRECATION_WARNINGS -DICU_UTIL_DATA_IMPL=ICU_UTIL_DATA_STATIC -I../deps/v8 -I../deps -I/usr/include/openssl-1.0  -pthread -Wall -Wextra -Wno-unused-parameter -m64 -fno-strict-aliasing -m64 -fdata-sections -ffunction-sections -O3 -O3 -fno-omit-frame-pointer -fno-rtti -fno-exceptions -std=gnu++0x -MMD -MF /pkg/src/node-v6.11.0/out/Release/.deps//pkg/src/node-v6.11.0/out/Release/obj.target/v8_base/deps/v8/src/allocation.o.d.raw -D_FORTIFY_SOURCE=2 -march=x86-64 -mtune=generic -O2 -pipe -fstack-protector-strong -c -o /pkg/src/node-v6.11.0/out/Release/obj.target/v8_base/deps/v8/src/allocation.o ../deps/v8/src/allocation.cc
162  [06/09/2017 11:56PM]:   g++ -DV8_TARGET_ARCH_X64 -DENABLE_DISASSEMBLER -DV8_I18N_SUPPORT -DV8_IMMINENT_DEPRECATION_WARNINGS -DICU_UTIL_DATA_IMPL=ICU_UTIL_DATA_STATIC -I../deps/v8 -I../deps -I/usr/include/openssl-1.0  -pthread -Wall -Wextra -Wno-unused-parameter -m64 -fno-strict-aliasing -m64 -fdata-sections -ffunction-sections -O3 -O3 -fno-omit-frame-pointer -fno-rtti -fno-exceptions -std=gnu++0x -MMD -MF /pkg/src/node-v6.11.0/out/Release/.deps//pkg/src/node-v6.11.0/out/Release/obj.target/v8_base/deps/v8/src/allocation-site-scopes.o.d.raw -D_FORTIFY_SOURCE=2 -march=x86-64 -mtune=generic -O2 -pipe -fstack-protector-strong -c -o /pkg/src/node-v6.11.0/out/Release/obj.target/v8_base/deps/v8/src/allocation-site-scopes.o ../deps/v8/src/allocation-site-scopes.cc
163  [06/09/2017 11:56PM]:                  from ../deps/v8/src/isolate.h:18,
164  [06/09/2017 11:56PM]:                  from ../deps/v8/src/assembler.h:40,
165  [06/09/2017 11:56PM]:                  from ../deps/v8/src/ast/ast.h:8,
166  [06/09/2017 11:56PM]:                  from ../deps/v8/src/allocation-site-scopes.h:8,
167  [06/09/2017 11:56PM]:                  from ../deps/v8/src/allocation-site-scopes.cc:5:
168  [06/09/2017 11:56PM]:                  from ../deps/v8/src/assembler.h:38,
169  [06/09/2017 11:56PM]:   g++ -DV8_TARGET_ARCH_X64 -DENABLE_DISASSEMBLER -DV8_I18N_SUPPORT -DV8_IMMINENT_DEPRECATION_WARNINGS -DICU_UTIL_DATA_IMPL=ICU_UTIL_DATA_STATIC -I../deps/v8 -I../deps -I/usr/include/openssl-1.0  -pthread -Wall -Wextra -Wno-unused-parameter -m64 -fno-strict-aliasing -m64 -fdata-sections -ffunction-sections -O3 -O3 -fno-omit-frame-pointer -fno-rtti -fno-exceptions -std=gnu++0x -MMD -MF /pkg/src/node-v6.11.0/out/Release/.deps//pkg/src/node-v6.11.0/out/Release/obj.target/v8_base/deps/v8/src/api-experimental.o.d.raw -D_FORTIFY_SOURCE=2 -march=x86-64 -mtune=generic -O2 -pipe -fstack-protector-strong -c -o /pkg/src/node-v6.11.0/out/Release/obj.target/v8_base/deps/v8/src/api-experimental.o ../deps/v8/src/api-experimental.cc
170  [06/09/2017 11:56PM]:                  from ../deps/v8/src/api-experimental.cc:13:
171  [06/09/2017 11:56PM]: In file included from ../deps/v8/src/handles.h:8:0,
172  [06/09/2017 11:56PM]:                  from ../deps/v8/src/api-experimental.h:8,
173  [06/09/2017 11:56PM]:                  from ../deps/v8/src/api-experimental.cc:9:
174  [06/09/2017 11:56PM]:   g++ -DV8_TARGET_ARCH_X64 -DENABLE_DISASSEMBLER -DV8_I18N_SUPPORT -DV8_IMMINENT_DEPRECATION_WARNINGS -DICU_UTIL_DATA_IMPL=ICU_UTIL_DATA_STATIC -I../deps/v8 -I../deps -I/usr/include/openssl-1.0  -pthread -Wall -Wextra -Wno-unused-parameter -m64 -fno-strict-aliasing -m64 -fdata-sections -ffunction-sections -O3 -O3 -fno-omit-frame-pointer -fno-rtti -fno-exceptions -std=gnu++0x -MMD -MF /pkg/src/node-v6.11.0/out/Release/.deps//pkg/src/node-v6.11.0/out/Release/obj.target/v8_base/deps/v8/src/api.o.d.raw -D_FORTIFY_SOURCE=2 -march=x86-64 -mtune=generic -O2 -pipe -fstack-protector-strong -c -o /pkg/src/node-v6.11.0/out/Release/obj.target/v8_base/deps/v8/src/api.o ../deps/v8/src/api.cc
175  [06/09/2017 11:56PM]:                  from ../deps/v8/src/api.cc:5:
176  [06/09/2017 11:56PM]: In file included from ../deps/v8/include/v8-testing.h:8:0,
177  [06/09/2017 11:56PM]:                  from ../deps/v8/src/api.h:8,
178  [06/09/2017 11:56PM]: In file included from ../deps/v8/src/api.cc:5:0:
179  [06/09/2017 11:56PM]: ../deps/v8/src/api.h: In instantiation of v8::internal::Handle<v8::internal::Object> v8::FromCData(v8::internal::Isolate*, T) [with T = std::nullptr_t]:
180  [06/09/2017 11:56PM]: ../deps/v8/src/api.cc:1582:3:   required from here
181  [06/09/2017 11:56PM]: ../deps/v8/src/api.h:106:39: warning: parameter obj set but not used [-Wunused-but-set-parameter]
182  [06/09/2017 11:56PM]:      v8::internal::Isolate* isolate, T obj) {
183  [06/09/2017 11:56PM]:                                        ^~~
184  [06/09/2017 11:56PM]:   g++ -DV8_TARGET_ARCH_X64 -DENABLE_DISASSEMBLER -DV8_I18N_SUPPORT -DV8_IMMINENT_DEPRECATION_WARNINGS -DICU_UTIL_DATA_IMPL=ICU_UTIL_DATA_STATIC -I../deps/v8 -I../deps -I/usr/include/openssl-1.0  -pthread -Wall -Wextra -Wno-unused-parameter -m64 -fno-strict-aliasing -m64 -fdata-sections -ffunction-sections -O3 -O3 -fno-omit-frame-pointer -fno-rtti -fno-exceptions -std=gnu++0x -MMD -MF /pkg/src/node-v6.11.0/out/Release/.deps//pkg/src/node-v6.11.0/out/Release/obj.target/v8_base/deps/v8/src/api-arguments.o.d.raw -D_FORTIFY_SOURCE=2 -march=x86-64 -mtune=generic -O2 -pipe -fstack-protector-strong -c -o /pkg/src/node-v6.11.0/out/Release/obj.target/v8_base/deps/v8/src/api-arguments.o ../deps/v8/src/api-arguments.cc
185  [06/09/2017 11:56PM]:                  from ../deps/v8/src/api-arguments.h:8,
186  [06/09/2017 11:56PM]:                  from ../deps/v8/src/api-arguments.cc:5:
187  [06/09/2017 11:56PM]:   g++ -DV8_TARGET_ARCH_X64 -DENABLE_DISASSEMBLER -DV8_I18N_SUPPORT -DV8_IMMINENT_DEPRECATION_WARNINGS -DICU_UTIL_DATA_IMPL=ICU_UTIL_DATA_STATIC -I../deps/v8 -I../deps -I/usr/include/openssl-1.0  -pthread -Wall -Wextra -Wno-unused-parameter -m64 -fno-strict-aliasing -m64 -fdata-sections -ffunction-sections -O3 -O3 -fno-omit-frame-pointer -fno-rtti -fno-exceptions -std=gnu++0x -MMD -MF /pkg/src/node-v6.11.0/out/Release/.deps//pkg/src/node-v6.11.0/out/Release/obj.target/v8_base/deps/v8/src/api-natives.o.d.raw -D_FORTIFY_SOURCE=2 -march=x86-64 -mtune=generic -O2 -pipe -fstack-protector-strong -c -o /pkg/src/node-v6.11.0/out/Release/obj.target/v8_base/deps/v8/src/api-natives.o ../deps/v8/src/api-natives.cc
188  [06/09/2017 11:56PM]:                  from ../deps/v8/src/api-natives.cc:7:
189  [06/09/2017 11:56PM]:                  from ../deps/v8/src/api-natives.h:8,
190  [06/09/2017 11:56PM]:                  from ../deps/v8/src/api-natives.cc:5:
191  [06/09/2017 11:56PM]:   g++ -DV8_TARGET_ARCH_X64 -DENABLE_DISASSEMBLER -DV8_I18N_SUPPORT -DV8_IMMINENT_DEPRECATION_WARNINGS -DICU_UTIL_DATA_IMPL=ICU_UTIL_DATA_STATIC -I../deps/v8 -I../deps -I/usr/include/openssl-1.0  -pthread -Wall -Wextra -Wno-unused-parameter -m64 -fno-strict-aliasing -m64 -fdata-sections -ffunction-sections -O3 -O3 -fno-omit-frame-pointer -fno-rtti -fno-exceptions -std=gnu++0x -MMD -MF /pkg/src/node-v6.11.0/out/Release/.deps//pkg/src/node-v6.11.0/out/Release/obj.target/v8_base/deps/v8/src/arguments.o.d.raw -D_FORTIFY_SOURCE=2 -march=x86-64 -mtune=generic -O2 -pipe -fstack-protector-strong -c -o /pkg/src/node-v6.11.0/out/Release/obj.target/v8_base/deps/v8/src/arguments.o ../deps/v8/src/arguments.cc
192  [06/09/2017 11:56PM]:                  from ../deps/v8/src/contexts-inl.h:8,
193  [06/09/2017 11:56PM]:                  from ../deps/v8/src/objects-inl.h:17,
194  [06/09/2017 11:56PM]:                  from ../deps/v8/src/arguments.h:9,
195  [06/09/2017 11:56PM]:                  from ../deps/v8/src/arguments.cc:5:
196  [06/09/2017 11:56PM]:                  from ../deps/v8/src/arguments.h:8,
197  [06/09/2017 11:56PM]:   g++ -DV8_TARGET_ARCH_X64 -DENABLE_DISASSEMBLER -DV8_I18N_SUPPORT -DV8_IMMINENT_DEPRECATION_WARNINGS -DICU_UTIL_DATA_IMPL=ICU_UTIL_DATA_STATIC -I../deps/v8 -I../deps -I/usr/include/openssl-1.0  -pthread -Wall -Wextra -Wno-unused-parameter -m64 -fno-strict-aliasing -m64 -fdata-sections -ffunction-sections -O3 -O3 -fno-omit-frame-pointer -fno-rtti -fno-exceptions -std=gnu++0x -MMD -MF /pkg/src/node-v6.11.0/out/Release/.deps//pkg/src/node-v6.11.0/out/Release/obj.target/v8_base/deps/v8/src/assembler.o.d.raw -D_FORTIFY_SOURCE=2 -march=x86-64 -mtune=generic -O2 -pipe -fstack-protector-strong -c -o /pkg/src/node-v6.11.0/out/Release/obj.target/v8_base/deps/v8/src/assembler.o ../deps/v8/src/assembler.cc
198  [06/09/2017 11:56PM]:                  from ../deps/v8/src/assembler.cc:35:
199  [06/09/2017 11:56PM]:   g++ -DV8_TARGET_ARCH_X64 -DENABLE_DISASSEMBLER -DV8_I18N_SUPPORT -DV8_IMMINENT_DEPRECATION_WARNINGS -DICU_UTIL_DATA_IMPL=ICU_UTIL_DATA_STATIC -I../deps/v8 -I../deps -I/usr/include/openssl-1.0  -pthread -Wall -Wextra -Wno-unused-parameter -m64 -fno-strict-aliasing -m64 -fdata-sections -ffunction-sections -O3 -O3 -fno-omit-frame-pointer -fno-rtti -fno-exceptions -std=gnu++0x -MMD -MF /pkg/src/node-v6.11.0/out/Release/.deps//pkg/src/node-v6.11.0/out/Release/obj.target/v8_base/deps/v8/src/assert-scope.o.d.raw -D_FORTIFY_SOURCE=2 -march=x86-64 -mtune=generic -O2 -pipe -fstack-protector-strong -c -o /pkg/src/node-v6.11.0/out/Release/obj.target/v8_base/deps/v8/src/assert-scope.o ../deps/v8/src/assert-scope.cc
200  [06/09/2017 11:56PM]:                  from ../deps/v8/src/debug/debug.h:9,
201  [06/09/2017 11:56PM]:                  from ../deps/v8/src/assert-scope.cc:9:
202  [06/09/2017 11:56PM]:                  from ../deps/v8/src/debug/debug.h:8,
203  [06/09/2017 11:56PM]:   g++ -DV8_TARGET_ARCH_X64 -DENABLE_DISASSEMBLER -DV8_I18N_SUPPORT -DV8_IMMINENT_DEPRECATION_WARNINGS -DICU_UTIL_DATA_IMPL=ICU_UTIL_DATA_STATIC -I../deps/v8 -I../deps -I/usr/include/openssl-1.0  -pthread -Wall -Wextra -Wno-unused-parameter -m64 -fno-strict-aliasing -m64 -fdata-sections -ffunction-sections -O3 -O3 -fno-omit-frame-pointer -fno-rtti -fno-exceptions -std=gnu++0x -MMD -MF /pkg/src/node-v6.11.0/out/Release/.deps//pkg/src/node-v6.11.0/out/Release/obj.target/v8_base/deps/v8/src/ast/ast-expression-rewriter.o.d.raw -D_FORTIFY_SOURCE=2 -march=x86-64 -mtune=generic -O2 -pipe -fstack-protector-strong -c -o /pkg/src/node-v6.11.0/out/Release/obj.target/v8_base/deps/v8/src/ast/ast-expression-rewriter.o ../deps/v8/src/ast/ast-expression-rewriter.cc
204  [06/09/2017 11:56PM]:                  from ../deps/v8/src/ast/ast-expression-rewriter.cc:5:
205  [06/09/2017 11:56PM]:   g++ -DV8_TARGET_ARCH_X64 -DENABLE_DISASSEMBLER -DV8_I18N_SUPPORT -DV8_IMMINENT_DEPRECATION_WARNINGS -DICU_UTIL_DATA_IMPL=ICU_UTIL_DATA_STATIC -I../deps/v8 -I../deps -I/usr/include/openssl-1.0  -pthread -Wall -Wextra -Wno-unused-parameter -m64 -fno-strict-aliasing -m64 -fdata-sections -ffunction-sections -O3 -O3 -fno-omit-frame-pointer -fno-rtti -fno-exceptions -std=gnu++0x -MMD -MF /pkg/src/node-v6.11.0/out/Release/.deps//pkg/src/node-v6.11.0/out/Release/obj.target/v8_base/deps/v8/src/ast/ast-expression-visitor.o.d.raw -D_FORTIFY_SOURCE=2 -march=x86-64 -mtune=generic -O2 -pipe -fstack-protector-strong -c -o /pkg/src/node-v6.11.0/out/Release/obj.target/v8_base/deps/v8/src/ast/ast-expression-visitor.o ../deps/v8/src/ast/ast-expression-visitor.cc
206  [06/09/2017 11:56PM]:                  from ../deps/v8/src/ast/ast-expression-visitor.h:9,
207  [06/09/2017 11:56PM]:                  from ../deps/v8/src/ast/ast-expression-visitor.cc:7:
208  [06/09/2017 11:56PM]: In file included from ../deps/v8/src/v8.h:8:0,
209  [06/09/2017 11:56PM]:                  from ../deps/v8/src/ast/ast-expression-visitor.cc:5:
210  [06/09/2017 11:56PM]:   g++ -DV8_TARGET_ARCH_X64 -DENABLE_DISASSEMBLER -DV8_I18N_SUPPORT -DV8_IMMINENT_DEPRECATION_WARNINGS -DICU_UTIL_DATA_IMPL=ICU_UTIL_DATA_STATIC -I../deps/v8 -I../deps -I/usr/include/openssl-1.0  -pthread -Wall -Wextra -Wno-unused-parameter -m64 -fno-strict-aliasing -m64 -fdata-sections -ffunction-sections -O3 -O3 -fno-omit-frame-pointer -fno-rtti -fno-exceptions -std=gnu++0x -MMD -MF /pkg/src/node-v6.11.0/out/Release/.deps//pkg/src/node-v6.11.0/out/Release/obj.target/v8_base/deps/v8/src/ast/ast-literal-reindexer.o.d.raw -D_FORTIFY_SOURCE=2 -march=x86-64 -mtune=generic -O2 -pipe -fstack-protector-strong -c -o /pkg/src/node-v6.11.0/out/Release/obj.target/v8_base/deps/v8/src/ast/ast-literal-reindexer.o ../deps/v8/src/ast/ast-literal-reindexer.cc
211  [06/09/2017 11:56PM]:                  from ../deps/v8/src/ast/ast-literal-reindexer.h:8,
212  [06/09/2017 11:56PM]:                  from ../deps/v8/src/ast/ast-literal-reindexer.cc:5:
213  [06/09/2017 11:56PM]:   g++ -DV8_TARGET_ARCH_X64 -DENABLE_DISASSEMBLER -DV8_I18N_SUPPORT -DV8_IMMINENT_DEPRECATION_WARNINGS -DICU_UTIL_DATA_IMPL=ICU_UTIL_DATA_STATIC -I../deps/v8 -I../deps -I/usr/include/openssl-1.0  -pthread -Wall -Wextra -Wno-unused-parameter -m64 -fno-strict-aliasing -m64 -fdata-sections -ffunction-sections -O3 -O3 -fno-omit-frame-pointer -fno-rtti -fno-exceptions -std=gnu++0x -MMD -MF /pkg/src/node-v6.11.0/out/Release/.deps//pkg/src/node-v6.11.0/out/Release/obj.target/v8_base/deps/v8/src/ast/ast-numbering.o.d.raw -D_FORTIFY_SOURCE=2 -march=x86-64 -mtune=generic -O2 -pipe -fstack-protector-strong -c -o /pkg/src/node-v6.11.0/out/Release/obj.target/v8_base/deps/v8/src/ast/ast-numbering.o ../deps/v8/src/ast/ast-numbering.cc
214  [06/09/2017 11:56PM]:                  from ../deps/v8/src/ast/ast-numbering.cc:7:
215  [06/09/2017 11:56PM]:   g++ -DV8_TARGET_ARCH_X64 -DENABLE_DISASSEMBLER -DV8_I18N_SUPPORT -DV8_IMMINENT_DEPRECATION_WARNINGS -DICU_UTIL_DATA_IMPL=ICU_UTIL_DATA_STATIC -I../deps/v8 -I../deps -I/usr/include/openssl-1.0  -pthread -Wall -Wextra -Wno-unused-parameter -m64 -fno-strict-aliasing -m64 -fdata-sections -ffunction-sections -O3 -O3 -fno-omit-frame-pointer -fno-rtti -fno-exceptions -std=gnu++0x -MMD -MF /pkg/src/node-v6.11.0/out/Release/.deps//pkg/src/node-v6.11.0/out/Release/obj.target/v8_base/deps/v8/src/ast/ast-value-factory.o.d.raw -D_FORTIFY_SOURCE=2 -march=x86-64 -mtune=generic -O2 -pipe -fstack-protector-strong -c -o /pkg/src/node-v6.11.0/out/Release/obj.target/v8_base/deps/v8/src/ast/ast-value-factory.o ../deps/v8/src/ast/ast-value-factory.cc
216  [06/09/2017 11:56PM]:                  from ../deps/v8/src/ast/ast-value-factory.h:31,
217  [06/09/2017 11:56PM]:                  from ../deps/v8/src/ast/ast-value-factory.cc:28:
218  [06/09/2017 11:56PM]:   g++ -DV8_TARGET_ARCH_X64 -DENABLE_DISASSEMBLER -DV8_I18N_SUPPORT -DV8_IMMINENT_DEPRECATION_WARNINGS -DICU_UTIL_DATA_IMPL=ICU_UTIL_DATA_STATIC -I../deps/v8 -I../deps -I/usr/include/openssl-1.0  -pthread -Wall -Wextra -Wno-unused-parameter -m64 -fno-strict-aliasing -m64 -fdata-sections -ffunction-sections -O3 -O3 -fno-omit-frame-pointer -fno-rtti -fno-exceptions -std=gnu++0x -MMD -MF /pkg/src/node-v6.11.0/out/Release/.deps//pkg/src/node-v6.11.0/out/Release/obj.target/v8_base/deps/v8/src/ast/ast.o.d.raw -D_FORTIFY_SOURCE=2 -march=x86-64 -mtune=generic -O2 -pipe -fstack-protector-strong -c -o /pkg/src/node-v6.11.0/out/Release/obj.target/v8_base/deps/v8/src/ast/ast.o ../deps/v8/src/ast/ast.cc
219  [06/09/2017 11:56PM]:                  from ../deps/v8/src/ast/ast.cc:5:
220  [06/09/2017 11:57PM]:   g++ -DV8_TARGET_ARCH_X64 -DENABLE_DISASSEMBLER -DV8_I18N_SUPPORT -DV8_IMMINENT_DEPRECATION_WARNINGS -DICU_UTIL_DATA_IMPL=ICU_UTIL_DATA_STATIC -I../deps/v8 -I../deps -I/usr/include/openssl-1.0  -pthread -Wall -Wextra -Wno-unused-parameter -m64 -fno-strict-aliasing -m64 -fdata-sections -ffunction-sections -O3 -O3 -fno-omit-frame-pointer -fno-rtti -fno-exceptions -std=gnu++0x -MMD -MF /pkg/src/node-v6.11.0/out/Release/.deps//pkg/src/node-v6.11.0/out/Release/obj.target/v8_base/deps/v8/src/ast/modules.o.d.raw -D_FORTIFY_SOURCE=2 -march=x86-64 -mtune=generic -O2 -pipe -fstack-protector-strong -c -o /pkg/src/node-v6.11.0/out/Release/obj.target/v8_base/deps/v8/src/ast/modules.o ../deps/v8/src/ast/modules.cc
221  [06/09/2017 11:57PM]:                  from ../deps/v8/src/ast/modules.cc:7:
222  [06/09/2017 11:57PM]: In file included from ../deps/v8/src/zone.h:12:0,
223  [06/09/2017 11:57PM]:                  from ../deps/v8/src/ast/modules.h:8,
224  [06/09/2017 11:57PM]:                  from ../deps/v8/src/ast/modules.cc:5:
225  [06/09/2017 11:57PM]:   g++ -DV8_TARGET_ARCH_X64 -DENABLE_DISASSEMBLER -DV8_I18N_SUPPORT -DV8_IMMINENT_DEPRECATION_WARNINGS -DICU_UTIL_DATA_IMPL=ICU_UTIL_DATA_STATIC -I../deps/v8 -I../deps -I/usr/include/openssl-1.0  -pthread -Wall -Wextra -Wno-unused-parameter -m64 -fno-strict-aliasing -m64 -fdata-sections -ffunction-sections -O3 -O3 -fno-omit-frame-pointer -fno-rtti -fno-exceptions -std=gnu++0x -MMD -MF /pkg/src/node-v6.11.0/out/Release/.deps//pkg/src/node-v6.11.0/out/Release/obj.target/v8_base/deps/v8/src/ast/prettyprinter.o.d.raw -D_FORTIFY_SOURCE=2 -march=x86-64 -mtune=generic -O2 -pipe -fstack-protector-strong -c -o /pkg/src/node-v6.11.0/out/Release/obj.target/v8_base/deps/v8/src/ast/prettyprinter.o ../deps/v8/src/ast/prettyprinter.cc
226  [06/09/2017 11:57PM]:                  from ../deps/v8/src/ast/prettyprinter.h:9,
227  [06/09/2017 11:57PM]:                  from ../deps/v8/src/ast/prettyprinter.cc:5:
228  [06/09/2017 11:57PM]:                  from ../deps/v8/src/ast/prettyprinter.h:8,
229  [06/09/2017 11:57PM]:   g++ -DV8_TARGET_ARCH_X64 -DENABLE_DISASSEMBLER -DV8_I18N_SUPPORT -DV8_IMMINENT_DEPRECATION_WARNINGS -DICU_UTIL_DATA_IMPL=ICU_UTIL_DATA_STATIC -I../deps/v8 -I../deps -I/usr/include/openssl-1.0  -pthread -Wall -Wextra -Wno-unused-parameter -m64 -fno-strict-aliasing -m64 -fdata-sections -ffunction-sections -O3 -O3 -fno-omit-frame-pointer -fno-rtti -fno-exceptions -std=gnu++0x -MMD -MF /pkg/src/node-v6.11.0/out/Release/.deps//pkg/src/node-v6.11.0/out/Release/obj.target/v8_base/deps/v8/src/ast/scopeinfo.o.d.raw -D_FORTIFY_SOURCE=2 -march=x86-64 -mtune=generic -O2 -pipe -fstack-protector-strong -c -o /pkg/src/node-v6.11.0/out/Release/obj.target/v8_base/deps/v8/src/ast/scopeinfo.o ../deps/v8/src/ast/scopeinfo.cc
230  [06/09/2017 11:57PM]:                  from ../deps/v8/src/ast/variables.h:8,
231  [06/09/2017 11:57PM]:                  from ../deps/v8/src/ast/scopeinfo.h:10,
232  [06/09/2017 11:57PM]:                  from ../deps/v8/src/ast/scopeinfo.cc:5:
233  [06/09/2017 11:57PM]:                  from ../deps/v8/src/ast/scopeinfo.h:8,
234  [06/09/2017 11:57PM]:   g++ -DV8_TARGET_ARCH_X64 -DENABLE_DISASSEMBLER -DV8_I18N_SUPPORT -DV8_IMMINENT_DEPRECATION_WARNINGS -DICU_UTIL_DATA_IMPL=ICU_UTIL_DATA_STATIC -I../deps/v8 -I../deps -I/usr/include/openssl-1.0  -pthread -Wall -Wextra -Wno-unused-parameter -m64 -fno-strict-aliasing -m64 -fdata-sections -ffunction-sections -O3 -O3 -fno-omit-frame-pointer -fno-rtti -fno-exceptions -std=gnu++0x -MMD -MF /pkg/src/node-v6.11.0/out/Release/.deps//pkg/src/node-v6.11.0/out/Release/obj.target/v8_base/deps/v8/src/ast/scopes.o.d.raw -D_FORTIFY_SOURCE=2 -march=x86-64 -mtune=generic -O2 -pipe -fstack-protector-strong -c -o /pkg/src/node-v6.11.0/out/Release/obj.target/v8_base/deps/v8/src/ast/scopes.o ../deps/v8/src/ast/scopes.cc
235  [06/09/2017 11:57PM]:                  from ../deps/v8/src/ast/scopes.h:8,
236  [06/09/2017 11:57PM]:                  from ../deps/v8/src/ast/scopes.cc:5:
237  [06/09/2017 11:57PM]:   g++ -DV8_TARGET_ARCH_X64 -DENABLE_DISASSEMBLER -DV8_I18N_SUPPORT -DV8_IMMINENT_DEPRECATION_WARNINGS -DICU_UTIL_DATA_IMPL=ICU_UTIL_DATA_STATIC -I../deps/v8 -I../deps -I/usr/include/openssl-1.0  -pthread -Wall -Wextra -Wno-unused-parameter -m64 -fno-strict-aliasing -m64 -fdata-sections -ffunction-sections -O3 -O3 -fno-omit-frame-pointer -fno-rtti -fno-exceptions -std=gnu++0x -MMD -MF /pkg/src/node-v6.11.0/out/Release/.deps//pkg/src/node-v6.11.0/out/Release/obj.target/v8_base/deps/v8/src/ast/variables.o.d.raw -D_FORTIFY_SOURCE=2 -march=x86-64 -mtune=generic -O2 -pipe -fstack-protector-strong -c -o /pkg/src/node-v6.11.0/out/Release/obj.target/v8_base/deps/v8/src/ast/variables.o ../deps/v8/src/ast/variables.cc
238  [06/09/2017 11:57PM]:                  from ../deps/v8/src/ast/variables.cc:5:
239  [06/09/2017 11:57PM]:   g++ -DV8_TARGET_ARCH_X64 -DENABLE_DISASSEMBLER -DV8_I18N_SUPPORT -DV8_IMMINENT_DEPRECATION_WARNINGS -DICU_UTIL_DATA_IMPL=ICU_UTIL_DATA_STATIC -I../deps/v8 -I../deps -I/usr/include/openssl-1.0  -pthread -Wall -Wextra -Wno-unused-parameter -m64 -fno-strict-aliasing -m64 -fdata-sections -ffunction-sections -O3 -O3 -fno-omit-frame-pointer -fno-rtti -fno-exceptions -std=gnu++0x -MMD -MF /pkg/src/node-v6.11.0/out/Release/.deps//pkg/src/node-v6.11.0/out/Release/obj.target/v8_base/deps/v8/src/background-parsing-task.o.d.raw -D_FORTIFY_SOURCE=2 -march=x86-64 -mtune=generic -O2 -pipe -fstack-protector-strong -c -o /pkg/src/node-v6.11.0/out/Release/obj.target/v8_base/deps/v8/src/background-parsing-task.o ../deps/v8/src/background-parsing-task.cc
240  [06/09/2017 11:57PM]:                  from ../deps/v8/src/compiler.h:9,
241  [06/09/2017 11:57PM]:                  from ../deps/v8/src/background-parsing-task.h:11,
242  [06/09/2017 11:57PM]:                  from ../deps/v8/src/background-parsing-task.cc:5:
243  [06/09/2017 11:57PM]:                  from ../deps/v8/src/compiler.h:8,
244  [06/09/2017 11:57PM]:   g++ -DV8_TARGET_ARCH_X64 -DENABLE_DISASSEMBLER -DV8_I18N_SUPPORT -DV8_IMMINENT_DEPRECATION_WARNINGS -DICU_UTIL_DATA_IMPL=ICU_UTIL_DATA_STATIC -I../deps/v8 -I../deps -I/usr/include/openssl-1.0  -pthread -Wall -Wextra -Wno-unused-parameter -m64 -fno-strict-aliasing -m64 -fdata-sections -ffunction-sections -O3 -O3 -fno-omit-frame-pointer -fno-rtti -fno-exceptions -std=gnu++0x -MMD -MF /pkg/src/node-v6.11.0/out/Release/.deps//pkg/src/node-v6.11.0/out/Release/obj.target/v8_base/deps/v8/src/bailout-reason.o.d.raw -D_FORTIFY_SOURCE=2 -march=x86-64 -mtune=generic -O2 -pipe -fstack-protector-strong -c -o /pkg/src/node-v6.11.0/out/Release/obj.target/v8_base/deps/v8/src/bailout-reason.o ../deps/v8/src/bailout-reason.cc
245  [06/09/2017 11:57PM]:   g++ -DV8_TARGET_ARCH_X64 -DENABLE_DISASSEMBLER -DV8_I18N_SUPPORT -DV8_IMMINENT_DEPRECATION_WARNINGS -DICU_UTIL_DATA_IMPL=ICU_UTIL_DATA_STATIC -I../deps/v8 -I../deps -I/usr/include/openssl-1.0  -pthread -Wall -Wextra -Wno-unused-parameter -m64 -fno-strict-aliasing -m64 -fdata-sections -ffunction-sections -O3 -O3 -fno-omit-frame-pointer -fno-rtti -fno-exceptions -std=gnu++0x -MMD -MF /pkg/src/node-v6.11.0/out/Release/.deps//pkg/src/node-v6.11.0/out/Release/obj.target/v8_base/deps/v8/src/basic-block-profiler.o.d.raw -D_FORTIFY_SOURCE=2 -march=x86-64 -mtune=generic -O2 -pipe -fstack-protector-strong -c -o /pkg/src/node-v6.11.0/out/Release/obj.target/v8_base/deps/v8/src/basic-block-profiler.o ../deps/v8/src/basic-block-profiler.cc
246  [06/09/2017 11:57PM]:   g++ -DV8_TARGET_ARCH_X64 -DENABLE_DISASSEMBLER -DV8_I18N_SUPPORT -DV8_IMMINENT_DEPRECATION_WARNINGS -DICU_UTIL_DATA_IMPL=ICU_UTIL_DATA_STATIC -I../deps/v8 -I../deps -I/usr/include/openssl-1.0  -pthread -Wall -Wextra -Wno-unused-parameter -m64 -fno-strict-aliasing -m64 -fdata-sections -ffunction-sections -O3 -O3 -fno-omit-frame-pointer -fno-rtti -fno-exceptions -std=gnu++0x -MMD -MF /pkg/src/node-v6.11.0/out/Release/.deps//pkg/src/node-v6.11.0/out/Release/obj.target/v8_base/deps/v8/src/bignum-dtoa.o.d.raw -D_FORTIFY_SOURCE=2 -march=x86-64 -mtune=generic -O2 -pipe -fstack-protector-strong -c -o /pkg/src/node-v6.11.0/out/Release/obj.target/v8_base/deps/v8/src/bignum-dtoa.o ../deps/v8/src/bignum-dtoa.cc
247  [06/09/2017 11:57PM]:   g++ -DV8_TARGET_ARCH_X64 -DENABLE_DISASSEMBLER -DV8_I18N_SUPPORT -DV8_IMMINENT_DEPRECATION_WARNINGS -DICU_UTIL_DATA_IMPL=ICU_UTIL_DATA_STATIC -I../deps/v8 -I../deps -I/usr/include/openssl-1.0  -pthread -Wall -Wextra -Wno-unused-parameter -m64 -fno-strict-aliasing -m64 -fdata-sections -ffunction-sections -O3 -O3 -fno-omit-frame-pointer -fno-rtti -fno-exceptions -std=gnu++0x -MMD -MF /pkg/src/node-v6.11.0/out/Release/.deps//pkg/src/node-v6.11.0/out/Release/obj.target/v8_base/deps/v8/src/bignum.o.d.raw -D_FORTIFY_SOURCE=2 -march=x86-64 -mtune=generic -O2 -pipe -fstack-protector-strong -c -o /pkg/src/node-v6.11.0/out/Release/obj.target/v8_base/deps/v8/src/bignum.o ../deps/v8/src/bignum.cc
248  [06/09/2017 11:57PM]:   g++ -DV8_TARGET_ARCH_X64 -DENABLE_DISASSEMBLER -DV8_I18N_SUPPORT -DV8_IMMINENT_DEPRECATION_WARNINGS -DICU_UTIL_DATA_IMPL=ICU_UTIL_DATA_STATIC -I../deps/v8 -I../deps -I/usr/include/openssl-1.0  -pthread -Wall -Wextra -Wno-unused-parameter -m64 -fno-strict-aliasing -m64 -fdata-sections -ffunction-sections -O3 -O3 -fno-omit-frame-pointer -fno-rtti -fno-exceptions -std=gnu++0x -MMD -MF /pkg/src/node-v6.11.0/out/Release/.deps//pkg/src/node-v6.11.0/out/Release/obj.target/v8_base/deps/v8/src/bit-vector.o.d.raw -D_FORTIFY_SOURCE=2 -march=x86-64 -mtune=generic -O2 -pipe -fstack-protector-strong -c -o /pkg/src/node-v6.11.0/out/Release/obj.target/v8_base/deps/v8/src/bit-vector.o ../deps/v8/src/bit-vector.cc
249  [06/09/2017 11:57PM]:   g++ -DV8_TARGET_ARCH_X64 -DENABLE_DISASSEMBLER -DV8_I18N_SUPPORT -DV8_IMMINENT_DEPRECATION_WARNINGS -DICU_UTIL_DATA_IMPL=ICU_UTIL_DATA_STATIC -I../deps/v8 -I../deps -I/usr/include/openssl-1.0  -pthread -Wall -Wextra -Wno-unused-parameter -m64 -fno-strict-aliasing -m64 -fdata-sections -ffunction-sections -O3 -O3 -fno-omit-frame-pointer -fno-rtti -fno-exceptions -std=gnu++0x -MMD -MF /pkg/src/node-v6.11.0/out/Release/.deps//pkg/src/node-v6.11.0/out/Release/obj.target/v8_base/deps/v8/src/bootstrapper.o.d.raw -D_FORTIFY_SOURCE=2 -march=x86-64 -mtune=generic -O2 -pipe -fstack-protector-strong -c -o /pkg/src/node-v6.11.0/out/Release/obj.target/v8_base/deps/v8/src/bootstrapper.o ../deps/v8/src/bootstrapper.cc
250  [06/09/2017 11:57PM]:                  from ../deps/v8/src/factory.h:8,
251  [06/09/2017 11:57PM]:                  from ../deps/v8/src/bootstrapper.h:8,
252  [06/09/2017 11:57PM]:                  from ../deps/v8/src/bootstrapper.cc:5:
253  [06/09/2017 11:57PM]: In file included from ../deps/v8/include/v8-debug.h:8:0,
254  [06/09/2017 11:57PM]:                  from ../deps/v8/src/isolate.h:11,
255  [06/09/2017 11:57PM]:   g++ -DV8_TARGET_ARCH_X64 -DENABLE_DISASSEMBLER -DV8_I18N_SUPPORT -DV8_IMMINENT_DEPRECATION_WARNINGS -DICU_UTIL_DATA_IMPL=ICU_UTIL_DATA_STATIC -I../deps/v8 -I../deps -I/usr/include/openssl-1.0  -pthread -Wall -Wextra -Wno-unused-parameter -m64 -fno-strict-aliasing -m64 -fdata-sections -ffunction-sections -O3 -O3 -fno-omit-frame-pointer -fno-rtti -fno-exceptions -std=gnu++0x -MMD -MF /pkg/src/node-v6.11.0/out/Release/.deps//pkg/src/node-v6.11.0/out/Release/obj.target/v8_base/deps/v8/src/builtins.o.d.raw -D_FORTIFY_SOURCE=2 -march=x86-64 -mtune=generic -O2 -pipe -fstack-protector-strong -c -o /pkg/src/node-v6.11.0/out/Release/obj.target/v8_base/deps/v8/src/builtins.o ../deps/v8/src/builtins.cc
256  [06/09/2017 11:57PM]:                  from ../deps/v8/src/builtins.cc:7:
257  [06/09/2017 11:57PM]:                  from ../deps/v8/src/builtins.h:9,
258  [06/09/2017 11:57PM]:                  from ../deps/v8/src/builtins.cc:5:
259  [06/09/2017 11:57PM]:   g++ -DV8_TARGET_ARCH_X64 -DENABLE_DISASSEMBLER -DV8_I18N_SUPPORT -DV8_IMMINENT_DEPRECATION_WARNINGS -DICU_UTIL_DATA_IMPL=ICU_UTIL_DATA_STATIC -I../deps/v8 -I../deps -I/usr/include/openssl-1.0  -pthread -Wall -Wextra -Wno-unused-parameter -m64 -fno-strict-aliasing -m64 -fdata-sections -ffunction-sections -O3 -O3 -fno-omit-frame-pointer -fno-rtti -fno-exceptions -std=gnu++0x -MMD -MF /pkg/src/node-v6.11.0/out/Release/.deps//pkg/src/node-v6.11.0/out/Release/obj.target/v8_base/deps/v8/src/cached-powers.o.d.raw -D_FORTIFY_SOURCE=2 -march=x86-64 -mtune=generic -O2 -pipe -fstack-protector-strong -c -o /pkg/src/node-v6.11.0/out/Release/obj.target/v8_base/deps/v8/src/cached-powers.o ../deps/v8/src/cached-powers.cc
260  [06/09/2017 11:57PM]:   g++ -DV8_TARGET_ARCH_X64 -DENABLE_DISASSEMBLER -DV8_I18N_SUPPORT -DV8_IMMINENT_DEPRECATION_WARNINGS -DICU_UTIL_DATA_IMPL=ICU_UTIL_DATA_STATIC -I../deps/v8 -I../deps -I/usr/include/openssl-1.0  -pthread -Wall -Wextra -Wno-unused-parameter -m64 -fno-strict-aliasing -m64 -fdata-sections -ffunction-sections -O3 -O3 -fno-omit-frame-pointer -fno-rtti -fno-exceptions -std=gnu++0x -MMD -MF /pkg/src/node-v6.11.0/out/Release/.deps//pkg/src/node-v6.11.0/out/Release/obj.target/v8_base/deps/v8/src/cancelable-task.o.d.raw -D_FORTIFY_SOURCE=2 -march=x86-64 -mtune=generic -O2 -pipe -fstack-protector-strong -c -o /pkg/src/node-v6.11.0/out/Release/obj.target/v8_base/deps/v8/src/cancelable-task.o ../deps/v8/src/cancelable-task.cc
261  [06/09/2017 11:57PM]:                  from ../deps/v8/src/cancelable-task.cc:8:
262  [06/09/2017 11:57PM]:                  from ../deps/v8/src/cancelable-task.h:12,
263  [06/09/2017 11:57PM]:                  from ../deps/v8/src/cancelable-task.cc:5:
264  [06/09/2017 11:57PM]:   g++ -DV8_TARGET_ARCH_X64 -DENABLE_DISASSEMBLER -DV8_I18N_SUPPORT -DV8_IMMINENT_DEPRECATION_WARNINGS -DICU_UTIL_DATA_IMPL=ICU_UTIL_DATA_STATIC -I../deps/v8 -I../deps -I/usr/include/openssl-1.0  -pthread -Wall -Wextra -Wno-unused-parameter -m64 -fno-strict-aliasing -m64 -fdata-sections -ffunction-sections -O3 -O3 -fno-omit-frame-pointer -fno-rtti -fno-exceptions -std=gnu++0x -MMD -MF /pkg/src/node-v6.11.0/out/Release/.deps//pkg/src/node-v6.11.0/out/Release/obj.target/v8_base/deps/v8/src/char-predicates.o.d.raw -D_FORTIFY_SOURCE=2 -march=x86-64 -mtune=generic -O2 -pipe -fstack-protector-strong -c -o /pkg/src/node-v6.11.0/out/Release/obj.target/v8_base/deps/v8/src/char-predicates.o ../deps/v8/src/char-predicates.cc
265  [06/09/2017 11:57PM]:   g++ -DV8_TARGET_ARCH_X64 -DENABLE_DISASSEMBLER -DV8_I18N_SUPPORT -DV8_IMMINENT_DEPRECATION_WARNINGS -DICU_UTIL_DATA_IMPL=ICU_UTIL_DATA_STATIC -I../deps/v8 -I../deps -I/usr/include/openssl-1.0  -pthread -Wall -Wextra -Wno-unused-parameter -m64 -fno-strict-aliasing -m64 -fdata-sections -ffunction-sections -O3 -O3 -fno-omit-frame-pointer -fno-rtti -fno-exceptions -std=gnu++0x -MMD -MF /pkg/src/node-v6.11.0/out/Release/.deps//pkg/src/node-v6.11.0/out/Release/obj.target/v8_base/deps/v8/src/code-factory.o.d.raw -D_FORTIFY_SOURCE=2 -march=x86-64 -mtune=generic -O2 -pipe -fstack-protector-strong -c -o /pkg/src/node-v6.11.0/out/Release/obj.target/v8_base/deps/v8/src/code-factory.o ../deps/v8/src/code-factory.cc
266  [06/09/2017 11:57PM]:                  from ../deps/v8/src/code-factory.h:9,
267  [06/09/2017 11:57PM]:                  from ../deps/v8/src/code-factory.cc:5:
268  [06/09/2017 11:57PM]:                  from ../deps/v8/src/code-factory.h:8,
269  [06/09/2017 11:57PM]:   g++ -DV8_TARGET_ARCH_X64 -DENABLE_DISASSEMBLER -DV8_I18N_SUPPORT -DV8_IMMINENT_DEPRECATION_WARNINGS -DICU_UTIL_DATA_IMPL=ICU_UTIL_DATA_STATIC -I../deps/v8 -I../deps -I/usr/include/openssl-1.0  -pthread -Wall -Wextra -Wno-unused-parameter -m64 -fno-strict-aliasing -m64 -fdata-sections -ffunction-sections -O3 -O3 -fno-omit-frame-pointer -fno-rtti -fno-exceptions -std=gnu++0x -MMD -MF /pkg/src/node-v6.11.0/out/Release/.deps//pkg/src/node-v6.11.0/out/Release/obj.target/v8_base/deps/v8/src/code-stubs.o.d.raw -D_FORTIFY_SOURCE=2 -march=x86-64 -mtune=generic -O2 -pipe -fstack-protector-strong -c -o /pkg/src/node-v6.11.0/out/Release/obj.target/v8_base/deps/v8/src/code-stubs.o ../deps/v8/src/code-stubs.cc
270  [06/09/2017 11:57PM]:                  from ../deps/v8/src/code-stubs.h:9,
271  [06/09/2017 11:57PM]:                  from ../deps/v8/src/code-stubs.cc:5:
272  [06/09/2017 11:57PM]:                  from ../deps/v8/src/code-stubs.h:8,
273  [06/09/2017 11:57PM]:   g++ -DV8_TARGET_ARCH_X64 -DENABLE_DISASSEMBLER -DV8_I18N_SUPPORT -DV8_IMMINENT_DEPRECATION_WARNINGS -DICU_UTIL_DATA_IMPL=ICU_UTIL_DATA_STATIC -I../deps/v8 -I../deps -I/usr/include/openssl-1.0  -pthread -Wall -Wextra -Wno-unused-parameter -m64 -fno-strict-aliasing -m64 -fdata-sections -ffunction-sections -O3 -O3 -fno-omit-frame-pointer -fno-rtti -fno-exceptions -std=gnu++0x -MMD -MF /pkg/src/node-v6.11.0/out/Release/.deps//pkg/src/node-v6.11.0/out/Release/obj.target/v8_base/deps/v8/src/code-stubs-hydrogen.o.d.raw -D_FORTIFY_SOURCE=2 -march=x86-64 -mtune=generic -O2 -pipe -fstack-protector-strong -c -o /pkg/src/node-v6.11.0/out/Release/obj.target/v8_base/deps/v8/src/code-stubs-hydrogen.o ../deps/v8/src/code-stubs-hydrogen.cc
274  [06/09/2017 11:57PM]:                  from ../deps/v8/src/code-stubs-hydrogen.cc:5:
275  [06/09/2017 11:57PM]:   g++ -DV8_TARGET_ARCH_X64 -DENABLE_DISASSEMBLER -DV8_I18N_SUPPORT -DV8_IMMINENT_DEPRECATION_WARNINGS -DICU_UTIL_DATA_IMPL=ICU_UTIL_DATA_STATIC -I../deps/v8 -I../deps -I/usr/include/openssl-1.0  -pthread -Wall -Wextra -Wno-unused-parameter -m64 -fno-strict-aliasing -m64 -fdata-sections -ffunction-sections -O3 -O3 -fno-omit-frame-pointer -fno-rtti -fno-exceptions -std=gnu++0x -MMD -MF /pkg/src/node-v6.11.0/out/Release/.deps//pkg/src/node-v6.11.0/out/Release/obj.target/v8_base/deps/v8/src/codegen.o.d.raw -D_FORTIFY_SOURCE=2 -march=x86-64 -mtune=generic -O2 -pipe -fstack-protector-strong -c -o /pkg/src/node-v6.11.0/out/Release/obj.target/v8_base/deps/v8/src/codegen.o ../deps/v8/src/codegen.cc
276  [06/09/2017 11:57PM]:                  from ../deps/v8/src/codegen.h:8,
277  [06/09/2017 11:57PM]:                  from ../deps/v8/src/codegen.cc:5:
278  [06/09/2017 11:58PM]:   g++ -DV8_TARGET_ARCH_X64 -DENABLE_DISASSEMBLER -DV8_I18N_SUPPORT -DV8_IMMINENT_DEPRECATION_WARNINGS -DICU_UTIL_DATA_IMPL=ICU_UTIL_DATA_STATIC -I../deps/v8 -I../deps -I/usr/include/openssl-1.0  -pthread -Wall -Wextra -Wno-unused-parameter -m64 -fno-strict-aliasing -m64 -fdata-sections -ffunction-sections -O3 -O3 -fno-omit-frame-pointer -fno-rtti -fno-exceptions -std=gnu++0x -MMD -MF /pkg/src/node-v6.11.0/out/Release/.deps//pkg/src/node-v6.11.0/out/Release/obj.target/v8_base/deps/v8/src/compilation-cache.o.d.raw -D_FORTIFY_SOURCE=2 -march=x86-64 -mtune=generic -O2 -pipe -fstack-protector-strong -c -o /pkg/src/node-v6.11.0/out/Release/obj.target/v8_base/deps/v8/src/compilation-cache.o ../deps/v8/src/compilation-cache.cc
279  [06/09/2017 11:58PM]: In file included from ../deps/v8/src/compilation-cache.h:10:0,
280  [06/09/2017 11:58PM]:                  from ../deps/v8/src/compilation-cache.cc:5:
281  [06/09/2017 11:58PM]:                  from ../deps/v8/src/compilation-cache.h:8,
282  [06/09/2017 11:58PM]:   g++ -DV8_TARGET_ARCH_X64 -DENABLE_DISASSEMBLER -DV8_I18N_SUPPORT -DV8_IMMINENT_DEPRECATION_WARNINGS -DICU_UTIL_DATA_IMPL=ICU_UTIL_DATA_STATIC -I../deps/v8 -I../deps -I/usr/include/openssl-1.0  -pthread -Wall -Wextra -Wno-unused-parameter -m64 -fno-strict-aliasing -m64 -fdata-sections -ffunction-sections -O3 -O3 -fno-omit-frame-pointer -fno-rtti -fno-exceptions -std=gnu++0x -MMD -MF /pkg/src/node-v6.11.0/out/Release/.deps//pkg/src/node-v6.11.0/out/Release/obj.target/v8_base/deps/v8/src/compilation-dependencies.o.d.raw -D_FORTIFY_SOURCE=2 -march=x86-64 -mtune=generic -O2 -pipe -fstack-protector-strong -c -o /pkg/src/node-v6.11.0/out/Release/obj.target/v8_base/deps/v8/src/compilation-dependencies.o ../deps/v8/src/compilation-dependencies.cc
283  [06/09/2017 11:58PM]: In file included from ../deps/v8/src/compilation-dependencies.h:9:0,
284  [06/09/2017 11:58PM]:                  from ../deps/v8/src/compilation-dependencies.cc:5:
285  [06/09/2017 11:58PM]:                  from ../deps/v8/src/compilation-dependencies.h:8,
286  [06/09/2017 11:58PM]:   g++ -DV8_TARGET_ARCH_X64 -DENABLE_DISASSEMBLER -DV8_I18N_SUPPORT -DV8_IMMINENT_DEPRECATION_WARNINGS -DICU_UTIL_DATA_IMPL=ICU_UTIL_DATA_STATIC -I../deps/v8 -I../deps -I/usr/include/openssl-1.0  -pthread -Wall -Wextra -Wno-unused-parameter -m64 -fno-strict-aliasing -m64 -fdata-sections -ffunction-sections -O3 -O3 -fno-omit-frame-pointer -fno-rtti -fno-exceptions -std=gnu++0x -MMD -MF /pkg/src/node-v6.11.0/out/Release/.deps//pkg/src/node-v6.11.0/out/Release/obj.target/v8_base/deps/v8/src/compilation-statistics.o.d.raw -D_FORTIFY_SOURCE=2 -march=x86-64 -mtune=generic -O2 -pipe -fstack-protector-strong -c -o /pkg/src/node-v6.11.0/out/Release/obj.target/v8_base/deps/v8/src/compilation-statistics.o ../deps/v8/src/compilation-statistics.cc
287  [06/09/2017 11:58PM]:   g++ -DV8_TARGET_ARCH_X64 -DENABLE_DISASSEMBLER -DV8_I18N_SUPPORT -DV8_IMMINENT_DEPRECATION_WARNINGS -DICU_UTIL_DATA_IMPL=ICU_UTIL_DATA_STATIC -I../deps/v8 -I../deps -I/usr/include/openssl-1.0  -pthread -Wall -Wextra -Wno-unused-parameter -m64 -fno-strict-aliasing -m64 -fdata-sections -ffunction-sections -O3 -O3 -fno-omit-frame-pointer -fno-rtti -fno-exceptions -std=gnu++0x -MMD -MF /pkg/src/node-v6.11.0/out/Release/.deps//pkg/src/node-v6.11.0/out/Release/obj.target/v8_base/deps/v8/src/compiler/access-builder.o.d.raw -D_FORTIFY_SOURCE=2 -march=x86-64 -mtune=generic -O2 -pipe -fstack-protector-strong -c -o /pkg/src/node-v6.11.0/out/Release/obj.target/v8_base/deps/v8/src/compiler/access-builder.o ../deps/v8/src/compiler/access-builder.cc
288  [06/09/2017 11:58PM]: In file included from ../deps/v8/src/compiler/simplified-operator.h:12:0,
289  [06/09/2017 11:58PM]:                  from ../deps/v8/src/compiler/access-builder.h:8,
290  [06/09/2017 11:58PM]:                  from ../deps/v8/src/compiler/access-builder.cc:5:
291  [06/09/2017 11:58PM]:                  from ../deps/v8/src/compiler/simplified-operator.h:10,
292  [06/09/2017 11:58PM]:   g++ -DV8_TARGET_ARCH_X64 -DENABLE_DISASSEMBLER -DV8_I18N_SUPPORT -DV8_IMMINENT_DEPRECATION_WARNINGS -DICU_UTIL_DATA_IMPL=ICU_UTIL_DATA_STATIC -I../deps/v8 -I../deps -I/usr/include/openssl-1.0  -pthread -Wall -Wextra -Wno-unused-parameter -m64 -fno-strict-aliasing -m64 -fdata-sections -ffunction-sections -O3 -O3 -fno-omit-frame-pointer -fno-rtti -fno-exceptions -std=gnu++0x -MMD -MF /pkg/src/node-v6.11.0/out/Release/.deps//pkg/src/node-v6.11.0/out/Release/obj.target/v8_base/deps/v8/src/compiler/access-info.o.d.raw -D_FORTIFY_SOURCE=2 -march=x86-64 -mtune=generic -O2 -pipe -fstack-protector-strong -c -o /pkg/src/node-v6.11.0/out/Release/obj.target/v8_base/deps/v8/src/compiler/access-info.o ../deps/v8/src/compiler/access-info.cc
293  [06/09/2017 11:58PM]:                  from ../deps/v8/src/compiler/access-info.cc:8:
294  [06/09/2017 11:58PM]:                  from ../deps/v8/src/compiler/access-info.cc:7:
295  [06/09/2017 11:58PM]:   g++ -DV8_TARGET_ARCH_X64 -DENABLE_DISASSEMBLER -DV8_I18N_SUPPORT -DV8_IMMINENT_DEPRECATION_WARNINGS -DICU_UTIL_DATA_IMPL=ICU_UTIL_DATA_STATIC -I../deps/v8 -I../deps -I/usr/include/openssl-1.0  -pthread -Wall -Wextra -Wno-unused-parameter -m64 -fno-strict-aliasing -m64 -fdata-sections -ffunction-sections -O3 -O3 -fno-omit-frame-pointer -fno-rtti -fno-exceptions -std=gnu++0x -MMD -MF /pkg/src/node-v6.11.0/out/Release/.deps//pkg/src/node-v6.11.0/out/Release/obj.target/v8_base/deps/v8/src/compiler/all-nodes.o.d.raw -D_FORTIFY_SOURCE=2 -march=x86-64 -mtune=generic -O2 -pipe -fstack-protector-strong -c -o /pkg/src/node-v6.11.0/out/Release/obj.target/v8_base/deps/v8/src/compiler/all-nodes.o ../deps/v8/src/compiler/all-nodes.cc
296  [06/09/2017 11:58PM]: In file included from ../deps/v8/src/types.h:10:0,
297  [06/09/2017 11:58PM]:                  from ../deps/v8/src/compiler/node.h:10,
298  [06/09/2017 11:58PM]:                  from ../deps/v8/src/compiler/all-nodes.h:8,
299  [06/09/2017 11:58PM]:                  from ../deps/v8/src/compiler/all-nodes.cc:5:
300  [06/09/2017 11:58PM]:                  from ../deps/v8/src/compiler/operator.h:12,
301  [06/09/2017 11:58PM]:                  from ../deps/v8/src/compiler/node.h:9,
302  [06/09/2017 11:58PM]:   g++ -DV8_TARGET_ARCH_X64 -DENABLE_DISASSEMBLER -DV8_I18N_SUPPORT -DV8_IMMINENT_DEPRECATION_WARNINGS -DICU_UTIL_DATA_IMPL=ICU_UTIL_DATA_STATIC -I../deps/v8 -I../deps -I/usr/include/openssl-1.0  -pthread -Wall -Wextra -Wno-unused-parameter -m64 -fno-strict-aliasing -m64 -fdata-sections -ffunction-sections -O3 -O3 -fno-omit-frame-pointer -fno-rtti -fno-exceptions -std=gnu++0x -MMD -MF /pkg/src/node-v6.11.0/out/Release/.deps//pkg/src/node-v6.11.0/out/Release/obj.target/v8_base/deps/v8/src/compiler/ast-graph-builder.o.d.raw -D_FORTIFY_SOURCE=2 -march=x86-64 -mtune=generic -O2 -pipe -fstack-protector-strong -c -o /pkg/src/node-v6.11.0/out/Release/obj.target/v8_base/deps/v8/src/compiler/ast-graph-builder.o ../deps/v8/src/compiler/ast-graph-builder.cc
303  [06/09/2017 11:58PM]:                  from ../deps/v8/src/compiler/ast-graph-builder.h:8,
304  [06/09/2017 11:58PM]:                  from ../deps/v8/src/compiler/ast-graph-builder.cc:5:
305  [06/09/2017 11:58PM]:   g++ -DV8_TARGET_ARCH_X64 -DENABLE_DISASSEMBLER -DV8_I18N_SUPPORT -DV8_IMMINENT_DEPRECATION_WARNINGS -DICU_UTIL_DATA_IMPL=ICU_UTIL_DATA_STATIC -I../deps/v8 -I../deps -I/usr/include/openssl-1.0  -pthread -Wall -Wextra -Wno-unused-parameter -m64 -fno-strict-aliasing -m64 -fdata-sections -ffunction-sections -O3 -O3 -fno-omit-frame-pointer -fno-rtti -fno-exceptions -std=gnu++0x -MMD -MF /pkg/src/node-v6.11.0/out/Release/.deps//pkg/src/node-v6.11.0/out/Release/obj.target/v8_base/deps/v8/src/compiler/ast-loop-assignment-analyzer.o.d.raw -D_FORTIFY_SOURCE=2 -march=x86-64 -mtune=generic -O2 -pipe -fstack-protector-strong -c -o /pkg/src/node-v6.11.0/out/Release/obj.target/v8_base/deps/v8/src/compiler/ast-loop-assignment-analyzer.o ../deps/v8/src/compiler/ast-loop-assignment-analyzer.cc
306  [06/09/2017 11:58PM]:                  from ../deps/v8/src/compiler/ast-loop-assignment-analyzer.h:8,
307  [06/09/2017 11:58PM]:                  from ../deps/v8/src/compiler/ast-loop-assignment-analyzer.cc:5:
308  [06/09/2017 11:58PM]:   g++ -DV8_TARGET_ARCH_X64 -DENABLE_DISASSEMBLER -DV8_I18N_SUPPORT -DV8_IMMINENT_DEPRECATION_WARNINGS -DICU_UTIL_DATA_IMPL=ICU_UTIL_DATA_STATIC -I../deps/v8 -I../deps -I/usr/include/openssl-1.0  -pthread -Wall -Wextra -Wno-unused-parameter -m64 -fno-strict-aliasing -m64 -fdata-sections -ffunction-sections -O3 -O3 -fno-omit-frame-pointer -fno-rtti -fno-exceptions -std=gnu++0x -MMD -MF /pkg/src/node-v6.11.0/out/Release/.deps//pkg/src/node-v6.11.0/out/Release/obj.target/v8_base/deps/v8/src/compiler/basic-block-instrumentor.o.d.raw -D_FORTIFY_SOURCE=2 -march=x86-64 -mtune=generic -O2 -pipe -fstack-protector-strong -c -o /pkg/src/node-v6.11.0/out/Release/obj.target/v8_base/deps/v8/src/compiler/basic-block-instrumentor.o ../deps/v8/src/compiler/basic-block-instrumentor.cc
309  [06/09/2017 11:58PM]:                  from ../deps/v8/src/compiler/basic-block-instrumentor.cc:9:
310  [06/09/2017 11:58PM]:                  from ../deps/v8/src/compiler/basic-block-instrumentor.h:8,
311  [06/09/2017 11:58PM]:                  from ../deps/v8/src/compiler/basic-block-instrumentor.cc:5:
312  [06/09/2017 11:58PM]:   g++ -DV8_TARGET_ARCH_X64 -DENABLE_DISASSEMBLER -DV8_I18N_SUPPORT -DV8_IMMINENT_DEPRECATION_WARNINGS -DICU_UTIL_DATA_IMPL=ICU_UTIL_DATA_STATIC -I../deps/v8 -I../deps -I/usr/include/openssl-1.0  -pthread -Wall -Wextra -Wno-unused-parameter -m64 -fno-strict-aliasing -m64 -fdata-sections -ffunction-sections -O3 -O3 -fno-omit-frame-pointer -fno-rtti -fno-exceptions -std=gnu++0x -MMD -MF /pkg/src/node-v6.11.0/out/Release/.deps//pkg/src/node-v6.11.0/out/Release/obj.target/v8_base/deps/v8/src/compiler/branch-elimination.o.d.raw -D_FORTIFY_SOURCE=2 -march=x86-64 -mtune=generic -O2 -pipe -fstack-protector-strong -c -o /pkg/src/node-v6.11.0/out/Release/obj.target/v8_base/deps/v8/src/compiler/branch-elimination.o ../deps/v8/src/compiler/branch-elimination.cc
313  [06/09/2017 11:58PM]:                  from ../deps/v8/src/compiler/node-marker.h:8,
314  [06/09/2017 11:58PM]:                  from ../deps/v8/src/compiler/graph-reducer.h:8,
315  [06/09/2017 11:58PM]:                  from ../deps/v8/src/compiler/branch-elimination.h:8,
316  [06/09/2017 11:58PM]:                  from ../deps/v8/src/compiler/branch-elimination.cc:5:
317  [06/09/2017 11:58PM]:   g++ -DV8_TARGET_ARCH_X64 -DENABLE_DISASSEMBLER -DV8_I18N_SUPPORT -DV8_IMMINENT_DEPRECATION_WARNINGS -DICU_UTIL_DATA_IMPL=ICU_UTIL_DATA_STATIC -I../deps/v8 -I../deps -I/usr/include/openssl-1.0  -pthread -Wall -Wextra -Wno-unused-parameter -m64 -fno-strict-aliasing -m64 -fdata-sections -ffunction-sections -O3 -O3 -fno-omit-frame-pointer -fno-rtti -fno-exceptions -std=gnu++0x -MMD -MF /pkg/src/node-v6.11.0/out/Release/.deps//pkg/src/node-v6.11.0/out/Release/obj.target/v8_base/deps/v8/src/compiler/bytecode-branch-analysis.o.d.raw -D_FORTIFY_SOURCE=2 -march=x86-64 -mtune=generic -O2 -pipe -fstack-protector-strong -c -o /pkg/src/node-v6.11.0/out/Release/obj.target/v8_base/deps/v8/src/compiler/bytecode-branch-analysis.o ../deps/v8/src/compiler/bytecode-branch-analysis.cc
318  [06/09/2017 11:58PM]: In file included from ../deps/v8/src/interpreter/bytecode-array-iterator.h:10:0,
319  [06/09/2017 11:58PM]:                  from ../deps/v8/src/compiler/bytecode-branch-analysis.cc:7:
320  [06/09/2017 11:58PM]:                  from ../deps/v8/src/bit-vector.h:8,
321  [06/09/2017 11:58PM]:                  from ../deps/v8/src/compiler/bytecode-branch-analysis.h:8,
322  [06/09/2017 11:58PM]:                  from ../deps/v8/src/compiler/bytecode-branch-analysis.cc:5:
323  [06/09/2017 11:58PM]:   g++ -DV8_TARGET_ARCH_X64 -DENABLE_DISASSEMBLER -DV8_I18N_SUPPORT -DV8_IMMINENT_DEPRECATION_WARNINGS -DICU_UTIL_DATA_IMPL=ICU_UTIL_DATA_STATIC -I../deps/v8 -I../deps -I/usr/include/openssl-1.0  -pthread -Wall -Wextra -Wno-unused-parameter -m64 -fno-strict-aliasing -m64 -fdata-sections -ffunction-sections -O3 -O3 -fno-omit-frame-pointer -fno-rtti -fno-exceptions -std=gnu++0x -MMD -MF /pkg/src/node-v6.11.0/out/Release/.deps//pkg/src/node-v6.11.0/out/Release/obj.target/v8_base/deps/v8/src/compiler/bytecode-graph-builder.o.d.raw -D_FORTIFY_SOURCE=2 -march=x86-64 -mtune=generic -O2 -pipe -fstack-protector-strong -c -o /pkg/src/node-v6.11.0/out/Release/obj.target/v8_base/deps/v8/src/compiler/bytecode-graph-builder.o ../deps/v8/src/compiler/bytecode-graph-builder.cc
324  [06/09/2017 11:58PM]:                  from ../deps/v8/src/compiler/bytecode-graph-builder.h:8,
325  [06/09/2017 11:58PM]:                  from ../deps/v8/src/compiler/bytecode-graph-builder.cc:5:
326  [06/09/2017 11:58PM]:   g++ -DV8_TARGET_ARCH_X64 -DENABLE_DISASSEMBLER -DV8_I18N_SUPPORT -DV8_IMMINENT_DEPRECATION_WARNINGS -DICU_UTIL_DATA_IMPL=ICU_UTIL_DATA_STATIC -I../deps/v8 -I../deps -I/usr/include/openssl-1.0  -pthread -Wall -Wextra -Wno-unused-parameter -m64 -fno-strict-aliasing -m64 -fdata-sections -ffunction-sections -O3 -O3 -fno-omit-frame-pointer -fno-rtti -fno-exceptions -std=gnu++0x -MMD -MF /pkg/src/node-v6.11.0/out/Release/.deps//pkg/src/node-v6.11.0/out/Release/obj.target/v8_base/deps/v8/src/compiler/change-lowering.o.d.raw -D_FORTIFY_SOURCE=2 -march=x86-64 -mtune=generic -O2 -pipe -fstack-protector-strong -c -o /pkg/src/node-v6.11.0/out/Release/obj.target/v8_base/deps/v8/src/compiler/change-lowering.o ../deps/v8/src/compiler/change-lowering.cc
327  [06/09/2017 11:58PM]:                  from ../deps/v8/src/compiler/change-lowering.h:8,
328  [06/09/2017 11:58PM]:                  from ../deps/v8/src/compiler/change-lowering.cc:5:
329  [06/09/2017 11:58PM]:   g++ -DV8_TARGET_ARCH_X64 -DENABLE_DISASSEMBLER -DV8_I18N_SUPPORT -DV8_IMMINENT_DEPRECATION_WARNINGS -DICU_UTIL_DATA_IMPL=ICU_UTIL_DATA_STATIC -I../deps/v8 -I../deps -I/usr/include/openssl-1.0  -pthread -Wall -Wextra -Wno-unused-parameter -m64 -fno-strict-aliasing -m64 -fdata-sections -ffunction-sections -O3 -O3 -fno-omit-frame-pointer -fno-rtti -fno-exceptions -std=gnu++0x -MMD -MF /pkg/src/node-v6.11.0/out/Release/.deps//pkg/src/node-v6.11.0/out/Release/obj.target/v8_base/deps/v8/src/compiler/c-linkage.o.d.raw -D_FORTIFY_SOURCE=2 -march=x86-64 -mtune=generic -O2 -pipe -fstack-protector-strong -c -o /pkg/src/node-v6.11.0/out/Release/obj.target/v8_base/deps/v8/src/compiler/c-linkage.o ../deps/v8/src/compiler/c-linkage.cc
330  [06/09/2017 11:58PM]:                  from ../deps/v8/src/compiler/c-linkage.cc:5:
331  [06/09/2017 11:58PM]:   g++ -DV8_TARGET_ARCH_X64 -DENABLE_DISASSEMBLER -DV8_I18N_SUPPORT -DV8_IMMINENT_DEPRECATION_WARNINGS -DICU_UTIL_DATA_IMPL=ICU_UTIL_DATA_STATIC -I../deps/v8 -I../deps -I/usr/include/openssl-1.0  -pthread -Wall -Wextra -Wno-unused-parameter -m64 -fno-strict-aliasing -m64 -fdata-sections -ffunction-sections -O3 -O3 -fno-omit-frame-pointer -fno-rtti -fno-exceptions -std=gnu++0x -MMD -MF /pkg/src/node-v6.11.0/out/Release/.deps//pkg/src/node-v6.11.0/out/Release/obj.target/v8_base/deps/v8/src/compiler/coalesced-live-ranges.o.d.raw -D_FORTIFY_SOURCE=2 -march=x86-64 -mtune=generic -O2 -pipe -fstack-protector-strong -c -o /pkg/src/node-v6.11.0/out/Release/obj.target/v8_base/deps/v8/src/compiler/coalesced-live-ranges.o ../deps/v8/src/compiler/coalesced-live-ranges.cc
332  [06/09/2017 11:58PM]:                  from ../deps/v8/src/safepoint-table.h:9,
333  [06/09/2017 11:58PM]:                  from ../deps/v8/src/frames.h:10,
334  [06/09/2017 11:58PM]:                  from ../deps/v8/src/compiler/frame.h:9,
335  [06/09/2017 11:58PM]:                  from ../deps/v8/src/compiler/instruction.h:14,
336  [06/09/2017 11:58PM]:                  from ../deps/v8/src/compiler/register-allocator.h:8,
337  [06/09/2017 11:58PM]:                  from ../deps/v8/src/compiler/coalesced-live-ranges.h:8,
338  [06/09/2017 11:58PM]:                  from ../deps/v8/src/compiler/coalesced-live-ranges.cc:5:
339  [06/09/2017 11:58PM]:                  from ../deps/v8/src/compiler/frame-states.h:8,
340  [06/09/2017 11:58PM]:                  from ../deps/v8/src/compiler/common-operator.h:8,
341  [06/09/2017 11:58PM]:                  from ../deps/v8/src/compiler/instruction.h:13,
342  [06/09/2017 11:58PM]:   g++ -DV8_TARGET_ARCH_X64 -DENABLE_DISASSEMBLER -DV8_I18N_SUPPORT -DV8_IMMINENT_DEPRECATION_WARNINGS -DICU_UTIL_DATA_IMPL=ICU_UTIL_DATA_STATIC -I../deps/v8 -I../deps -I/usr/include/openssl-1.0  -pthread -Wall -Wextra -Wno-unused-parameter -m64 -fno-strict-aliasing -m64 -fdata-sections -ffunction-sections -O3 -O3 -fno-omit-frame-pointer -fno-rtti -fno-exceptions -std=gnu++0x -MMD -MF /pkg/src/node-v6.11.0/out/Release/.deps//pkg/src/node-v6.11.0/out/Release/obj.target/v8_base/deps/v8/src/compiler/code-generator.o.d.raw -D_FORTIFY_SOURCE=2 -march=x86-64 -mtune=generic -O2 -pipe -fstack-protector-strong -c -o /pkg/src/node-v6.11.0/out/Release/obj.target/v8_base/deps/v8/src/compiler/code-generator.o ../deps/v8/src/compiler/code-generator.cc
343  [06/09/2017 11:58PM]:                  from ../deps/v8/src/compiler/gap-resolver.h:8,
344  [06/09/2017 11:58PM]:                  from ../deps/v8/src/compiler/code-generator.h:8,
345  [06/09/2017 11:58PM]:                  from ../deps/v8/src/compiler/code-generator.cc:5:
346  [06/09/2017 11:58PM]:   g++ -DV8_TARGET_ARCH_X64 -DENABLE_DISASSEMBLER -DV8_I18N_SUPPORT -DV8_IMMINENT_DEPRECATION_WARNINGS -DICU_UTIL_DATA_IMPL=ICU_UTIL_DATA_STATIC -I../deps/v8 -I../deps -I/usr/include/openssl-1.0  -pthread -Wall -Wextra -Wno-unused-parameter -m64 -fno-strict-aliasing -m64 -fdata-sections -ffunction-sections -O3 -O3 -fno-omit-frame-pointer -fno-rtti -fno-exceptions -std=gnu++0x -MMD -MF /pkg/src/node-v6.11.0/out/Release/.deps//pkg/src/node-v6.11.0/out/Release/obj.target/v8_base/deps/v8/src/compiler/code-stub-assembler.o.d.raw -D_FORTIFY_SOURCE=2 -march=x86-64 -mtune=generic -O2 -pipe -fstack-protector-strong -c -o /pkg/src/node-v6.11.0/out/Release/obj.target/v8_base/deps/v8/src/compiler/code-stub-assembler.o ../deps/v8/src/compiler/code-stub-assembler.cc
347  [06/09/2017 11:58PM]:                  from ../deps/v8/src/compiler/code-stub-assembler.h:14,
348  [06/09/2017 11:58PM]:                  from ../deps/v8/src/compiler/code-stub-assembler.cc:5:
349  [06/09/2017 11:58PM]:                  from ../deps/v8/src/compiler/code-stub-assembler.h:12,
350  [06/09/2017 11:58PM]:   g++ -DV8_TARGET_ARCH_X64 -DENABLE_DISASSEMBLER -DV8_I18N_SUPPORT -DV8_IMMINENT_DEPRECATION_WARNINGS -DICU_UTIL_DATA_IMPL=ICU_UTIL_DATA_STATIC -I../deps/v8 -I../deps -I/usr/include/openssl-1.0  -pthread -Wall -Wextra -Wno-unused-parameter -m64 -fno-strict-aliasing -m64 -fdata-sections -ffunction-sections -O3 -O3 -fno-omit-frame-pointer -fno-rtti -fno-exceptions -std=gnu++0x -MMD -MF /pkg/src/node-v6.11.0/out/Release/.deps//pkg/src/node-v6.11.0/out/Release/obj.target/v8_base/deps/v8/src/compiler/common-node-cache.o.d.raw -D_FORTIFY_SOURCE=2 -march=x86-64 -mtune=generic -O2 -pipe -fstack-protector-strong -c -o /pkg/src/node-v6.11.0/out/Release/obj.target/v8_base/deps/v8/src/compiler/common-node-cache.o ../deps/v8/src/compiler/common-node-cache.cc
351  [06/09/2017 11:58PM]:                  from ../deps/v8/src/compiler/common-node-cache.cc:7:
352  [06/09/2017 11:58PM]:   g++ -DV8_TARGET_ARCH_X64 -DENABLE_DISASSEMBLER -DV8_I18N_SUPPORT -DV8_IMMINENT_DEPRECATION_WARNINGS -DICU_UTIL_DATA_IMPL=ICU_UTIL_DATA_STATIC -I../deps/v8 -I../deps -I/usr/include/openssl-1.0  -pthread -Wall -Wextra -Wno-unused-parameter -m64 -fno-strict-aliasing -m64 -fdata-sections -ffunction-sections -O3 -O3 -fno-omit-frame-pointer -fno-rtti -fno-exceptions -std=gnu++0x -MMD -MF /pkg/src/node-v6.11.0/out/Release/.deps//pkg/src/node-v6.11.0/out/Release/obj.target/v8_base/deps/v8/src/compiler/common-operator-reducer.o.d.raw -D_FORTIFY_SOURCE=2 -march=x86-64 -mtune=generic -O2 -pipe -fstack-protector-strong -c -o /pkg/src/node-v6.11.0/out/Release/obj.target/v8_base/deps/v8/src/compiler/common-operator-reducer.o ../deps/v8/src/compiler/common-operator-reducer.cc
353  [06/09/2017 11:58PM]:                  from ../deps/v8/src/compiler/common-operator-reducer.h:8,
354  [06/09/2017 11:58PM]:                  from ../deps/v8/src/compiler/common-operator-reducer.cc:5:
355  [06/09/2017 11:58PM]:   g++ -DV8_TARGET_ARCH_X64 -DENABLE_DISASSEMBLER -DV8_I18N_SUPPORT -DV8_IMMINENT_DEPRECATION_WARNINGS -DICU_UTIL_DATA_IMPL=ICU_UTIL_DATA_STATIC -I../deps/v8 -I../deps -I/usr/include/openssl-1.0  -pthread -Wall -Wextra -Wno-unused-parameter -m64 -fno-strict-aliasing -m64 -fdata-sections -ffunction-sections -O3 -O3 -fno-omit-frame-pointer -fno-rtti -fno-exceptions -std=gnu++0x -MMD -MF /pkg/src/node-v6.11.0/out/Release/.deps//pkg/src/node-v6.11.0/out/Release/obj.target/v8_base/deps/v8/src/compiler/common-operator.o.d.raw -D_FORTIFY_SOURCE=2 -march=x86-64 -mtune=generic -O2 -pipe -fstack-protector-strong -c -o /pkg/src/node-v6.11.0/out/Release/obj.target/v8_base/deps/v8/src/compiler/common-operator.o ../deps/v8/src/compiler/common-operator.cc
356  [06/09/2017 11:58PM]:                  from ../deps/v8/src/compiler/common-operator.cc:7:
357  [06/09/2017 11:58PM]:                  from ../deps/v8/src/compiler/common-operator.cc:5:
358  [06/09/2017 11:58PM]:   g++ -DV8_TARGET_ARCH_X64 -DENABLE_DISASSEMBLER -DV8_I18N_SUPPORT -DV8_IMMINENT_DEPRECATION_WARNINGS -DICU_UTIL_DATA_IMPL=ICU_UTIL_DATA_STATIC -I../deps/v8 -I../deps -I/usr/include/openssl-1.0  -pthread -Wall -Wextra -Wno-unused-parameter -m64 -fno-strict-aliasing -m64 -fdata-sections -ffunction-sections -O3 -O3 -fno-omit-frame-pointer -fno-rtti -fno-exceptions -std=gnu++0x -MMD -MF /pkg/src/node-v6.11.0/out/Release/.deps//pkg/src/node-v6.11.0/out/Release/obj.target/v8_base/deps/v8/src/compiler/control-builders.o.d.raw -D_FORTIFY_SOURCE=2 -march=x86-64 -mtune=generic -O2 -pipe -fstack-protector-strong -c -o /pkg/src/node-v6.11.0/out/Release/obj.target/v8_base/deps/v8/src/compiler/control-builders.o ../deps/v8/src/compiler/control-builders.cc
359  [06/09/2017 11:58PM]:                  from ../deps/v8/src/compiler/control-builders.h:8,
360  [06/09/2017 11:58PM]:                  from ../deps/v8/src/compiler/control-builders.cc:5:
361  [06/09/2017 11:59PM]:   g++ -DV8_TARGET_ARCH_X64 -DENABLE_DISASSEMBLER -DV8_I18N_SUPPORT -DV8_IMMINENT_DEPRECATION_WARNINGS -DICU_UTIL_DATA_IMPL=ICU_UTIL_DATA_STATIC -I../deps/v8 -I../deps -I/usr/include/openssl-1.0  -pthread -Wall -Wextra -Wno-unused-parameter -m64 -fno-strict-aliasing -m64 -fdata-sections -ffunction-sections -O3 -O3 -fno-omit-frame-pointer -fno-rtti -fno-exceptions -std=gnu++0x -MMD -MF /pkg/src/node-v6.11.0/out/Release/.deps//pkg/src/node-v6.11.0/out/Release/obj.target/v8_base/deps/v8/src/compiler/control-equivalence.o.d.raw -D_FORTIFY_SOURCE=2 -march=x86-64 -mtune=generic -O2 -pipe -fstack-protector-strong -c -o /pkg/src/node-v6.11.0/out/Release/obj.target/v8_base/deps/v8/src/compiler/control-equivalence.o ../deps/v8/src/compiler/control-equivalence.cc
362  [06/09/2017 11:59PM]:                  from ../deps/v8/src/compiler/control-equivalence.h:9,
363  [06/09/2017 11:59PM]:                  from ../deps/v8/src/compiler/control-equivalence.cc:5:
364  [06/09/2017 11:59PM]:                  from ../deps/v8/src/compiler/graph.h:8,
365  [06/09/2017 11:59PM]:                  from ../deps/v8/src/compiler/control-equivalence.h:8,
366  [06/09/2017 11:59PM]:   g++ -DV8_TARGET_ARCH_X64 -DENABLE_DISASSEMBLER -DV8_I18N_SUPPORT -DV8_IMMINENT_DEPRECATION_WARNINGS -DICU_UTIL_DATA_IMPL=ICU_UTIL_DATA_STATIC -I../deps/v8 -I../deps -I/usr/include/openssl-1.0  -pthread -Wall -Wextra -Wno-unused-parameter -m64 -fno-strict-aliasing -m64 -fdata-sections -ffunction-sections -O3 -O3 -fno-omit-frame-pointer -fno-rtti -fno-exceptions -std=gnu++0x -MMD -MF /pkg/src/node-v6.11.0/out/Release/.deps//pkg/src/node-v6.11.0/out/Release/obj.target/v8_base/deps/v8/src/compiler/control-flow-optimizer.o.d.raw -D_FORTIFY_SOURCE=2 -march=x86-64 -mtune=generic -O2 -pipe -fstack-protector-strong -c -o /pkg/src/node-v6.11.0/out/Release/obj.target/v8_base/deps/v8/src/compiler/control-flow-optimizer.o ../deps/v8/src/compiler/control-flow-optimizer.cc
367  [06/09/2017 11:59PM]:                  from ../deps/v8/src/compiler/control-flow-optimizer.h:8,
368  [06/09/2017 11:59PM]:                  from ../deps/v8/src/compiler/control-flow-optimizer.cc:5:
369  [06/09/2017 11:59PM]:   g++ -DV8_TARGET_ARCH_X64 -DENABLE_DISASSEMBLER -DV8_I18N_SUPPORT -DV8_IMMINENT_DEPRECATION_WARNINGS -DICU_UTIL_DATA_IMPL=ICU_UTIL_DATA_STATIC -I../deps/v8 -I../deps -I/usr/include/openssl-1.0  -pthread -Wall -Wextra -Wno-unused-parameter -m64 -fno-strict-aliasing -m64 -fdata-sections -ffunction-sections -O3 -O3 -fno-omit-frame-pointer -fno-rtti -fno-exceptions -std=gnu++0x -MMD -MF /pkg/src/node-v6.11.0/out/Release/.deps//pkg/src/node-v6.11.0/out/Release/obj.target/v8_base/deps/v8/src/compiler/dead-code-elimination.o.d.raw -D_FORTIFY_SOURCE=2 -march=x86-64 -mtune=generic -O2 -pipe -fstack-protector-strong -c -o /pkg/src/node-v6.11.0/out/Release/obj.target/v8_base/deps/v8/src/compiler/dead-code-elimination.o ../deps/v8/src/compiler/dead-code-elimination.cc
370  [06/09/2017 11:59PM]:                  from ../deps/v8/src/compiler/dead-code-elimination.h:8,
371  [06/09/2017 11:59PM]:                  from ../deps/v8/src/compiler/dead-code-elimination.cc:5:
372  [06/09/2017 11:59PM]:   g++ -DV8_TARGET_ARCH_X64 -DENABLE_DISASSEMBLER -DV8_I18N_SUPPORT -DV8_IMMINENT_DEPRECATION_WARNINGS -DICU_UTIL_DATA_IMPL=ICU_UTIL_DATA_STATIC -I../deps/v8 -I../deps -I/usr/include/openssl-1.0  -pthread -Wall -Wextra -Wno-unused-parameter -m64 -fno-strict-aliasing -m64 -fdata-sections -ffunction-sections -O3 -O3 -fno-omit-frame-pointer -fno-rtti -fno-exceptions -std=gnu++0x -MMD -MF /pkg/src/node-v6.11.0/out/Release/.deps//pkg/src/node-v6.11.0/out/Release/obj.target/v8_base/deps/v8/src/compiler/escape-analysis.o.d.raw -D_FORTIFY_SOURCE=2 -march=x86-64 -mtune=generic -O2 -pipe -fstack-protector-strong -c -o /pkg/src/node-v6.11.0/out/Release/obj.target/v8_base/deps/v8/src/compiler/escape-analysis.o ../deps/v8/src/compiler/escape-analysis.cc
373  [06/09/2017 11:59PM]:                  from ../deps/v8/src/compiler/escape-analysis.cc:10:
374  [06/09/2017 11:59PM]:                  from ../deps/v8/src/compiler/escape-analysis.h:9,
375  [06/09/2017 11:59PM]:                  from ../deps/v8/src/compiler/escape-analysis.cc:5:
376  [06/09/2017 11:59PM]: ../deps/v8/src/compiler/escape-analysis.cc: In function bool v8::internal::compiler::{anonymous}::IsEquivalentPhi(v8::internal::compiler::Node*, v8::internal::ZoneVector<v8::internal::compiler::Node*>&):
377  [06/09/2017 11:59PM]: ../deps/v8/src/compiler/escape-analysis.cc:339:36: warning: comparison between signed and unsigned integer expressions [-Wsign-compare]
378  [06/09/2017 11:59PM]:    if (phi->op()->ValueInputCount() != inputs.size()) {
379  [06/09/2017 11:59PM]:        ~~~~~~~~~~~~~~~~~~~~~~~~~~~~~^~~~~~~~~~~~~~~~
380  [06/09/2017 11:59PM]: ../deps/v8/src/compiler/escape-analysis.cc: In member function bool v8::internal::compiler::VirtualObject::MergeFrom(v8::internal::compiler::MergeCache*, v8::internal::compiler::Node*, v8::internal::compiler::Graph*, v8::internal::compiler::CommonOperatorBuilder*):
381  [06/09/2017 11:59PM]: ../deps/v8/src/compiler/escape-analysis.cc:403:34: warning: comparison between signed and unsigned integer expressions [-Wsign-compare]
382  [06/09/2017 11:59PM]:        if (cache->fields().size() == arity) {
383  [06/09/2017 11:59PM]:            ~~~~~~~~~~~~~~~~~~~~~~~^~~~~~~~
384  [06/09/2017 11:59PM]:   g++ -DV8_TARGET_ARCH_X64 -DENABLE_DISASSEMBLER -DV8_I18N_SUPPORT -DV8_IMMINENT_DEPRECATION_WARNINGS -DICU_UTIL_DATA_IMPL=ICU_UTIL_DATA_STATIC -I../deps/v8 -I../deps -I/usr/include/openssl-1.0  -pthread -Wall -Wextra -Wno-unused-parameter -m64 -fno-strict-aliasing -m64 -fdata-sections -ffunction-sections -O3 -O3 -fno-omit-frame-pointer -fno-rtti -fno-exceptions -std=gnu++0x -MMD -MF /pkg/src/node-v6.11.0/out/Release/.deps//pkg/src/node-v6.11.0/out/Release/obj.target/v8_base/deps/v8/src/compiler/escape-analysis-reducer.o.d.raw -D_FORTIFY_SOURCE=2 -march=x86-64 -mtune=generic -O2 -pipe -fstack-protector-strong -c -o /pkg/src/node-v6.11.0/out/Release/obj.target/v8_base/deps/v8/src/compiler/escape-analysis-reducer.o ../deps/v8/src/compiler/escape-analysis-reducer.cc
385  [06/09/2017 11:59PM]:                  from ../deps/v8/src/compiler/escape-analysis-reducer.h:10,
386  [06/09/2017 11:59PM]:                  from ../deps/v8/src/compiler/escape-analysis-reducer.cc:5:
387  [06/09/2017 11:59PM]:                  from ../deps/v8/src/compiler/escape-analysis-reducer.h:8,
388  [06/09/2017 11:59PM]:   g++ -DV8_TARGET_ARCH_X64 -DENABLE_DISASSEMBLER -DV8_I18N_SUPPORT -DV8_IMMINENT_DEPRECATION_WARNINGS -DICU_UTIL_DATA_IMPL=ICU_UTIL_DATA_STATIC -I../deps/v8 -I../deps -I/usr/include/openssl-1.0  -pthread -Wall -Wextra -Wno-unused-parameter -m64 -fno-strict-aliasing -m64 -fdata-sections -ffunction-sections -O3 -O3 -fno-omit-frame-pointer -fno-rtti -fno-exceptions -std=gnu++0x -MMD -MF /pkg/src/node-v6.11.0/out/Release/.deps//pkg/src/node-v6.11.0/out/Release/obj.target/v8_base/deps/v8/src/compiler/frame.o.d.raw -D_FORTIFY_SOURCE=2 -march=x86-64 -mtune=generic -O2 -pipe -fstack-protector-strong -c -o /pkg/src/node-v6.11.0/out/Release/obj.target/v8_base/deps/v8/src/compiler/frame.o ../deps/v8/src/compiler/frame.cc
389  [06/09/2017 11:59PM]:                  from ../deps/v8/src/compiler/frame.cc:5:
390  [06/09/2017 11:59PM]:                  from ../deps/v8/src/compiler/frame.h:8,
391  [06/09/2017 11:59PM]:   g++ -DV8_TARGET_ARCH_X64 -DENABLE_DISASSEMBLER -DV8_I18N_SUPPORT -DV8_IMMINENT_DEPRECATION_WARNINGS -DICU_UTIL_DATA_IMPL=ICU_UTIL_DATA_STATIC -I../deps/v8 -I../deps -I/usr/include/openssl-1.0  -pthread -Wall -Wextra -Wno-unused-parameter -m64 -fno-strict-aliasing -m64 -fdata-sections -ffunction-sections -O3 -O3 -fno-omit-frame-pointer -fno-rtti -fno-exceptions -std=gnu++0x -MMD -MF /pkg/src/node-v6.11.0/out/Release/.deps//pkg/src/node-v6.11.0/out/Release/obj.target/v8_base/deps/v8/src/compiler/frame-elider.o.d.raw -D_FORTIFY_SOURCE=2 -march=x86-64 -mtune=generic -O2 -pipe -fstack-protector-strong -c -o /pkg/src/node-v6.11.0/out/Release/obj.target/v8_base/deps/v8/src/compiler/frame-elider.o ../deps/v8/src/compiler/frame-elider.cc
392  [06/09/2017 11:59PM]:                  from ../deps/v8/src/compiler/frame-elider.h:8,
393  [06/09/2017 11:59PM]:                  from ../deps/v8/src/compiler/frame-elider.cc:6:
394  [06/09/2017 11:59PM]:   g++ -DV8_TARGET_ARCH_X64 -DENABLE_DISASSEMBLER -DV8_I18N_SUPPORT -DV8_IMMINENT_DEPRECATION_WARNINGS -DICU_UTIL_DATA_IMPL=ICU_UTIL_DATA_STATIC -I../deps/v8 -I../deps -I/usr/include/openssl-1.0  -pthread -Wall -Wextra -Wno-unused-parameter -m64 -fno-strict-aliasing -m64 -fdata-sections -ffunction-sections -O3 -O3 -fno-omit-frame-pointer -fno-rtti -fno-exceptions -std=gnu++0x -MMD -MF /pkg/src/node-v6.11.0/out/Release/.deps//pkg/src/node-v6.11.0/out/Release/obj.target/v8_base/deps/v8/src/compiler/frame-states.o.d.raw -D_FORTIFY_SOURCE=2 -march=x86-64 -mtune=generic -O2 -pipe -fstack-protector-strong -c -o /pkg/src/node-v6.11.0/out/Release/obj.target/v8_base/deps/v8/src/compiler/frame-states.o ../deps/v8/src/compiler/frame-states.cc
395  [06/09/2017 11:59PM]:                  from ../deps/v8/src/handles-inl.h:8,
396  [06/09/2017 11:59PM]:                  from ../deps/v8/src/compiler/frame-states.cc:8:
397  [06/09/2017 11:59PM]:                  from ../deps/v8/src/compiler/frame-states.cc:5:
398  [06/09/2017 11:59PM]:   g++ -DV8_TARGET_ARCH_X64 -DENABLE_DISASSEMBLER -DV8_I18N_SUPPORT -DV8_IMMINENT_DEPRECATION_WARNINGS -DICU_UTIL_DATA_IMPL=ICU_UTIL_DATA_STATIC -I../deps/v8 -I../deps -I/usr/include/openssl-1.0  -pthread -Wall -Wextra -Wno-unused-parameter -m64 -fno-strict-aliasing -m64 -fdata-sections -ffunction-sections -O3 -O3 -fno-omit-frame-pointer -fno-rtti -fno-exceptions -std=gnu++0x -MMD -MF /pkg/src/node-v6.11.0/out/Release/.deps//pkg/src/node-v6.11.0/out/Release/obj.target/v8_base/deps/v8/src/compiler/gap-resolver.o.d.raw -D_FORTIFY_SOURCE=2 -march=x86-64 -mtune=generic -O2 -pipe -fstack-protector-strong -c -o /pkg/src/node-v6.11.0/out/Release/obj.target/v8_base/deps/v8/src/compiler/gap-resolver.o ../deps/v8/src/compiler/gap-resolver.cc
399  [06/09/2017 11:59PM]:                  from ../deps/v8/src/compiler/gap-resolver.cc:5:
400  [06/09/2017 11:59PM]:   g++ -DV8_TARGET_ARCH_X64 -DENABLE_DISASSEMBLER -DV8_I18N_SUPPORT -DV8_IMMINENT_DEPRECATION_WARNINGS -DICU_UTIL_DATA_IMPL=ICU_UTIL_DATA_STATIC -I../deps/v8 -I../deps -I/usr/include/openssl-1.0  -pthread -Wall -Wextra -Wno-unused-parameter -m64 -fno-strict-aliasing -m64 -fdata-sections -ffunction-sections -O3 -O3 -fno-omit-frame-pointer -fno-rtti -fno-exceptions -std=gnu++0x -MMD -MF /pkg/src/node-v6.11.0/out/Release/.deps//pkg/src/node-v6.11.0/out/Release/obj.target/v8_base/deps/v8/src/compiler/graph-reducer.o.d.raw -D_FORTIFY_SOURCE=2 -march=x86-64 -mtune=generic -O2 -pipe -fstack-protector-strong -c -o /pkg/src/node-v6.11.0/out/Release/obj.target/v8_base/deps/v8/src/compiler/graph-reducer.o ../deps/v8/src/compiler/graph-reducer.cc
401  [06/09/2017 11:59PM]:                  from ../deps/v8/src/compiler/graph-reducer.cc:9:
402  [06/09/2017 11:59PM]:                  from ../deps/v8/src/compiler/graph-reducer.cc:8:
403  [06/09/2017 11:59PM]:   g++ -DV8_TARGET_ARCH_X64 -DENABLE_DISASSEMBLER -DV8_I18N_SUPPORT -DV8_IMMINENT_DEPRECATION_WARNINGS -DICU_UTIL_DATA_IMPL=ICU_UTIL_DATA_STATIC -I../deps/v8 -I../deps -I/usr/include/openssl-1.0  -pthread -Wall -Wextra -Wno-unused-parameter -m64 -fno-strict-aliasing -m64 -fdata-sections -ffunction-sections -O3 -O3 -fno-omit-frame-pointer -fno-rtti -fno-exceptions -std=gnu++0x -MMD -MF /pkg/src/node-v6.11.0/out/Release/.deps//pkg/src/node-v6.11.0/out/Release/obj.target/v8_base/deps/v8/src/compiler/graph-replay.o.d.raw -D_FORTIFY_SOURCE=2 -march=x86-64 -mtune=generic -O2 -pipe -fstack-protector-strong -c -o /pkg/src/node-v6.11.0/out/Release/obj.target/v8_base/deps/v8/src/compiler/graph-replay.o ../deps/v8/src/compiler/graph-replay.cc
404  [06/09/2017 11:59PM]:                  from ../deps/v8/src/compiler/graph-replay.h:8,
405  [06/09/2017 11:59PM]:                  from ../deps/v8/src/compiler/graph-replay.cc:5:
406  [06/09/2017 11:59PM]:   g++ -DV8_TARGET_ARCH_X64 -DENABLE_DISASSEMBLER -DV8_I18N_SUPPORT -DV8_IMMINENT_DEPRECATION_WARNINGS -DICU_UTIL_DATA_IMPL=ICU_UTIL_DATA_STATIC -I../deps/v8 -I../deps -I/usr/include/openssl-1.0  -pthread -Wall -Wextra -Wno-unused-parameter -m64 -fno-strict-aliasing -m64 -fdata-sections -ffunction-sections -O3 -O3 -fno-omit-frame-pointer -fno-rtti -fno-exceptions -std=gnu++0x -MMD -MF /pkg/src/node-v6.11.0/out/Release/.deps//pkg/src/node-v6.11.0/out/Release/obj.target/v8_base/deps/v8/src/compiler/graph-trimmer.o.d.raw -D_FORTIFY_SOURCE=2 -march=x86-64 -mtune=generic -O2 -pipe -fstack-protector-strong -c -o /pkg/src/node-v6.11.0/out/Release/obj.target/v8_base/deps/v8/src/compiler/graph-trimmer.o ../deps/v8/src/compiler/graph-trimmer.cc
407  [06/09/2017 11:59PM]:                  from ../deps/v8/src/compiler/graph-trimmer.h:8,
408  [06/09/2017 11:59PM]:                  from ../deps/v8/src/compiler/graph-trimmer.cc:5:
409  [06/09/2017 11:59PM]:   g++ -DV8_TARGET_ARCH_X64 -DENABLE_DISASSEMBLER -DV8_I18N_SUPPORT -DV8_IMMINENT_DEPRECATION_WARNINGS -DICU_UTIL_DATA_IMPL=ICU_UTIL_DATA_STATIC -I../deps/v8 -I../deps -I/usr/include/openssl-1.0  -pthread -Wall -Wextra -Wno-unused-parameter -m64 -fno-strict-aliasing -m64 -fdata-sections -ffunction-sections -O3 -O3 -fno-omit-frame-pointer -fno-rtti -fno-exceptions -std=gnu++0x -MMD -MF /pkg/src/node-v6.11.0/out/Release/.deps//pkg/src/node-v6.11.0/out/Release/obj.target/v8_base/deps/v8/src/compiler/graph-visualizer.o.d.raw -D_FORTIFY_SOURCE=2 -march=x86-64 -mtune=generic -O2 -pipe -fstack-protector-strong -c -o /pkg/src/node-v6.11.0/out/Release/obj.target/v8_base/deps/v8/src/compiler/graph-visualizer.o ../deps/v8/src/compiler/graph-visualizer.cc
410  [06/09/2017 11:59PM]:                  from ../deps/v8/src/compiler/graph-visualizer.cc:10:
411  [06/09/2017 11:59PM]:   g++ -DV8_TARGET_ARCH_X64 -DENABLE_DISASSEMBLER -DV8_I18N_SUPPORT -DV8_IMMINENT_DEPRECATION_WARNINGS -DICU_UTIL_DATA_IMPL=ICU_UTIL_DATA_STATIC -I../deps/v8 -I../deps -I/usr/include/openssl-1.0  -pthread -Wall -Wextra -Wno-unused-parameter -m64 -fno-strict-aliasing -m64 -fdata-sections -ffunction-sections -O3 -O3 -fno-omit-frame-pointer -fno-rtti -fno-exceptions -std=gnu++0x -MMD -MF /pkg/src/node-v6.11.0/out/Release/.deps//pkg/src/node-v6.11.0/out/Release/obj.target/v8_base/deps/v8/src/compiler/graph.o.d.raw -D_FORTIFY_SOURCE=2 -march=x86-64 -mtune=generic -O2 -pipe -fstack-protector-strong -c -o /pkg/src/node-v6.11.0/out/Release/obj.target/v8_base/deps/v8/src/compiler/graph.o ../deps/v8/src/compiler/graph.cc
412  [06/09/2017 11:59PM]:                  from ../deps/v8/src/compiler/graph.cc:10:
413  [06/09/2017 11:59PM]:                  from ../deps/v8/src/compiler/graph.cc:5:
414  [06/09/2017 11:59PM]:   g++ -DV8_TARGET_ARCH_X64 -DENABLE_DISASSEMBLER -DV8_I18N_SUPPORT -DV8_IMMINENT_DEPRECATION_WARNINGS -DICU_UTIL_DATA_IMPL=ICU_UTIL_DATA_STATIC -I../deps/v8 -I../deps -I/usr/include/openssl-1.0  -pthread -Wall -Wextra -Wno-unused-parameter -m64 -fno-strict-aliasing -m64 -fdata-sections -ffunction-sections -O3 -O3 -fno-omit-frame-pointer -fno-rtti -fno-exceptions -std=gnu++0x -MMD -MF /pkg/src/node-v6.11.0/out/Release/.deps//pkg/src/node-v6.11.0/out/Release/obj.target/v8_base/deps/v8/src/compiler/greedy-allocator.o.d.raw -D_FORTIFY_SOURCE=2 -march=x86-64 -mtune=generic -O2 -pipe -fstack-protector-strong -c -o /pkg/src/node-v6.11.0/out/Release/obj.target/v8_base/deps/v8/src/compiler/greedy-allocator.o ../deps/v8/src/compiler/greedy-allocator.cc
415  [06/09/2017 11:59PM]:                  from ../deps/v8/src/compiler/greedy-allocator.h:8,
416  [06/09/2017 11:59PM]:                  from ../deps/v8/src/compiler/greedy-allocator.cc:5:
417  [06/09/2017 11:59PM]:   g++ -DV8_TARGET_ARCH_X64 -DENABLE_DISASSEMBLER -DV8_I18N_SUPPORT -DV8_IMMINENT_DEPRECATION_WARNINGS -DICU_UTIL_DATA_IMPL=ICU_UTIL_DATA_STATIC -I../deps/v8 -I../deps -I/usr/include/openssl-1.0  -pthread -Wall -Wextra -Wno-unused-parameter -m64 -fno-strict-aliasing -m64 -fdata-sections -ffunction-sections -O3 -O3 -fno-omit-frame-pointer -fno-rtti -fno-exceptions -std=gnu++0x -MMD -MF /pkg/src/node-v6.11.0/out/Release/.deps//pkg/src/node-v6.11.0/out/Release/obj.target/v8_base/deps/v8/src/compiler/instruction-selector.o.d.raw -D_FORTIFY_SOURCE=2 -march=x86-64 -mtune=generic -O2 -pipe -fstack-protector-strong -c -o /pkg/src/node-v6.11.0/out/Release/obj.target/v8_base/deps/v8/src/compiler/instruction-selector.o ../deps/v8/src/compiler/instruction-selector.cc
418  [06/09/2017 11:59PM]:                  from ../deps/v8/src/compiler/instruction-selector.h:11,
419  [06/09/2017 11:59PM]:                  from ../deps/v8/src/compiler/instruction-selector.cc:5:
420  [06/09/2017 11:59PM]:                  from ../deps/v8/src/compiler/instruction-selector.h:10,
421  [06/09/2017 11:59PM]:   g++ -DV8_TARGET_ARCH_X64 -DENABLE_DISASSEMBLER -DV8_I18N_SUPPORT -DV8_IMMINENT_DEPRECATION_WARNINGS -DICU_UTIL_DATA_IMPL=ICU_UTIL_DATA_STATIC -I../deps/v8 -I../deps -I/usr/include/openssl-1.0  -pthread -Wall -Wextra -Wno-unused-parameter -m64 -fno-strict-aliasing -m64 -fdata-sections -ffunction-sections -O3 -O3 -fno-omit-frame-pointer -fno-rtti -fno-exceptions -std=gnu++0x -MMD -MF /pkg/src/node-v6.11.0/out/Release/.deps//pkg/src/node-v6.11.0/out/Release/obj.target/v8_base/deps/v8/src/compiler/instruction-scheduler.o.d.raw -D_FORTIFY_SOURCE=2 -march=x86-64 -mtune=generic -O2 -pipe -fstack-protector-strong -c -o /pkg/src/node-v6.11.0/out/Release/obj.target/v8_base/deps/v8/src/compiler/instruction-scheduler.o ../deps/v8/src/compiler/instruction-scheduler.cc
422  [06/09/2017 11:59PM]:                  from ../deps/v8/src/compiler/instruction-scheduler.h:8,
423  [06/09/2017 11:59PM]:                  from ../deps/v8/src/compiler/instruction-scheduler.cc:5:
424  [06/09/2017 11:59PM]:   g++ -DV8_TARGET_ARCH_X64 -DENABLE_DISASSEMBLER -DV8_I18N_SUPPORT -DV8_IMMINENT_DEPRECATION_WARNINGS -DICU_UTIL_DATA_IMPL=ICU_UTIL_DATA_STATIC -I../deps/v8 -I../deps -I/usr/include/openssl-1.0  -pthread -Wall -Wextra -Wno-unused-parameter -m64 -fno-strict-aliasing -m64 -fdata-sections -ffunction-sections -O3 -O3 -fno-omit-frame-pointer -fno-rtti -fno-exceptions -std=gnu++0x -MMD -MF /pkg/src/node-v6.11.0/out/Release/.deps//pkg/src/node-v6.11.0/out/Release/obj.target/v8_base/deps/v8/src/compiler/instruction.o.d.raw -D_FORTIFY_SOURCE=2 -march=x86-64 -mtune=generic -O2 -pipe -fstack-protector-strong -c -o /pkg/src/node-v6.11.0/out/Release/obj.target/v8_base/deps/v8/src/compiler/instruction.o ../deps/v8/src/compiler/instruction.cc
425  [06/09/2017 11:59PM]:                  from ../deps/v8/src/compiler/instruction.cc:7:
426  [06/09/2017 11:59PM]:                  from ../deps/v8/src/compiler/instruction.cc:5:
427  [06/09/2017 11:59PM]: ../deps/v8/src/compiler/instruction.cc: In function std::ostream& v8::internal::compiler::operator<<(std::ostream&, const v8::internal::compiler::PrintableInstructionOperand&):
428  [06/09/2017 11:59PM]: ../deps/v8/src/compiler/instruction.cc:111:7: warning: this statement may fall through [-Wimplicit-fallthrough=]
429  [06/09/2017 11:59PM]: ../deps/v8/src/compiler/instruction.cc:113:5: note: here
430  [06/09/2017 11:59PM]:      case InstructionOperand::CONSTANT:
431  [06/09/2017 11:59PM]: ../deps/v8/src/compiler/instruction.cc:123:7: warning: this statement may fall through [-Wimplicit-fallthrough=]
432  [06/09/2017 11:59PM]: ../deps/v8/src/compiler/instruction.cc:125:5: note: here
433  [06/09/2017 11:59PM]:      case InstructionOperand::EXPLICIT:
434  [06/09/2017 11:59PM]:   g++ -DV8_TARGET_ARCH_X64 -DENABLE_DISASSEMBLER -DV8_I18N_SUPPORT -DV8_IMMINENT_DEPRECATION_WARNINGS -DICU_UTIL_DATA_IMPL=ICU_UTIL_DATA_STATIC -I../deps/v8 -I../deps -I/usr/include/openssl-1.0  -pthread -Wall -Wextra -Wno-unused-parameter -m64 -fno-strict-aliasing -m64 -fdata-sections -ffunction-sections -O3 -O3 -fno-omit-frame-pointer -fno-rtti -fno-exceptions -std=gnu++0x -MMD -MF /pkg/src/node-v6.11.0/out/Release/.deps//pkg/src/node-v6.11.0/out/Release/obj.target/v8_base/deps/v8/src/compiler/int64-lowering.o.d.raw -D_FORTIFY_SOURCE=2 -march=x86-64 -mtune=generic -O2 -pipe -fstack-protector-strong -c -o /pkg/src/node-v6.11.0/out/Release/obj.target/v8_base/deps/v8/src/compiler/int64-lowering.o ../deps/v8/src/compiler/int64-lowering.cc
435  [06/09/2017 11:59PM]:                  from ../deps/v8/src/compiler/int64-lowering.h:11,
436  [06/09/2017 11:59PM]:                  from ../deps/v8/src/compiler/int64-lowering.cc:5:
437  [06/09/2017 11:59PM]:                  from ../deps/v8/src/compiler/int64-lowering.h:8,
438  [06/09/2017 11:59PM]: ../deps/v8/src/compiler/int64-lowering.cc: In member function void v8::internal::compiler::Int64Lowering::LowerNode(v8::internal::compiler::Node*):
439  [06/09/2017 11:59PM]: ../deps/v8/src/compiler/int64-lowering.cc:187:27: warning: comparison between signed and unsigned integer expressions [-Wsign-compare]
440  [06/09/2017 11:59PM]:        if (parameter_count != signature()->parameter_count()) {
441  [06/09/2017 11:59PM]:            ~~~~~~~~~~~~~~~~^~~~~~~~~~~~~~~~~~~~~~~~~~~~~~~~~
442  [06/09/2017 11:59PM]: ../deps/v8/src/compiler/int64-lowering.cc:201:55: warning: comparison between signed and unsigned integer expressions [-Wsign-compare]
443  [06/09/2017 11:59PM]:        if (GetParameterCountAfterLowering(signature()) !=
444  [06/09/2017 11:59PM]:            ~~~~~~~~~~~~~~~~~~~~~~~~~~~~~~~~~~~~~~~~~~~~^~
445  [06/09/2017 11:59PM]:            signature()->parameter_count()) {
446  [06/09/2017 11:59PM]:            ~~~~~~~~~~~~~~~~~~~~~~~~~~~~~~
447  [06/09/2017 11:59PM]: ../deps/v8/src/compiler/int64-lowering.cc:220:39: warning: comparison between signed and unsigned integer expressions [-Wsign-compare]
448  [06/09/2017 11:59PM]:        if (signature()->return_count() != new_return_count) {
449  [06/09/2017 11:59PM]:            ~~~~~~~~~~~~~~~~~~~~~~~~~~~~^~~~~~~~~~~~~~~~~~~
450  [06/09/2017 11:59PM]:   g++ -DV8_TARGET_ARCH_X64 -DENABLE_DISASSEMBLER -DV8_I18N_SUPPORT -DV8_IMMINENT_DEPRECATION_WARNINGS -DICU_UTIL_DATA_IMPL=ICU_UTIL_DATA_STATIC -I../deps/v8 -I../deps -I/usr/include/openssl-1.0  -pthread -Wall -Wextra -Wno-unused-parameter -m64 -fno-strict-aliasing -m64 -fdata-sections -ffunction-sections -O3 -O3 -fno-omit-frame-pointer -fno-rtti -fno-exceptions -std=gnu++0x -MMD -MF /pkg/src/node-v6.11.0/out/Release/.deps//pkg/src/node-v6.11.0/out/Release/obj.target/v8_base/deps/v8/src/compiler/js-builtin-reducer.o.d.raw -D_FORTIFY_SOURCE=2 -march=x86-64 -mtune=generic -O2 -pipe -fstack-protector-strong -c -o /pkg/src/node-v6.11.0/out/Release/obj.target/v8_base/deps/v8/src/compiler/js-builtin-reducer.o ../deps/v8/src/compiler/js-builtin-reducer.cc
451  [06/09/2017 11:59PM]:                  from ../deps/v8/src/compiler/js-builtin-reducer.h:8,
452  [06/09/2017 11:59PM]:                  from ../deps/v8/src/compiler/js-builtin-reducer.cc:5:
453  [06/09/2017 11:59PM]:   g++ -DV8_TARGET_ARCH_X64 -DENABLE_DISASSEMBLER -DV8_I18N_SUPPORT -DV8_IMMINENT_DEPRECATION_WARNINGS -DICU_UTIL_DATA_IMPL=ICU_UTIL_DATA_STATIC -I../deps/v8 -I../deps -I/usr/include/openssl-1.0  -pthread -Wall -Wextra -Wno-unused-parameter -m64 -fno-strict-aliasing -m64 -fdata-sections -ffunction-sections -O3 -O3 -fno-omit-frame-pointer -fno-rtti -fno-exceptions -std=gnu++0x -MMD -MF /pkg/src/node-v6.11.0/out/Release/.deps//pkg/src/node-v6.11.0/out/Release/obj.target/v8_base/deps/v8/src/compiler/js-call-reducer.o.d.raw -D_FORTIFY_SOURCE=2 -march=x86-64 -mtune=generic -O2 -pipe -fstack-protector-strong -c -o /pkg/src/node-v6.11.0/out/Release/obj.target/v8_base/deps/v8/src/compiler/js-call-reducer.o ../deps/v8/src/compiler/js-call-reducer.cc
454  [06/09/2017 11:59PM]:                  from ../deps/v8/src/compiler/js-call-reducer.h:9,
455  [06/09/2017 11:59PM]:                  from ../deps/v8/src/compiler/js-call-reducer.cc:5:
456  [06/09/2017 11:59PM]:   g++ -DV8_TARGET_ARCH_X64 -DENABLE_DISASSEMBLER -DV8_I18N_SUPPORT -DV8_IMMINENT_DEPRECATION_WARNINGS -DICU_UTIL_DATA_IMPL=ICU_UTIL_DATA_STATIC -I../deps/v8 -I../deps -I/usr/include/openssl-1.0  -pthread -Wall -Wextra -Wno-unused-parameter -m64 -fno-strict-aliasing -m64 -fdata-sections -ffunction-sections -O3 -O3 -fno-omit-frame-pointer -fno-rtti -fno-exceptions -std=gnu++0x -MMD -MF /pkg/src/node-v6.11.0/out/Release/.deps//pkg/src/node-v6.11.0/out/Release/obj.target/v8_base/deps/v8/src/compiler/js-context-specialization.o.d.raw -D_FORTIFY_SOURCE=2 -march=x86-64 -mtune=generic -O2 -pipe -fstack-protector-strong -c -o /pkg/src/node-v6.11.0/out/Release/obj.target/v8_base/deps/v8/src/compiler/js-context-specialization.o ../deps/v8/src/compiler/js-context-specialization.cc
457  [06/09/2017 11:59PM]:                  from ../deps/v8/src/compiler/js-context-specialization.h:8,
458  [06/09/2017 11:59PM]:                  from ../deps/v8/src/compiler/js-context-specialization.cc:5:
459  [06/09/2017 11:59PM]:   g++ -DV8_TARGET_ARCH_X64 -DENABLE_DISASSEMBLER -DV8_I18N_SUPPORT -DV8_IMMINENT_DEPRECATION_WARNINGS -DICU_UTIL_DATA_IMPL=ICU_UTIL_DATA_STATIC -I../deps/v8 -I../deps -I/usr/include/openssl-1.0  -pthread -Wall -Wextra -Wno-unused-parameter -m64 -fno-strict-aliasing -m64 -fdata-sections -ffunction-sections -O3 -O3 -fno-omit-frame-pointer -fno-rtti -fno-exceptions -std=gnu++0x -MMD -MF /pkg/src/node-v6.11.0/out/Release/.deps//pkg/src/node-v6.11.0/out/Release/obj.target/v8_base/deps/v8/src/compiler/js-create-lowering.o.d.raw -D_FORTIFY_SOURCE=2 -march=x86-64 -mtune=generic -O2 -pipe -fstack-protector-strong -c -o /pkg/src/node-v6.11.0/out/Release/obj.target/v8_base/deps/v8/src/compiler/js-create-lowering.o ../deps/v8/src/compiler/js-create-lowering.cc
460  [06/09/2017 11:59PM]:                  from ../deps/v8/src/compiler/js-create-lowering.h:8,
461  [06/09/2017 11:59PM]:                  from ../deps/v8/src/compiler/js-create-lowering.cc:5:
462  [06/10/2017 12:00AM]:   g++ -DV8_TARGET_ARCH_X64 -DENABLE_DISASSEMBLER -DV8_I18N_SUPPORT -DV8_IMMINENT_DEPRECATION_WARNINGS -DICU_UTIL_DATA_IMPL=ICU_UTIL_DATA_STATIC -I../deps/v8 -I../deps -I/usr/include/openssl-1.0  -pthread -Wall -Wextra -Wno-unused-parameter -m64 -fno-strict-aliasing -m64 -fdata-sections -ffunction-sections -O3 -O3 -fno-omit-frame-pointer -fno-rtti -fno-exceptions -std=gnu++0x -MMD -MF /pkg/src/node-v6.11.0/out/Release/.deps//pkg/src/node-v6.11.0/out/Release/obj.target/v8_base/deps/v8/src/compiler/js-frame-specialization.o.d.raw -D_FORTIFY_SOURCE=2 -march=x86-64 -mtune=generic -O2 -pipe -fstack-protector-strong -c -o /pkg/src/node-v6.11.0/out/Release/obj.target/v8_base/deps/v8/src/compiler/js-frame-specialization.o ../deps/v8/src/compiler/js-frame-specialization.cc
463  [06/10/2017 12:00AM]:                  from ../deps/v8/src/compiler/js-frame-specialization.h:8,
464  [06/10/2017 12:00AM]:                  from ../deps/v8/src/compiler/js-frame-specialization.cc:5:
465  [06/10/2017 12:00AM]:   g++ -DV8_TARGET_ARCH_X64 -DENABLE_DISASSEMBLER -DV8_I18N_SUPPORT -DV8_IMMINENT_DEPRECATION_WARNINGS -DICU_UTIL_DATA_IMPL=ICU_UTIL_DATA_STATIC -I../deps/v8 -I../deps -I/usr/include/openssl-1.0  -pthread -Wall -Wextra -Wno-unused-parameter -m64 -fno-strict-aliasing -m64 -fdata-sections -ffunction-sections -O3 -O3 -fno-omit-frame-pointer -fno-rtti -fno-exceptions -std=gnu++0x -MMD -MF /pkg/src/node-v6.11.0/out/Release/.deps//pkg/src/node-v6.11.0/out/Release/obj.target/v8_base/deps/v8/src/compiler/js-generic-lowering.o.d.raw -D_FORTIFY_SOURCE=2 -march=x86-64 -mtune=generic -O2 -pipe -fstack-protector-strong -c -o /pkg/src/node-v6.11.0/out/Release/obj.target/v8_base/deps/v8/src/compiler/js-generic-lowering.o ../deps/v8/src/compiler/js-generic-lowering.cc
466  [06/10/2017 12:00AM]:                  from ../deps/v8/src/compiler/js-generic-lowering.cc:5:
467  [06/10/2017 12:00AM]:   g++ -DV8_TARGET_ARCH_X64 -DENABLE_DISASSEMBLER -DV8_I18N_SUPPORT -DV8_IMMINENT_DEPRECATION_WARNINGS -DICU_UTIL_DATA_IMPL=ICU_UTIL_DATA_STATIC -I../deps/v8 -I../deps -I/usr/include/openssl-1.0  -pthread -Wall -Wextra -Wno-unused-parameter -m64 -fno-strict-aliasing -m64 -fdata-sections -ffunction-sections -O3 -O3 -fno-omit-frame-pointer -fno-rtti -fno-exceptions -std=gnu++0x -MMD -MF /pkg/src/node-v6.11.0/out/Release/.deps//pkg/src/node-v6.11.0/out/Release/obj.target/v8_base/deps/v8/src/compiler/js-global-object-specialization.o.d.raw -D_FORTIFY_SOURCE=2 -march=x86-64 -mtune=generic -O2 -pipe -fstack-protector-strong -c -o /pkg/src/node-v6.11.0/out/Release/obj.target/v8_base/deps/v8/src/compiler/js-global-object-specialization.o ../deps/v8/src/compiler/js-global-object-specialization.cc
468  [06/10/2017 12:00AM]:                  from ../deps/v8/src/compiler/js-global-object-specialization.h:8,
469  [06/10/2017 12:00AM]:                  from ../deps/v8/src/compiler/js-global-object-specialization.cc:5:
470  [06/10/2017 12:00AM]:   g++ -DV8_TARGET_ARCH_X64 -DENABLE_DISASSEMBLER -DV8_I18N_SUPPORT -DV8_IMMINENT_DEPRECATION_WARNINGS -DICU_UTIL_DATA_IMPL=ICU_UTIL_DATA_STATIC -I../deps/v8 -I../deps -I/usr/include/openssl-1.0  -pthread -Wall -Wextra -Wno-unused-parameter -m64 -fno-strict-aliasing -m64 -fdata-sections -ffunction-sections -O3 -O3 -fno-omit-frame-pointer -fno-rtti -fno-exceptions -std=gnu++0x -MMD -MF /pkg/src/node-v6.11.0/out/Release/.deps//pkg/src/node-v6.11.0/out/Release/obj.target/v8_base/deps/v8/src/compiler/js-graph.o.d.raw -D_FORTIFY_SOURCE=2 -march=x86-64 -mtune=generic -O2 -pipe -fstack-protector-strong -c -o /pkg/src/node-v6.11.0/out/Release/obj.target/v8_base/deps/v8/src/compiler/js-graph.o ../deps/v8/src/compiler/js-graph.cc
471  [06/10/2017 12:00AM]:                  from ../deps/v8/src/compiler/js-graph.cc:5:
472  [06/10/2017 12:00AM]:   g++ -DV8_TARGET_ARCH_X64 -DENABLE_DISASSEMBLER -DV8_I18N_SUPPORT -DV8_IMMINENT_DEPRECATION_WARNINGS -DICU_UTIL_DATA_IMPL=ICU_UTIL_DATA_STATIC -I../deps/v8 -I../deps -I/usr/include/openssl-1.0  -pthread -Wall -Wextra -Wno-unused-parameter -m64 -fno-strict-aliasing -m64 -fdata-sections -ffunction-sections -O3 -O3 -fno-omit-frame-pointer -fno-rtti -fno-exceptions -std=gnu++0x -MMD -MF /pkg/src/node-v6.11.0/out/Release/.deps//pkg/src/node-v6.11.0/out/Release/obj.target/v8_base/deps/v8/src/compiler/js-inlining.o.d.raw -D_FORTIFY_SOURCE=2 -march=x86-64 -mtune=generic -O2 -pipe -fstack-protector-strong -c -o /pkg/src/node-v6.11.0/out/Release/obj.target/v8_base/deps/v8/src/compiler/js-inlining.o ../deps/v8/src/compiler/js-inlining.cc
473  [06/10/2017 12:00AM]: In file included from ../deps/v8/src/runtime/runtime.h:10:0,
474  [06/10/2017 12:00AM]:                  from ../deps/v8/src/compiler/js-operator.h:9,
475  [06/10/2017 12:00AM]:                  from ../deps/v8/src/compiler/js-graph.h:11,
476  [06/10/2017 12:00AM]:                  from ../deps/v8/src/compiler/js-inlining.h:8,
477  [06/10/2017 12:00AM]:                  from ../deps/v8/src/compiler/js-inlining.cc:5:
478  [06/10/2017 12:00AM]:                  from ../deps/v8/src/compiler/js-graph.h:9,
479  [06/10/2017 12:00AM]:   g++ -DV8_TARGET_ARCH_X64 -DENABLE_DISASSEMBLER -DV8_I18N_SUPPORT -DV8_IMMINENT_DEPRECATION_WARNINGS -DICU_UTIL_DATA_IMPL=ICU_UTIL_DATA_STATIC -I../deps/v8 -I../deps -I/usr/include/openssl-1.0  -pthread -Wall -Wextra -Wno-unused-parameter -m64 -fno-strict-aliasing -m64 -fdata-sections -ffunction-sections -O3 -O3 -fno-omit-frame-pointer -fno-rtti -fno-exceptions -std=gnu++0x -MMD -MF /pkg/src/node-v6.11.0/out/Release/.deps//pkg/src/node-v6.11.0/out/Release/obj.target/v8_base/deps/v8/src/compiler/js-inlining-heuristic.o.d.raw -D_FORTIFY_SOURCE=2 -march=x86-64 -mtune=generic -O2 -pipe -fstack-protector-strong -c -o /pkg/src/node-v6.11.0/out/Release/obj.target/v8_base/deps/v8/src/compiler/js-inlining-heuristic.o ../deps/v8/src/compiler/js-inlining-heuristic.cc
480  [06/10/2017 12:00AM]:                  from ../deps/v8/src/compiler/js-inlining-heuristic.h:8,
481  [06/10/2017 12:00AM]:                  from ../deps/v8/src/compiler/js-inlining-heuristic.cc:5:
482  [06/10/2017 12:00AM]:   g++ -DV8_TARGET_ARCH_X64 -DENABLE_DISASSEMBLER -DV8_I18N_SUPPORT -DV8_IMMINENT_DEPRECATION_WARNINGS -DICU_UTIL_DATA_IMPL=ICU_UTIL_DATA_STATIC -I../deps/v8 -I../deps -I/usr/include/openssl-1.0  -pthread -Wall -Wextra -Wno-unused-parameter -m64 -fno-strict-aliasing -m64 -fdata-sections -ffunction-sections -O3 -O3 -fno-omit-frame-pointer -fno-rtti -fno-exceptions -std=gnu++0x -MMD -MF /pkg/src/node-v6.11.0/out/Release/.deps//pkg/src/node-v6.11.0/out/Release/obj.target/v8_base/deps/v8/src/compiler/js-intrinsic-lowering.o.d.raw -D_FORTIFY_SOURCE=2 -march=x86-64 -mtune=generic -O2 -pipe -fstack-protector-strong -c -o /pkg/src/node-v6.11.0/out/Release/obj.target/v8_base/deps/v8/src/compiler/js-intrinsic-lowering.o ../deps/v8/src/compiler/js-intrinsic-lowering.cc
483  [06/10/2017 12:00AM]:                  from ../deps/v8/src/compiler/js-intrinsic-lowering.h:9,
484  [06/10/2017 12:00AM]:                  from ../deps/v8/src/compiler/js-intrinsic-lowering.cc:5:
485  [06/10/2017 12:00AM]:                  from ../deps/v8/src/compiler/js-intrinsic-lowering.h:8,
486  [06/10/2017 12:00AM]:   g++ -DV8_TARGET_ARCH_X64 -DENABLE_DISASSEMBLER -DV8_I18N_SUPPORT -DV8_IMMINENT_DEPRECATION_WARNINGS -DICU_UTIL_DATA_IMPL=ICU_UTIL_DATA_STATIC -I../deps/v8 -I../deps -I/usr/include/openssl-1.0  -pthread -Wall -Wextra -Wno-unused-parameter -m64 -fno-strict-aliasing -m64 -fdata-sections -ffunction-sections -O3 -O3 -fno-omit-frame-pointer -fno-rtti -fno-exceptions -std=gnu++0x -MMD -MF /pkg/src/node-v6.11.0/out/Release/.deps//pkg/src/node-v6.11.0/out/Release/obj.target/v8_base/deps/v8/src/compiler/js-native-context-specialization.o.d.raw -D_FORTIFY_SOURCE=2 -march=x86-64 -mtune=generic -O2 -pipe -fstack-protector-strong -c -o /pkg/src/node-v6.11.0/out/Release/obj.target/v8_base/deps/v8/src/compiler/js-native-context-specialization.o ../deps/v8/src/compiler/js-native-context-specialization.cc
487  [06/10/2017 12:00AM]:                  from ../deps/v8/src/compiler/js-native-context-specialization.h:9,
488  [06/10/2017 12:00AM]:                  from ../deps/v8/src/compiler/js-native-context-specialization.cc:5:
489  [06/10/2017 12:00AM]:   g++ -DV8_TARGET_ARCH_X64 -DENABLE_DISASSEMBLER -DV8_I18N_SUPPORT -DV8_IMMINENT_DEPRECATION_WARNINGS -DICU_UTIL_DATA_IMPL=ICU_UTIL_DATA_STATIC -I../deps/v8 -I../deps -I/usr/include/openssl-1.0  -pthread -Wall -Wextra -Wno-unused-parameter -m64 -fno-strict-aliasing -m64 -fdata-sections -ffunction-sections -O3 -O3 -fno-omit-frame-pointer -fno-rtti -fno-exceptions -std=gnu++0x -MMD -MF /pkg/src/node-v6.11.0/out/Release/.deps//pkg/src/node-v6.11.0/out/Release/obj.target/v8_base/deps/v8/src/compiler/js-operator.o.d.raw -D_FORTIFY_SOURCE=2 -march=x86-64 -mtune=generic -O2 -pipe -fstack-protector-strong -c -o /pkg/src/node-v6.11.0/out/Release/obj.target/v8_base/deps/v8/src/compiler/js-operator.o ../deps/v8/src/compiler/js-operator.cc
490  [06/10/2017 12:00AM]:                  from ../deps/v8/src/compiler/js-operator.cc:5:
491  [06/10/2017 12:00AM]: In file included from ../deps/v8/src/utils.h:13:0,
492  [06/10/2017 12:00AM]:                  from ../deps/v8/src/compiler/type-hints.h:9,
493  [06/10/2017 12:00AM]:                  from ../deps/v8/src/compiler/js-operator.h:8,
494  [06/10/2017 12:00AM]:   g++ -DV8_TARGET_ARCH_X64 -DENABLE_DISASSEMBLER -DV8_I18N_SUPPORT -DV8_IMMINENT_DEPRECATION_WARNINGS -DICU_UTIL_DATA_IMPL=ICU_UTIL_DATA_STATIC -I../deps/v8 -I../deps -I/usr/include/openssl-1.0  -pthread -Wall -Wextra -Wno-unused-parameter -m64 -fno-strict-aliasing -m64 -fdata-sections -ffunction-sections -O3 -O3 -fno-omit-frame-pointer -fno-rtti -fno-exceptions -std=gnu++0x -MMD -MF /pkg/src/node-v6.11.0/out/Release/.deps//pkg/src/node-v6.11.0/out/Release/obj.target/v8_base/deps/v8/src/compiler/js-typed-lowering.o.d.raw -D_FORTIFY_SOURCE=2 -march=x86-64 -mtune=generic -O2 -pipe -fstack-protector-strong -c -o /pkg/src/node-v6.11.0/out/Release/obj.target/v8_base/deps/v8/src/compiler/js-typed-lowering.o ../deps/v8/src/compiler/js-typed-lowering.cc
495  [06/10/2017 12:00AM]:                  from ../deps/v8/src/compiler/js-typed-lowering.cc:5:
496  [06/10/2017 12:00AM]:   g++ -DV8_TARGET_ARCH_X64 -DENABLE_DISASSEMBLER -DV8_I18N_SUPPORT -DV8_IMMINENT_DEPRECATION_WARNINGS -DICU_UTIL_DATA_IMPL=ICU_UTIL_DATA_STATIC -I../deps/v8 -I../deps -I/usr/include/openssl-1.0  -pthread -Wall -Wextra -Wno-unused-parameter -m64 -fno-strict-aliasing -m64 -fdata-sections -ffunction-sections -O3 -O3 -fno-omit-frame-pointer -fno-rtti -fno-exceptions -std=gnu++0x -MMD -MF /pkg/src/node-v6.11.0/out/Release/.deps//pkg/src/node-v6.11.0/out/Release/obj.target/v8_base/deps/v8/src/compiler/jump-threading.o.d.raw -D_FORTIFY_SOURCE=2 -march=x86-64 -mtune=generic -O2 -pipe -fstack-protector-strong -c -o /pkg/src/node-v6.11.0/out/Release/obj.target/v8_base/deps/v8/src/compiler/jump-threading.o ../deps/v8/src/compiler/jump-threading.cc
497  [06/10/2017 12:00AM]:                  from ../deps/v8/src/compiler/jump-threading.h:8,
498  [06/10/2017 12:00AM]:                  from ../deps/v8/src/compiler/jump-threading.cc:5:
499  [06/10/2017 12:00AM]:   g++ -DV8_TARGET_ARCH_X64 -DENABLE_DISASSEMBLER -DV8_I18N_SUPPORT -DV8_IMMINENT_DEPRECATION_WARNINGS -DICU_UTIL_DATA_IMPL=ICU_UTIL_DATA_STATIC -I../deps/v8 -I../deps -I/usr/include/openssl-1.0  -pthread -Wall -Wextra -Wno-unused-parameter -m64 -fno-strict-aliasing -m64 -fdata-sections -ffunction-sections -O3 -O3 -fno-omit-frame-pointer -fno-rtti -fno-exceptions -std=gnu++0x -MMD -MF /pkg/src/node-v6.11.0/out/Release/.deps//pkg/src/node-v6.11.0/out/Release/obj.target/v8_base/deps/v8/src/compiler/linkage.o.d.raw -D_FORTIFY_SOURCE=2 -march=x86-64 -mtune=generic -O2 -pipe -fstack-protector-strong -c -o /pkg/src/node-v6.11.0/out/Release/obj.target/v8_base/deps/v8/src/compiler/linkage.o ../deps/v8/src/compiler/linkage.cc
500  [06/10/2017 12:00AM]:                  from ../deps/v8/src/compiler/linkage.cc:5:
501  [06/10/2017 12:00AM]:   g++ -DV8_TARGET_ARCH_X64 -DENABLE_DISASSEMBLER -DV8_I18N_SUPPORT -DV8_IMMINENT_DEPRECATION_WARNINGS -DICU_UTIL_DATA_IMPL=ICU_UTIL_DATA_STATIC -I../deps/v8 -I../deps -I/usr/include/openssl-1.0  -pthread -Wall -Wextra -Wno-unused-parameter -m64 -fno-strict-aliasing -m64 -fdata-sections -ffunction-sections -O3 -O3 -fno-omit-frame-pointer -fno-rtti -fno-exceptions -std=gnu++0x -MMD -MF /pkg/src/node-v6.11.0/out/Release/.deps//pkg/src/node-v6.11.0/out/Release/obj.target/v8_base/deps/v8/src/compiler/liveness-analyzer.o.d.raw -D_FORTIFY_SOURCE=2 -march=x86-64 -mtune=generic -O2 -pipe -fstack-protector-strong -c -o /pkg/src/node-v6.11.0/out/Release/obj.target/v8_base/deps/v8/src/compiler/liveness-analyzer.o ../deps/v8/src/compiler/liveness-analyzer.cc
502  [06/10/2017 12:00AM]:                  from ../deps/v8/src/compiler/liveness-analyzer.cc:6:
503  [06/10/2017 12:00AM]:   g++ -DV8_TARGET_ARCH_X64 -DENABLE_DISASSEMBLER -DV8_I18N_SUPPORT -DV8_IMMINENT_DEPRECATION_WARNINGS -DICU_UTIL_DATA_IMPL=ICU_UTIL_DATA_STATIC -I../deps/v8 -I../deps -I/usr/include/openssl-1.0  -pthread -Wall -Wextra -Wno-unused-parameter -m64 -fno-strict-aliasing -m64 -fdata-sections -ffunction-sections -O3 -O3 -fno-omit-frame-pointer -fno-rtti -fno-exceptions -std=gnu++0x -MMD -MF /pkg/src/node-v6.11.0/out/Release/.deps//pkg/src/node-v6.11.0/out/Release/obj.target/v8_base/deps/v8/src/compiler/live-range-separator.o.d.raw -D_FORTIFY_SOURCE=2 -march=x86-64 -mtune=generic -O2 -pipe -fstack-protector-strong -c -o /pkg/src/node-v6.11.0/out/Release/obj.target/v8_base/deps/v8/src/compiler/live-range-separator.o ../deps/v8/src/compiler/live-range-separator.cc
504  [06/10/2017 12:00AM]:                  from ../deps/v8/src/compiler/live-range-separator.cc:6:
505  [06/10/2017 12:00AM]:                  from ../deps/v8/src/compiler/live-range-separator.h:9,
506  [06/10/2017 12:00AM]:                  from ../deps/v8/src/compiler/live-range-separator.cc:5:
507  [06/10/2017 12:00AM]:   g++ -DV8_TARGET_ARCH_X64 -DENABLE_DISASSEMBLER -DV8_I18N_SUPPORT -DV8_IMMINENT_DEPRECATION_WARNINGS -DICU_UTIL_DATA_IMPL=ICU_UTIL_DATA_STATIC -I../deps/v8 -I../deps -I/usr/include/openssl-1.0  -pthread -Wall -Wextra -Wno-unused-parameter -m64 -fno-strict-aliasing -m64 -fdata-sections -ffunction-sections -O3 -O3 -fno-omit-frame-pointer -fno-rtti -fno-exceptions -std=gnu++0x -MMD -MF /pkg/src/node-v6.11.0/out/Release/.deps//pkg/src/node-v6.11.0/out/Release/obj.target/v8_base/deps/v8/src/compiler/load-elimination.o.d.raw -D_FORTIFY_SOURCE=2 -march=x86-64 -mtune=generic -O2 -pipe -fstack-protector-strong -c -o /pkg/src/node-v6.11.0/out/Release/obj.target/v8_base/deps/v8/src/compiler/load-elimination.o ../deps/v8/src/compiler/load-elimination.cc
508  [06/10/2017 12:00AM]:                  from ../deps/v8/src/compiler/load-elimination.h:8,
509  [06/10/2017 12:00AM]:                  from ../deps/v8/src/compiler/load-elimination.cc:5:
510  [06/10/2017 12:00AM]:   g++ -DV8_TARGET_ARCH_X64 -DENABLE_DISASSEMBLER -DV8_I18N_SUPPORT -DV8_IMMINENT_DEPRECATION_WARNINGS -DICU_UTIL_DATA_IMPL=ICU_UTIL_DATA_STATIC -I../deps/v8 -I../deps -I/usr/include/openssl-1.0  -pthread -Wall -Wextra -Wno-unused-parameter -m64 -fno-strict-aliasing -m64 -fdata-sections -ffunction-sections -O3 -O3 -fno-omit-frame-pointer -fno-rtti -fno-exceptions -std=gnu++0x -MMD -MF /pkg/src/node-v6.11.0/out/Release/.deps//pkg/src/node-v6.11.0/out/Release/obj.target/v8_base/deps/v8/src/compiler/loop-analysis.o.d.raw -D_FORTIFY_SOURCE=2 -march=x86-64 -mtune=generic -O2 -pipe -fstack-protector-strong -c -o /pkg/src/node-v6.11.0/out/Release/obj.target/v8_base/deps/v8/src/compiler/loop-analysis.o ../deps/v8/src/compiler/loop-analysis.cc
511  [06/10/2017 12:00AM]:                  from ../deps/v8/src/compiler/loop-analysis.h:10,
512  [06/10/2017 12:00AM]:                  from ../deps/v8/src/compiler/loop-analysis.cc:5:
513  [06/10/2017 12:00AM]:                  from ../deps/v8/src/compiler/loop-analysis.h:9,
514  [06/10/2017 12:00AM]:   g++ -DV8_TARGET_ARCH_X64 -DENABLE_DISASSEMBLER -DV8_I18N_SUPPORT -DV8_IMMINENT_DEPRECATION_WARNINGS -DICU_UTIL_DATA_IMPL=ICU_UTIL_DATA_STATIC -I../deps/v8 -I../deps -I/usr/include/openssl-1.0  -pthread -Wall -Wextra -Wno-unused-parameter -m64 -fno-strict-aliasing -m64 -fdata-sections -ffunction-sections -O3 -O3 -fno-omit-frame-pointer -fno-rtti -fno-exceptions -std=gnu++0x -MMD -MF /pkg/src/node-v6.11.0/out/Release/.deps//pkg/src/node-v6.11.0/out/Release/obj.target/v8_base/deps/v8/src/compiler/loop-peeling.o.d.raw -D_FORTIFY_SOURCE=2 -march=x86-64 -mtune=generic -O2 -pipe -fstack-protector-strong -c -o /pkg/src/node-v6.11.0/out/Release/obj.target/v8_base/deps/v8/src/compiler/loop-peeling.o ../deps/v8/src/compiler/loop-peeling.cc
515  [06/10/2017 12:00AM]:                  from ../deps/v8/src/compiler/loop-peeling.h:8,
516  [06/10/2017 12:00AM]:                  from ../deps/v8/src/compiler/loop-peeling.cc:7:
517  [06/10/2017 12:00AM]:                  from ../deps/v8/src/compiler/loop-peeling.cc:5:
518  [06/10/2017 12:00AM]:   g++ -DV8_TARGET_ARCH_X64 -DENABLE_DISASSEMBLER -DV8_I18N_SUPPORT -DV8_IMMINENT_DEPRECATION_WARNINGS -DICU_UTIL_DATA_IMPL=ICU_UTIL_DATA_STATIC -I../deps/v8 -I../deps -I/usr/include/openssl-1.0  -pthread -Wall -Wextra -Wno-unused-parameter -m64 -fno-strict-aliasing -m64 -fdata-sections -ffunction-sections -O3 -O3 -fno-omit-frame-pointer -fno-rtti -fno-exceptions -std=gnu++0x -MMD -MF /pkg/src/node-v6.11.0/out/Release/.deps//pkg/src/node-v6.11.0/out/Release/obj.target/v8_base/deps/v8/src/compiler/machine-operator-reducer.o.d.raw -D_FORTIFY_SOURCE=2 -march=x86-64 -mtune=generic -O2 -pipe -fstack-protector-strong -c -o /pkg/src/node-v6.11.0/out/Release/obj.target/v8_base/deps/v8/src/compiler/machine-operator-reducer.o ../deps/v8/src/compiler/machine-operator-reducer.cc
519  [06/10/2017 12:00AM]:                  from ../deps/v8/src/compiler/machine-operator-reducer.h:8,
520  [06/10/2017 12:00AM]:                  from ../deps/v8/src/compiler/machine-operator-reducer.cc:5:
521  [06/10/2017 12:00AM]:   g++ -DV8_TARGET_ARCH_X64 -DENABLE_DISASSEMBLER -DV8_I18N_SUPPORT -DV8_IMMINENT_DEPRECATION_WARNINGS -DICU_UTIL_DATA_IMPL=ICU_UTIL_DATA_STATIC -I../deps/v8 -I../deps -I/usr/include/openssl-1.0  -pthread -Wall -Wextra -Wno-unused-parameter -m64 -fno-strict-aliasing -m64 -fdata-sections -ffunction-sections -O3 -O3 -fno-omit-frame-pointer -fno-rtti -fno-exceptions -std=gnu++0x -MMD -MF /pkg/src/node-v6.11.0/out/Release/.deps//pkg/src/node-v6.11.0/out/Release/obj.target/v8_base/deps/v8/src/compiler/machine-operator.o.d.raw -D_FORTIFY_SOURCE=2 -march=x86-64 -mtune=generic -O2 -pipe -fstack-protector-strong -c -o /pkg/src/node-v6.11.0/out/Release/obj.target/v8_base/deps/v8/src/compiler/machine-operator.o ../deps/v8/src/compiler/machine-operator.cc
522  [06/10/2017 12:00AM]:   g++ -DV8_TARGET_ARCH_X64 -DENABLE_DISASSEMBLER -DV8_I18N_SUPPORT -DV8_IMMINENT_DEPRECATION_WARNINGS -DICU_UTIL_DATA_IMPL=ICU_UTIL_DATA_STATIC -I../deps/v8 -I../deps -I/usr/include/openssl-1.0  -pthread -Wall -Wextra -Wno-unused-parameter -m64 -fno-strict-aliasing -m64 -fdata-sections -ffunction-sections -O3 -O3 -fno-omit-frame-pointer -fno-rtti -fno-exceptions -std=gnu++0x -MMD -MF /pkg/src/node-v6.11.0/out/Release/.deps//pkg/src/node-v6.11.0/out/Release/obj.target/v8_base/deps/v8/src/compiler/move-optimizer.o.d.raw -D_FORTIFY_SOURCE=2 -march=x86-64 -mtune=generic -O2 -pipe -fstack-protector-strong -c -o /pkg/src/node-v6.11.0/out/Release/obj.target/v8_base/deps/v8/src/compiler/move-optimizer.o ../deps/v8/src/compiler/move-optimizer.cc
523  [06/10/2017 12:00AM]:                  from ../deps/v8/src/compiler/move-optimizer.h:8,
524  [06/10/2017 12:00AM]:                  from ../deps/v8/src/compiler/move-optimizer.cc:5:
525  [06/10/2017 12:01AM]:   g++ -DV8_TARGET_ARCH_X64 -DENABLE_DISASSEMBLER -DV8_I18N_SUPPORT -DV8_IMMINENT_DEPRECATION_WARNINGS -DICU_UTIL_DATA_IMPL=ICU_UTIL_DATA_STATIC -I../deps/v8 -I../deps -I/usr/include/openssl-1.0  -pthread -Wall -Wextra -Wno-unused-parameter -m64 -fno-strict-aliasing -m64 -fdata-sections -ffunction-sections -O3 -O3 -fno-omit-frame-pointer -fno-rtti -fno-exceptions -std=gnu++0x -MMD -MF /pkg/src/node-v6.11.0/out/Release/.deps//pkg/src/node-v6.11.0/out/Release/obj.target/v8_base/deps/v8/src/compiler/node-cache.o.d.raw -D_FORTIFY_SOURCE=2 -march=x86-64 -mtune=generic -O2 -pipe -fstack-protector-strong -c -o /pkg/src/node-v6.11.0/out/Release/obj.target/v8_base/deps/v8/src/compiler/node-cache.o ../deps/v8/src/compiler/node-cache.cc
526  [06/10/2017 12:01AM]:   g++ -DV8_TARGET_ARCH_X64 -DENABLE_DISASSEMBLER -DV8_I18N_SUPPORT -DV8_IMMINENT_DEPRECATION_WARNINGS -DICU_UTIL_DATA_IMPL=ICU_UTIL_DATA_STATIC -I../deps/v8 -I../deps -I/usr/include/openssl-1.0  -pthread -Wall -Wextra -Wno-unused-parameter -m64 -fno-strict-aliasing -m64 -fdata-sections -ffunction-sections -O3 -O3 -fno-omit-frame-pointer -fno-rtti -fno-exceptions -std=gnu++0x -MMD -MF /pkg/src/node-v6.11.0/out/Release/.deps//pkg/src/node-v6.11.0/out/Release/obj.target/v8_base/deps/v8/src/compiler/node-marker.o.d.raw -D_FORTIFY_SOURCE=2 -march=x86-64 -mtune=generic -O2 -pipe -fstack-protector-strong -c -o /pkg/src/node-v6.11.0/out/Release/obj.target/v8_base/deps/v8/src/compiler/node-marker.o ../deps/v8/src/compiler/node-marker.cc
527  [06/10/2017 12:01AM]:                  from ../deps/v8/src/compiler/node-marker.cc:5:
528  [06/10/2017 12:01AM]:   g++ -DV8_TARGET_ARCH_X64 -DENABLE_DISASSEMBLER -DV8_I18N_SUPPORT -DV8_IMMINENT_DEPRECATION_WARNINGS -DICU_UTIL_DATA_IMPL=ICU_UTIL_DATA_STATIC -I../deps/v8 -I../deps -I/usr/include/openssl-1.0  -pthread -Wall -Wextra -Wno-unused-parameter -m64 -fno-strict-aliasing -m64 -fdata-sections -ffunction-sections -O3 -O3 -fno-omit-frame-pointer -fno-rtti -fno-exceptions -std=gnu++0x -MMD -MF /pkg/src/node-v6.11.0/out/Release/.deps//pkg/src/node-v6.11.0/out/Release/obj.target/v8_base/deps/v8/src/compiler/node-matchers.o.d.raw -D_FORTIFY_SOURCE=2 -march=x86-64 -mtune=generic -O2 -pipe -fstack-protector-strong -c -o /pkg/src/node-v6.11.0/out/Release/obj.target/v8_base/deps/v8/src/compiler/node-matchers.o ../deps/v8/src/compiler/node-matchers.cc
529  [06/10/2017 12:01AM]:                  from ../deps/v8/src/compiler/node-matchers.h:11,
530  [06/10/2017 12:01AM]:                  from ../deps/v8/src/compiler/node-matchers.cc:5:
531  [06/10/2017 12:01AM]:   g++ -DV8_TARGET_ARCH_X64 -DENABLE_DISASSEMBLER -DV8_I18N_SUPPORT -DV8_IMMINENT_DEPRECATION_WARNINGS -DICU_UTIL_DATA_IMPL=ICU_UTIL_DATA_STATIC -I../deps/v8 -I../deps -I/usr/include/openssl-1.0  -pthread -Wall -Wextra -Wno-unused-parameter -m64 -fno-strict-aliasing -m64 -fdata-sections -ffunction-sections -O3 -O3 -fno-omit-frame-pointer -fno-rtti -fno-exceptions -std=gnu++0x -MMD -MF /pkg/src/node-v6.11.0/out/Release/.deps//pkg/src/node-v6.11.0/out/Release/obj.target/v8_base/deps/v8/src/compiler/node-properties.o.d.raw -D_FORTIFY_SOURCE=2 -march=x86-64 -mtune=generic -O2 -pipe -fstack-protector-strong -c -o /pkg/src/node-v6.11.0/out/Release/obj.target/v8_base/deps/v8/src/compiler/node-properties.o ../deps/v8/src/compiler/node-properties.cc
532  [06/10/2017 12:01AM]:                  from ../deps/v8/src/compiler/node-properties.cc:7:
533  [06/10/2017 12:01AM]:                  from ../deps/v8/src/compiler/node-properties.cc:5:
534  [06/10/2017 12:01AM]:   g++ -DV8_TARGET_ARCH_X64 -DENABLE_DISASSEMBLER -DV8_I18N_SUPPORT -DV8_IMMINENT_DEPRECATION_WARNINGS -DICU_UTIL_DATA_IMPL=ICU_UTIL_DATA_STATIC -I../deps/v8 -I../deps -I/usr/include/openssl-1.0  -pthread -Wall -Wextra -Wno-unused-parameter -m64 -fno-strict-aliasing -m64 -fdata-sections -ffunction-sections -O3 -O3 -fno-omit-frame-pointer -fno-rtti -fno-exceptions -std=gnu++0x -MMD -MF /pkg/src/node-v6.11.0/out/Release/.deps//pkg/src/node-v6.11.0/out/Release/obj.target/v8_base/deps/v8/src/compiler/node.o.d.raw -D_FORTIFY_SOURCE=2 -march=x86-64 -mtune=generic -O2 -pipe -fstack-protector-strong -c -o /pkg/src/node-v6.11.0/out/Release/obj.target/v8_base/deps/v8/src/compiler/node.o ../deps/v8/src/compiler/node.cc
535  [06/10/2017 12:01AM]:                  from ../deps/v8/src/compiler/node.cc:5:
536  [06/10/2017 12:01AM]:   g++ -DV8_TARGET_ARCH_X64 -DENABLE_DISASSEMBLER -DV8_I18N_SUPPORT -DV8_IMMINENT_DEPRECATION_WARNINGS -DICU_UTIL_DATA_IMPL=ICU_UTIL_DATA_STATIC -I../deps/v8 -I../deps -I/usr/include/openssl-1.0  -pthread -Wall -Wextra -Wno-unused-parameter -m64 -fno-strict-aliasing -m64 -fdata-sections -ffunction-sections -O3 -O3 -fno-omit-frame-pointer -fno-rtti -fno-exceptions -std=gnu++0x -MMD -MF /pkg/src/node-v6.11.0/out/Release/.deps//pkg/src/node-v6.11.0/out/Release/obj.target/v8_base/deps/v8/src/compiler/opcodes.o.d.raw -D_FORTIFY_SOURCE=2 -march=x86-64 -mtune=generic -O2 -pipe -fstack-protector-strong -c -o /pkg/src/node-v6.11.0/out/Release/obj.target/v8_base/deps/v8/src/compiler/opcodes.o ../deps/v8/src/compiler/opcodes.cc
537  [06/10/2017 12:01AM]:   g++ -DV8_TARGET_ARCH_X64 -DENABLE_DISASSEMBLER -DV8_I18N_SUPPORT -DV8_IMMINENT_DEPRECATION_WARNINGS -DICU_UTIL_DATA_IMPL=ICU_UTIL_DATA_STATIC -I../deps/v8 -I../deps -I/usr/include/openssl-1.0  -pthread -Wall -Wextra -Wno-unused-parameter -m64 -fno-strict-aliasing -m64 -fdata-sections -ffunction-sections -O3 -O3 -fno-omit-frame-pointer -fno-rtti -fno-exceptions -std=gnu++0x -MMD -MF /pkg/src/node-v6.11.0/out/Release/.deps//pkg/src/node-v6.11.0/out/Release/obj.target/v8_base/deps/v8/src/compiler/operator-properties.o.d.raw -D_FORTIFY_SOURCE=2 -march=x86-64 -mtune=generic -O2 -pipe -fstack-protector-strong -c -o /pkg/src/node-v6.11.0/out/Release/obj.target/v8_base/deps/v8/src/compiler/operator-properties.o ../deps/v8/src/compiler/operator-properties.cc
538  [06/10/2017 12:01AM]:                  from ../deps/v8/src/compiler/operator-properties.cc:7:
539  [06/10/2017 12:01AM]:   g++ -DV8_TARGET_ARCH_X64 -DENABLE_DISASSEMBLER -DV8_I18N_SUPPORT -DV8_IMMINENT_DEPRECATION_WARNINGS -DICU_UTIL_DATA_IMPL=ICU_UTIL_DATA_STATIC -I../deps/v8 -I../deps -I/usr/include/openssl-1.0  -pthread -Wall -Wextra -Wno-unused-parameter -m64 -fno-strict-aliasing -m64 -fdata-sections -ffunction-sections -O3 -O3 -fno-omit-frame-pointer -fno-rtti -fno-exceptions -std=gnu++0x -MMD -MF /pkg/src/node-v6.11.0/out/Release/.deps//pkg/src/node-v6.11.0/out/Release/obj.target/v8_base/deps/v8/src/compiler/operator.o.d.raw -D_FORTIFY_SOURCE=2 -march=x86-64 -mtune=generic -O2 -pipe -fstack-protector-strong -c -o /pkg/src/node-v6.11.0/out/Release/obj.target/v8_base/deps/v8/src/compiler/operator.o ../deps/v8/src/compiler/operator.cc
540  [06/10/2017 12:01AM]:   g++ -DV8_TARGET_ARCH_X64 -DENABLE_DISASSEMBLER -DV8_I18N_SUPPORT -DV8_IMMINENT_DEPRECATION_WARNINGS -DICU_UTIL_DATA_IMPL=ICU_UTIL_DATA_STATIC -I../deps/v8 -I../deps -I/usr/include/openssl-1.0  -pthread -Wall -Wextra -Wno-unused-parameter -m64 -fno-strict-aliasing -m64 -fdata-sections -ffunction-sections -O3 -O3 -fno-omit-frame-pointer -fno-rtti -fno-exceptions -std=gnu++0x -MMD -MF /pkg/src/node-v6.11.0/out/Release/.deps//pkg/src/node-v6.11.0/out/Release/obj.target/v8_base/deps/v8/src/compiler/osr.o.d.raw -D_FORTIFY_SOURCE=2 -march=x86-64 -mtune=generic -O2 -pipe -fstack-protector-strong -c -o /pkg/src/node-v6.11.0/out/Release/obj.target/v8_base/deps/v8/src/compiler/osr.o ../deps/v8/src/compiler/osr.cc
541  [06/10/2017 12:01AM]:                  from ../deps/v8/src/compiler/osr.cc:5:
542  [06/10/2017 12:01AM]:   g++ -DV8_TARGET_ARCH_X64 -DENABLE_DISASSEMBLER -DV8_I18N_SUPPORT -DV8_IMMINENT_DEPRECATION_WARNINGS -DICU_UTIL_DATA_IMPL=ICU_UTIL_DATA_STATIC -I../deps/v8 -I../deps -I/usr/include/openssl-1.0  -pthread -Wall -Wextra -Wno-unused-parameter -m64 -fno-strict-aliasing -m64 -fdata-sections -ffunction-sections -O3 -O3 -fno-omit-frame-pointer -fno-rtti -fno-exceptions -std=gnu++0x -MMD -MF /pkg/src/node-v6.11.0/out/Release/.deps//pkg/src/node-v6.11.0/out/Release/obj.target/v8_base/deps/v8/src/compiler/pipeline.o.d.raw -D_FORTIFY_SOURCE=2 -march=x86-64 -mtune=generic -O2 -pipe -fstack-protector-strong -c -o /pkg/src/node-v6.11.0/out/Release/obj.target/v8_base/deps/v8/src/compiler/pipeline.o ../deps/v8/src/compiler/pipeline.cc
543  [06/10/2017 12:01AM]: In file included from ../deps/v8/src/compiler/pipeline.h:10:0,
544  [06/10/2017 12:01AM]:                  from ../deps/v8/src/compiler/pipeline.cc:5:
545  [06/10/2017 12:01AM]:                  from ../deps/v8/src/objects.h:15,
546  [06/10/2017 12:01AM]:                  from ../deps/v8/src/compiler/pipeline.h:10,
547  [06/10/2017 12:01AM]:   g++ -DV8_TARGET_ARCH_X64 -DENABLE_DISASSEMBLER -DV8_I18N_SUPPORT -DV8_IMMINENT_DEPRECATION_WARNINGS -DICU_UTIL_DATA_IMPL=ICU_UTIL_DATA_STATIC -I../deps/v8 -I../deps -I/usr/include/openssl-1.0  -pthread -Wall -Wextra -Wno-unused-parameter -m64 -fno-strict-aliasing -m64 -fdata-sections -ffunction-sections -O3 -O3 -fno-omit-frame-pointer -fno-rtti -fno-exceptions -std=gnu++0x -MMD -MF /pkg/src/node-v6.11.0/out/Release/.deps//pkg/src/node-v6.11.0/out/Release/obj.target/v8_base/deps/v8/src/compiler/pipeline-statistics.o.d.raw -D_FORTIFY_SOURCE=2 -march=x86-64 -mtune=generic -O2 -pipe -fstack-protector-strong -c -o /pkg/src/node-v6.11.0/out/Release/obj.target/v8_base/deps/v8/src/compiler/pipeline-statistics.o ../deps/v8/src/compiler/pipeline-statistics.cc
548  [06/10/2017 12:01AM]:                  from ../deps/v8/src/compiler/pipeline-statistics.cc:5:
549  [06/10/2017 12:01AM]:   g++ -DV8_TARGET_ARCH_X64 -DENABLE_DISASSEMBLER -DV8_I18N_SUPPORT -DV8_IMMINENT_DEPRECATION_WARNINGS -DICU_UTIL_DATA_IMPL=ICU_UTIL_DATA_STATIC -I../deps/v8 -I../deps -I/usr/include/openssl-1.0  -pthread -Wall -Wextra -Wno-unused-parameter -m64 -fno-strict-aliasing -m64 -fdata-sections -ffunction-sections -O3 -O3 -fno-omit-frame-pointer -fno-rtti -fno-exceptions -std=gnu++0x -MMD -MF /pkg/src/node-v6.11.0/out/Release/.deps//pkg/src/node-v6.11.0/out/Release/obj.target/v8_base/deps/v8/src/compiler/raw-machine-assembler.o.d.raw -D_FORTIFY_SOURCE=2 -march=x86-64 -mtune=generic -O2 -pipe -fstack-protector-strong -c -o /pkg/src/node-v6.11.0/out/Release/obj.target/v8_base/deps/v8/src/compiler/raw-machine-assembler.o ../deps/v8/src/compiler/raw-machine-assembler.cc
550  [06/10/2017 12:01AM]:                  from ../deps/v8/src/compiler/raw-machine-assembler.h:8,
551  [06/10/2017 12:01AM]:                  from ../deps/v8/src/compiler/raw-machine-assembler.cc:5:
552  [06/10/2017 12:01AM]:   g++ -DV8_TARGET_ARCH_X64 -DENABLE_DISASSEMBLER -DV8_I18N_SUPPORT -DV8_IMMINENT_DEPRECATION_WARNINGS -DICU_UTIL_DATA_IMPL=ICU_UTIL_DATA_STATIC -I../deps/v8 -I../deps -I/usr/include/openssl-1.0  -pthread -Wall -Wextra -Wno-unused-parameter -m64 -fno-strict-aliasing -m64 -fdata-sections -ffunction-sections -O3 -O3 -fno-omit-frame-pointer -fno-rtti -fno-exceptions -std=gnu++0x -MMD -MF /pkg/src/node-v6.11.0/out/Release/.deps//pkg/src/node-v6.11.0/out/Release/obj.target/v8_base/deps/v8/src/compiler/register-allocator.o.d.raw -D_FORTIFY_SOURCE=2 -march=x86-64 -mtune=generic -O2 -pipe -fstack-protector-strong -c -o /pkg/src/node-v6.11.0/out/Release/obj.target/v8_base/deps/v8/src/compiler/register-allocator.o ../deps/v8/src/compiler/register-allocator.cc
553  [06/10/2017 12:01AM]:                  from ../deps/v8/src/compiler/linkage.h:9,
554  [06/10/2017 12:01AM]:                  from ../deps/v8/src/compiler/register-allocator.cc:6:
555  [06/10/2017 12:01AM]:   g++ -DV8_TARGET_ARCH_X64 -DENABLE_DISASSEMBLER -DV8_I18N_SUPPORT -DV8_IMMINENT_DEPRECATION_WARNINGS -DICU_UTIL_DATA_IMPL=ICU_UTIL_DATA_STATIC -I../deps/v8 -I../deps -I/usr/include/openssl-1.0  -pthread -Wall -Wextra -Wno-unused-parameter -m64 -fno-strict-aliasing -m64 -fdata-sections -ffunction-sections -O3 -O3 -fno-omit-frame-pointer -fno-rtti -fno-exceptions -std=gnu++0x -MMD -MF /pkg/src/node-v6.11.0/out/Release/.deps//pkg/src/node-v6.11.0/out/Release/obj.target/v8_base/deps/v8/src/compiler/register-allocator-verifier.o.d.raw -D_FORTIFY_SOURCE=2 -march=x86-64 -mtune=generic -O2 -pipe -fstack-protector-strong -c -o /pkg/src/node-v6.11.0/out/Release/obj.target/v8_base/deps/v8/src/compiler/register-allocator-verifier.o ../deps/v8/src/compiler/register-allocator-verifier.cc
556  [06/10/2017 12:01AM]:                  from ../deps/v8/src/compiler/register-allocator-verifier.cc:6:
557  [06/10/2017 12:01AM]:                  from ../deps/v8/src/compiler/register-allocator-verifier.cc:5:
558  [06/10/2017 12:01AM]:   g++ -DV8_TARGET_ARCH_X64 -DENABLE_DISASSEMBLER -DV8_I18N_SUPPORT -DV8_IMMINENT_DEPRECATION_WARNINGS -DICU_UTIL_DATA_IMPL=ICU_UTIL_DATA_STATIC -I../deps/v8 -I../deps -I/usr/include/openssl-1.0  -pthread -Wall -Wextra -Wno-unused-parameter -m64 -fno-strict-aliasing -m64 -fdata-sections -ffunction-sections -O3 -O3 -fno-omit-frame-pointer -fno-rtti -fno-exceptions -std=gnu++0x -MMD -MF /pkg/src/node-v6.11.0/out/Release/.deps//pkg/src/node-v6.11.0/out/Release/obj.target/v8_base/deps/v8/src/compiler/representation-change.o.d.raw -D_FORTIFY_SOURCE=2 -march=x86-64 -mtune=generic -O2 -pipe -fstack-protector-strong -c -o /pkg/src/node-v6.11.0/out/Release/obj.target/v8_base/deps/v8/src/compiler/representation-change.o ../deps/v8/src/compiler/representation-change.cc
559  [06/10/2017 12:01AM]:                  from ../deps/v8/src/compiler/representation-change.h:8,
560  [06/10/2017 12:01AM]:                  from ../deps/v8/src/compiler/representation-change.cc:5:
561  [06/10/2017 12:01AM]:   g++ -DV8_TARGET_ARCH_X64 -DENABLE_DISASSEMBLER -DV8_I18N_SUPPORT -DV8_IMMINENT_DEPRECATION_WARNINGS -DICU_UTIL_DATA_IMPL=ICU_UTIL_DATA_STATIC -I../deps/v8 -I../deps -I/usr/include/openssl-1.0  -pthread -Wall -Wextra -Wno-unused-parameter -m64 -fno-strict-aliasing -m64 -fdata-sections -ffunction-sections -O3 -O3 -fno-omit-frame-pointer -fno-rtti -fno-exceptions -std=gnu++0x -MMD -MF /pkg/src/node-v6.11.0/out/Release/.deps//pkg/src/node-v6.11.0/out/Release/obj.target/v8_base/deps/v8/src/compiler/schedule.o.d.raw -D_FORTIFY_SOURCE=2 -march=x86-64 -mtune=generic -O2 -pipe -fstack-protector-strong -c -o /pkg/src/node-v6.11.0/out/Release/obj.target/v8_base/deps/v8/src/compiler/schedule.o ../deps/v8/src/compiler/schedule.cc
562  [06/10/2017 12:01AM]:                  from ../deps/v8/src/compiler/schedule.cc:7:
563  [06/10/2017 12:01AM]:                  from ../deps/v8/src/zone-allocator.h:10,
564  [06/10/2017 12:01AM]:                  from ../deps/v8/src/zone-containers.h:16,
565  [06/10/2017 12:01AM]:                  from ../deps/v8/src/compiler/schedule.h:10,
566  [06/10/2017 12:01AM]:                  from ../deps/v8/src/compiler/schedule.cc:5:
567  [06/10/2017 12:01AM]:   g++ -DV8_TARGET_ARCH_X64 -DENABLE_DISASSEMBLER -DV8_I18N_SUPPORT -DV8_IMMINENT_DEPRECATION_WARNINGS -DICU_UTIL_DATA_IMPL=ICU_UTIL_DATA_STATIC -I../deps/v8 -I../deps -I/usr/include/openssl-1.0  -pthread -Wall -Wextra -Wno-unused-parameter -m64 -fno-strict-aliasing -m64 -fdata-sections -ffunction-sections -O3 -O3 -fno-omit-frame-pointer -fno-rtti -fno-exceptions -std=gnu++0x -MMD -MF /pkg/src/node-v6.11.0/out/Release/.deps//pkg/src/node-v6.11.0/out/Release/obj.target/v8_base/deps/v8/src/compiler/scheduler.o.d.raw -D_FORTIFY_SOURCE=2 -march=x86-64 -mtune=generic -O2 -pipe -fstack-protector-strong -c -o /pkg/src/node-v6.11.0/out/Release/obj.target/v8_base/deps/v8/src/compiler/scheduler.o ../deps/v8/src/compiler/scheduler.cc
568  [06/10/2017 12:01AM]:                  from ../deps/v8/src/compiler/scheduler.h:9,
569  [06/10/2017 12:01AM]:                  from ../deps/v8/src/compiler/scheduler.cc:5:
570  [06/10/2017 12:01AM]:   g++ -DV8_TARGET_ARCH_X64 -DENABLE_DISASSEMBLER -DV8_I18N_SUPPORT -DV8_IMMINENT_DEPRECATION_WARNINGS -DICU_UTIL_DATA_IMPL=ICU_UTIL_DATA_STATIC -I../deps/v8 -I../deps -I/usr/include/openssl-1.0  -pthread -Wall -Wextra -Wno-unused-parameter -m64 -fno-strict-aliasing -m64 -fdata-sections -ffunction-sections -O3 -O3 -fno-omit-frame-pointer -fno-rtti -fno-exceptions -std=gnu++0x -MMD -MF /pkg/src/node-v6.11.0/out/Release/.deps//pkg/src/node-v6.11.0/out/Release/obj.target/v8_base/deps/v8/src/compiler/select-lowering.o.d.raw -D_FORTIFY_SOURCE=2 -march=x86-64 -mtune=generic -O2 -pipe -fstack-protector-strong -c -o /pkg/src/node-v6.11.0/out/Release/obj.target/v8_base/deps/v8/src/compiler/select-lowering.o ../deps/v8/src/compiler/select-lowering.cc
571  [06/10/2017 12:01AM]:                  from ../deps/v8/src/compiler/select-lowering.h:8,
572  [06/10/2017 12:01AM]:                  from ../deps/v8/src/compiler/select-lowering.cc:5:
573  [06/10/2017 12:01AM]:   g++ -DV8_TARGET_ARCH_X64 -DENABLE_DISASSEMBLER -DV8_I18N_SUPPORT -DV8_IMMINENT_DEPRECATION_WARNINGS -DICU_UTIL_DATA_IMPL=ICU_UTIL_DATA_STATIC -I../deps/v8 -I../deps -I/usr/include/openssl-1.0  -pthread -Wall -Wextra -Wno-unused-parameter -m64 -fno-strict-aliasing -m64 -fdata-sections -ffunction-sections -O3 -O3 -fno-omit-frame-pointer -fno-rtti -fno-exceptions -std=gnu++0x -MMD -MF /pkg/src/node-v6.11.0/out/Release/.deps//pkg/src/node-v6.11.0/out/Release/obj.target/v8_base/deps/v8/src/compiler/simplified-lowering.o.d.raw -D_FORTIFY_SOURCE=2 -march=x86-64 -mtune=generic -O2 -pipe -fstack-protector-strong -c -o /pkg/src/node-v6.11.0/out/Release/obj.target/v8_base/deps/v8/src/compiler/simplified-lowering.o ../deps/v8/src/compiler/simplified-lowering.cc
574  [06/10/2017 12:01AM]:                  from ../deps/v8/src/compiler/simplified-lowering.h:8,
575  [06/10/2017 12:01AM]:                  from ../deps/v8/src/compiler/simplified-lowering.cc:5:
576  [06/10/2017 12:01AM]:   g++ -DV8_TARGET_ARCH_X64 -DENABLE_DISASSEMBLER -DV8_I18N_SUPPORT -DV8_IMMINENT_DEPRECATION_WARNINGS -DICU_UTIL_DATA_IMPL=ICU_UTIL_DATA_STATIC -I../deps/v8 -I../deps -I/usr/include/openssl-1.0  -pthread -Wall -Wextra -Wno-unused-parameter -m64 -fno-strict-aliasing -m64 -fdata-sections -ffunction-sections -O3 -O3 -fno-omit-frame-pointer -fno-rtti -fno-exceptions -std=gnu++0x -MMD -MF /pkg/src/node-v6.11.0/out/Release/.deps//pkg/src/node-v6.11.0/out/Release/obj.target/v8_base/deps/v8/src/compiler/simplified-operator-reducer.o.d.raw -D_FORTIFY_SOURCE=2 -march=x86-64 -mtune=generic -O2 -pipe -fstack-protector-strong -c -o /pkg/src/node-v6.11.0/out/Release/obj.target/v8_base/deps/v8/src/compiler/simplified-operator-reducer.o ../deps/v8/src/compiler/simplified-operator-reducer.cc
577  [06/10/2017 12:01AM]:                  from ../deps/v8/src/compiler/simplified-operator-reducer.h:8,
578  [06/10/2017 12:01AM]:                  from ../deps/v8/src/compiler/simplified-operator-reducer.cc:5:
579  [06/10/2017 12:01AM]:   g++ -DV8_TARGET_ARCH_X64 -DENABLE_DISASSEMBLER -DV8_I18N_SUPPORT -DV8_IMMINENT_DEPRECATION_WARNINGS -DICU_UTIL_DATA_IMPL=ICU_UTIL_DATA_STATIC -I../deps/v8 -I../deps -I/usr/include/openssl-1.0  -pthread -Wall -Wextra -Wno-unused-parameter -m64 -fno-strict-aliasing -m64 -fdata-sections -ffunction-sections -O3 -O3 -fno-omit-frame-pointer -fno-rtti -fno-exceptions -std=gnu++0x -MMD -MF /pkg/src/node-v6.11.0/out/Release/.deps//pkg/src/node-v6.11.0/out/Release/obj.target/v8_base/deps/v8/src/compiler/simplified-operator.o.d.raw -D_FORTIFY_SOURCE=2 -march=x86-64 -mtune=generic -O2 -pipe -fstack-protector-strong -c -o /pkg/src/node-v6.11.0/out/Release/obj.target/v8_base/deps/v8/src/compiler/simplified-operator.o ../deps/v8/src/compiler/simplified-operator.cc
580  [06/10/2017 12:01AM]:                  from ../deps/v8/src/compiler/simplified-operator.cc:5:
581  [06/10/2017 12:01AM]:   g++ -DV8_TARGET_ARCH_X64 -DENABLE_DISASSEMBLER -DV8_I18N_SUPPORT -DV8_IMMINENT_DEPRECATION_WARNINGS -DICU_UTIL_DATA_IMPL=ICU_UTIL_DATA_STATIC -I../deps/v8 -I../deps -I/usr/include/openssl-1.0  -pthread -Wall -Wextra -Wno-unused-parameter -m64 -fno-strict-aliasing -m64 -fdata-sections -ffunction-sections -O3 -O3 -fno-omit-frame-pointer -fno-rtti -fno-exceptions -std=gnu++0x -MMD -MF /pkg/src/node-v6.11.0/out/Release/.deps//pkg/src/node-v6.11.0/out/Release/obj.target/v8_base/deps/v8/src/compiler/source-position.o.d.raw -D_FORTIFY_SOURCE=2 -march=x86-64 -mtune=generic -O2 -pipe -fstack-protector-strong -c -o /pkg/src/node-v6.11.0/out/Release/obj.target/v8_base/deps/v8/src/compiler/source-position.o ../deps/v8/src/compiler/source-position.cc
582  [06/10/2017 12:01AM]:                  from ../deps/v8/src/compiler/source-position.h:8,
583  [06/10/2017 12:01AM]:                  from ../deps/v8/src/compiler/source-position.cc:5:
584  [06/10/2017 12:01AM]:   g++ -DV8_TARGET_ARCH_X64 -DENABLE_DISASSEMBLER -DV8_I18N_SUPPORT -DV8_IMMINENT_DEPRECATION_WARNINGS -DICU_UTIL_DATA_IMPL=ICU_UTIL_DATA_STATIC -I../deps/v8 -I../deps -I/usr/include/openssl-1.0  -pthread -Wall -Wextra -Wno-unused-parameter -m64 -fno-strict-aliasing -m64 -fdata-sections -ffunction-sections -O3 -O3 -fno-omit-frame-pointer -fno-rtti -fno-exceptions -std=gnu++0x -MMD -MF /pkg/src/node-v6.11.0/out/Release/.deps//pkg/src/node-v6.11.0/out/Release/obj.target/v8_base/deps/v8/src/compiler/state-values-utils.o.d.raw -D_FORTIFY_SOURCE=2 -march=x86-64 -mtune=generic -O2 -pipe -fstack-protector-strong -c -o /pkg/src/node-v6.11.0/out/Release/obj.target/v8_base/deps/v8/src/compiler/state-values-utils.o ../deps/v8/src/compiler/state-values-utils.cc
585  [06/10/2017 12:01AM]:                  from ../deps/v8/src/compiler/state-values-utils.h:8,
586  [06/10/2017 12:01AM]:                  from ../deps/v8/src/compiler/state-values-utils.cc:5:
587  [06/10/2017 12:01AM]:   g++ -DV8_TARGET_ARCH_X64 -DENABLE_DISASSEMBLER -DV8_I18N_SUPPORT -DV8_IMMINENT_DEPRECATION_WARNINGS -DICU_UTIL_DATA_IMPL=ICU_UTIL_DATA_STATIC -I../deps/v8 -I../deps -I/usr/include/openssl-1.0  -pthread -Wall -Wextra -Wno-unused-parameter -m64 -fno-strict-aliasing -m64 -fdata-sections -ffunction-sections -O3 -O3 -fno-omit-frame-pointer -fno-rtti -fno-exceptions -std=gnu++0x -MMD -MF /pkg/src/node-v6.11.0/out/Release/.deps//pkg/src/node-v6.11.0/out/Release/obj.target/v8_base/deps/v8/src/compiler/tail-call-optimization.o.d.raw -D_FORTIFY_SOURCE=2 -march=x86-64 -mtune=generic -O2 -pipe -fstack-protector-strong -c -o /pkg/src/node-v6.11.0/out/Release/obj.target/v8_base/deps/v8/src/compiler/tail-call-optimization.o ../deps/v8/src/compiler/tail-call-optimization.cc
588  [06/10/2017 12:01AM]:                  from ../deps/v8/src/compiler/tail-call-optimization.h:8,
589  [06/10/2017 12:01AM]:                  from ../deps/v8/src/compiler/tail-call-optimization.cc:5:
590  [06/10/2017 12:01AM]:   g++ -DV8_TARGET_ARCH_X64 -DENABLE_DISASSEMBLER -DV8_I18N_SUPPORT -DV8_IMMINENT_DEPRECATION_WARNINGS -DICU_UTIL_DATA_IMPL=ICU_UTIL_DATA_STATIC -I../deps/v8 -I../deps -I/usr/include/openssl-1.0  -pthread -Wall -Wextra -Wno-unused-parameter -m64 -fno-strict-aliasing -m64 -fdata-sections -ffunction-sections -O3 -O3 -fno-omit-frame-pointer -fno-rtti -fno-exceptions -std=gnu++0x -MMD -MF /pkg/src/node-v6.11.0/out/Release/.deps//pkg/src/node-v6.11.0/out/Release/obj.target/v8_base/deps/v8/src/compiler/type-hint-analyzer.o.d.raw -D_FORTIFY_SOURCE=2 -march=x86-64 -mtune=generic -O2 -pipe -fstack-protector-strong -c -o /pkg/src/node-v6.11.0/out/Release/obj.target/v8_base/deps/v8/src/compiler/type-hint-analyzer.o ../deps/v8/src/compiler/type-hint-analyzer.cc
591  [06/10/2017 12:02AM]:                  from ../deps/v8/src/compiler/type-hint-analyzer.cc:7:
592  [06/10/2017 12:02AM]:                  from ../deps/v8/src/compiler/type-hint-analyzer.h:8,
593  [06/10/2017 12:02AM]:                  from ../deps/v8/src/compiler/type-hint-analyzer.cc:5:
594  [06/10/2017 12:02AM]:   g++ -DV8_TARGET_ARCH_X64 -DENABLE_DISASSEMBLER -DV8_I18N_SUPPORT -DV8_IMMINENT_DEPRECATION_WARNINGS -DICU_UTIL_DATA_IMPL=ICU_UTIL_DATA_STATIC -I../deps/v8 -I../deps -I/usr/include/openssl-1.0  -pthread -Wall -Wextra -Wno-unused-parameter -m64 -fno-strict-aliasing -m64 -fdata-sections -ffunction-sections -O3 -O3 -fno-omit-frame-pointer -fno-rtti -fno-exceptions -std=gnu++0x -MMD -MF /pkg/src/node-v6.11.0/out/Release/.deps//pkg/src/node-v6.11.0/out/Release/obj.target/v8_base/deps/v8/src/compiler/type-hints.o.d.raw -D_FORTIFY_SOURCE=2 -march=x86-64 -mtune=generic -O2 -pipe -fstack-protector-strong -c -o /pkg/src/node-v6.11.0/out/Release/obj.target/v8_base/deps/v8/src/compiler/type-hints.o ../deps/v8/src/compiler/type-hints.cc
595  [06/10/2017 12:02AM]:   g++ -DV8_TARGET_ARCH_X64 -DENABLE_DISASSEMBLER -DV8_I18N_SUPPORT -DV8_IMMINENT_DEPRECATION_WARNINGS -DICU_UTIL_DATA_IMPL=ICU_UTIL_DATA_STATIC -I../deps/v8 -I../deps -I/usr/include/openssl-1.0  -pthread -Wall -Wextra -Wno-unused-parameter -m64 -fno-strict-aliasing -m64 -fdata-sections -ffunction-sections -O3 -O3 -fno-omit-frame-pointer -fno-rtti -fno-exceptions -std=gnu++0x -MMD -MF /pkg/src/node-v6.11.0/out/Release/.deps//pkg/src/node-v6.11.0/out/Release/obj.target/v8_base/deps/v8/src/compiler/typer.o.d.raw -D_FORTIFY_SOURCE=2 -march=x86-64 -mtune=generic -O2 -pipe -fstack-protector-strong -c -o /pkg/src/node-v6.11.0/out/Release/obj.target/v8_base/deps/v8/src/compiler/typer.o ../deps/v8/src/compiler/typer.cc
596  [06/10/2017 12:02AM]:                  from ../deps/v8/src/compiler/typer.h:10,
597  [06/10/2017 12:02AM]:                  from ../deps/v8/src/compiler/typer.cc:5:
598  [06/10/2017 12:02AM]:                  from ../deps/v8/src/compiler/typer.h:9,
599  [06/10/2017 12:02AM]:   g++ -DV8_TARGET_ARCH_X64 -DENABLE_DISASSEMBLER -DV8_I18N_SUPPORT -DV8_IMMINENT_DEPRECATION_WARNINGS -DICU_UTIL_DATA_IMPL=ICU_UTIL_DATA_STATIC -I../deps/v8 -I../deps -I/usr/include/openssl-1.0  -pthread -Wall -Wextra -Wno-unused-parameter -m64 -fno-strict-aliasing -m64 -fdata-sections -ffunction-sections -O3 -O3 -fno-omit-frame-pointer -fno-rtti -fno-exceptions -std=gnu++0x -MMD -MF /pkg/src/node-v6.11.0/out/Release/.deps//pkg/src/node-v6.11.0/out/Release/obj.target/v8_base/deps/v8/src/compiler/value-numbering-reducer.o.d.raw -D_FORTIFY_SOURCE=2 -march=x86-64 -mtune=generic -O2 -pipe -fstack-protector-strong -c -o /pkg/src/node-v6.11.0/out/Release/obj.target/v8_base/deps/v8/src/compiler/value-numbering-reducer.o ../deps/v8/src/compiler/value-numbering-reducer.cc
600  [06/10/2017 12:02AM]:                  from ../deps/v8/src/compiler/value-numbering-reducer.h:8,
601  [06/10/2017 12:02AM]:                  from ../deps/v8/src/compiler/value-numbering-reducer.cc:5:
602  [06/10/2017 12:02AM]:   g++ -DV8_TARGET_ARCH_X64 -DENABLE_DISASSEMBLER -DV8_I18N_SUPPORT -DV8_IMMINENT_DEPRECATION_WARNINGS -DICU_UTIL_DATA_IMPL=ICU_UTIL_DATA_STATIC -I../deps/v8 -I../deps -I/usr/include/openssl-1.0  -pthread -Wall -Wextra -Wno-unused-parameter -m64 -fno-strict-aliasing -m64 -fdata-sections -ffunction-sections -O3 -O3 -fno-omit-frame-pointer -fno-rtti -fno-exceptions -std=gnu++0x -MMD -MF /pkg/src/node-v6.11.0/out/Release/.deps//pkg/src/node-v6.11.0/out/Release/obj.target/v8_base/deps/v8/src/compiler/verifier.o.d.raw -D_FORTIFY_SOURCE=2 -march=x86-64 -mtune=generic -O2 -pipe -fstack-protector-strong -c -o /pkg/src/node-v6.11.0/out/Release/obj.target/v8_base/deps/v8/src/compiler/verifier.o ../deps/v8/src/compiler/verifier.cc
603  [06/10/2017 12:02AM]:                  from ../deps/v8/src/compiler/verifier.cc:14:
604  [06/10/2017 12:02AM]:                  from ../deps/v8/src/compiler/verifier.cc:13:
605  [06/10/2017 12:02AM]:   g++ -DV8_TARGET_ARCH_X64 -DENABLE_DISASSEMBLER -DV8_I18N_SUPPORT -DV8_IMMINENT_DEPRECATION_WARNINGS -DICU_UTIL_DATA_IMPL=ICU_UTIL_DATA_STATIC -I../deps/v8 -I../deps -I/usr/include/openssl-1.0  -pthread -Wall -Wextra -Wno-unused-parameter -m64 -fno-strict-aliasing -m64 -fdata-sections -ffunction-sections -O3 -O3 -fno-omit-frame-pointer -fno-rtti -fno-exceptions -std=gnu++0x -MMD -MF /pkg/src/node-v6.11.0/out/Release/.deps//pkg/src/node-v6.11.0/out/Release/obj.target/v8_base/deps/v8/src/compiler/wasm-compiler.o.d.raw -D_FORTIFY_SOURCE=2 -march=x86-64 -mtune=generic -O2 -pipe -fstack-protector-strong -c -o /pkg/src/node-v6.11.0/out/Release/obj.target/v8_base/deps/v8/src/compiler/wasm-compiler.o ../deps/v8/src/compiler/wasm-compiler.cc
606  [06/10/2017 12:02AM]:                  from ../deps/v8/src/isolate-inl.h:8,
607  [06/10/2017 12:02AM]:                  from ../deps/v8/src/compiler/wasm-compiler.cc:7:
608  [06/10/2017 12:02AM]: In file included from ../deps/v8/src/machine-type.h:11:0,
609  [06/10/2017 12:02AM]:                  from ../deps/v8/src/wasm/wasm-opcodes.h:8,
610  [06/10/2017 12:02AM]:                  from ../deps/v8/src/compiler/wasm-compiler.h:10,
611  [06/10/2017 12:02AM]:                  from ../deps/v8/src/compiler/wasm-compiler.cc:5:
612  [06/10/2017 12:02AM]:   g++ -DV8_TARGET_ARCH_X64 -DENABLE_DISASSEMBLER -DV8_I18N_SUPPORT -DV8_IMMINENT_DEPRECATION_WARNINGS -DICU_UTIL_DATA_IMPL=ICU_UTIL_DATA_STATIC -I../deps/v8 -I../deps -I/usr/include/openssl-1.0  -pthread -Wall -Wextra -Wno-unused-parameter -m64 -fno-strict-aliasing -m64 -fdata-sections -ffunction-sections -O3 -O3 -fno-omit-frame-pointer -fno-rtti -fno-exceptions -std=gnu++0x -MMD -MF /pkg/src/node-v6.11.0/out/Release/.deps//pkg/src/node-v6.11.0/out/Release/obj.target/v8_base/deps/v8/src/compiler/wasm-linkage.o.d.raw -D_FORTIFY_SOURCE=2 -march=x86-64 -mtune=generic -O2 -pipe -fstack-protector-strong -c -o /pkg/src/node-v6.11.0/out/Release/obj.target/v8_base/deps/v8/src/compiler/wasm-linkage.o ../deps/v8/src/compiler/wasm-linkage.cc
613  [06/10/2017 12:02AM]:                  from ../deps/v8/src/compiler/wasm-linkage.cc:5:
614  [06/10/2017 12:02AM]:   g++ -DV8_TARGET_ARCH_X64 -DENABLE_DISASSEMBLER -DV8_I18N_SUPPORT -DV8_IMMINENT_DEPRECATION_WARNINGS -DICU_UTIL_DATA_IMPL=ICU_UTIL_DATA_STATIC -I../deps/v8 -I../deps -I/usr/include/openssl-1.0  -pthread -Wall -Wextra -Wno-unused-parameter -m64 -fno-strict-aliasing -m64 -fdata-sections -ffunction-sections -O3 -O3 -fno-omit-frame-pointer -fno-rtti -fno-exceptions -std=gnu++0x -MMD -MF /pkg/src/node-v6.11.0/out/Release/.deps//pkg/src/node-v6.11.0/out/Release/obj.target/v8_base/deps/v8/src/compiler/zone-pool.o.d.raw -D_FORTIFY_SOURCE=2 -march=x86-64 -mtune=generic -O2 -pipe -fstack-protector-strong -c -o /pkg/src/node-v6.11.0/out/Release/obj.target/v8_base/deps/v8/src/compiler/zone-pool.o ../deps/v8/src/compiler/zone-pool.cc
615  [06/10/2017 12:02AM]:   g++ -DV8_TARGET_ARCH_X64 -DENABLE_DISASSEMBLER -DV8_I18N_SUPPORT -DV8_IMMINENT_DEPRECATION_WARNINGS -DICU_UTIL_DATA_IMPL=ICU_UTIL_DATA_STATIC -I../deps/v8 -I../deps -I/usr/include/openssl-1.0  -pthread -Wall -Wextra -Wno-unused-parameter -m64 -fno-strict-aliasing -m64 -fdata-sections -ffunction-sections -O3 -O3 -fno-omit-frame-pointer -fno-rtti -fno-exceptions -std=gnu++0x -MMD -MF /pkg/src/node-v6.11.0/out/Release/.deps//pkg/src/node-v6.11.0/out/Release/obj.target/v8_base/deps/v8/src/compiler.o.d.raw -D_FORTIFY_SOURCE=2 -march=x86-64 -mtune=generic -O2 -pipe -fstack-protector-strong -c -o /pkg/src/node-v6.11.0/out/Release/obj.target/v8_base/deps/v8/src/compiler.o ../deps/v8/src/compiler.cc
616  [06/10/2017 12:02AM]:                  from ../deps/v8/src/compiler.cc:5:
617  [06/10/2017 12:02AM]:   g++ -DV8_TARGET_ARCH_X64 -DENABLE_DISASSEMBLER -DV8_I18N_SUPPORT -DV8_IMMINENT_DEPRECATION_WARNINGS -DICU_UTIL_DATA_IMPL=ICU_UTIL_DATA_STATIC -I../deps/v8 -I../deps -I/usr/include/openssl-1.0  -pthread -Wall -Wextra -Wno-unused-parameter -m64 -fno-strict-aliasing -m64 -fdata-sections -ffunction-sections -O3 -O3 -fno-omit-frame-pointer -fno-rtti -fno-exceptions -std=gnu++0x -MMD -MF /pkg/src/node-v6.11.0/out/Release/.deps//pkg/src/node-v6.11.0/out/Release/obj.target/v8_base/deps/v8/src/context-measure.o.d.raw -D_FORTIFY_SOURCE=2 -march=x86-64 -mtune=generic -O2 -pipe -fstack-protector-strong -c -o /pkg/src/node-v6.11.0/out/Release/obj.target/v8_base/deps/v8/src/context-measure.o ../deps/v8/src/context-measure.cc
618  [06/10/2017 12:02AM]:                  from ../deps/v8/src/context-measure.h:8,
619  [06/10/2017 12:02AM]:                  from ../deps/v8/src/context-measure.cc:5:
620  [06/10/2017 12:02AM]:   g++ -DV8_TARGET_ARCH_X64 -DENABLE_DISASSEMBLER -DV8_I18N_SUPPORT -DV8_IMMINENT_DEPRECATION_WARNINGS -DICU_UTIL_DATA_IMPL=ICU_UTIL_DATA_STATIC -I../deps/v8 -I../deps -I/usr/include/openssl-1.0  -pthread -Wall -Wextra -Wno-unused-parameter -m64 -fno-strict-aliasing -m64 -fdata-sections -ffunction-sections -O3 -O3 -fno-omit-frame-pointer -fno-rtti -fno-exceptions -std=gnu++0x -MMD -MF /pkg/src/node-v6.11.0/out/Release/.deps//pkg/src/node-v6.11.0/out/Release/obj.target/v8_base/deps/v8/src/contexts.o.d.raw -D_FORTIFY_SOURCE=2 -march=x86-64 -mtune=generic -O2 -pipe -fstack-protector-strong -c -o /pkg/src/node-v6.11.0/out/Release/obj.target/v8_base/deps/v8/src/contexts.o ../deps/v8/src/contexts.cc
621  [06/10/2017 12:02AM]:                  from ../deps/v8/src/contexts.cc:5:
622  [06/10/2017 12:02AM]: In file included from ../deps/v8/src/heap/heap.h:13:0,
623  [06/10/2017 12:02AM]:   g++ -DV8_TARGET_ARCH_X64 -DENABLE_DISASSEMBLER -DV8_I18N_SUPPORT -DV8_IMMINENT_DEPRECATION_WARNINGS -DICU_UTIL_DATA_IMPL=ICU_UTIL_DATA_STATIC -I../deps/v8 -I../deps -I/usr/include/openssl-1.0  -pthread -Wall -Wextra -Wno-unused-parameter -m64 -fno-strict-aliasing -m64 -fdata-sections -ffunction-sections -O3 -O3 -fno-omit-frame-pointer -fno-rtti -fno-exceptions -std=gnu++0x -MMD -MF /pkg/src/node-v6.11.0/out/Release/.deps//pkg/src/node-v6.11.0/out/Release/obj.target/v8_base/deps/v8/src/conversions.o.d.raw -D_FORTIFY_SOURCE=2 -march=x86-64 -mtune=generic -O2 -pipe -fstack-protector-strong -c -o /pkg/src/node-v6.11.0/out/Release/obj.target/v8_base/deps/v8/src/conversions.o ../deps/v8/src/conversions.cc
624  [06/10/2017 12:02AM]:                  from ../deps/v8/src/conversions.cc:13:
625  [06/10/2017 12:02AM]:                  from ../deps/v8/src/conversions.h:11,
626  [06/10/2017 12:02AM]:                  from ../deps/v8/src/conversions.cc:5:
627  [06/10/2017 12:02AM]: ../deps/v8/src/conversions.cc: At global scope:
628  [06/10/2017 12:02AM]: ../deps/v8/src/conversions.cc:57:10: warning: uint16_t v8::internal::{anonymous}::StringCharacterStreamIterator::operator*() const defined but not used [-Wunused-function]
629  [06/10/2017 12:02AM]:  uint16_t StringCharacterStreamIterator::operator*() const {
630  [06/10/2017 12:02AM]:           ^~~~~~~~~~~~~~~~~~~~~~~~~~~~~
631  [06/10/2017 12:02AM]: ../deps/v8/src/conversions.cc:52:1: warning: v8::internal::{anonymous}::StringCharacterStreamIterator::StringCharacterStreamIterator(v8::internal::StringCharacterStream*) defined but not used [-Wunused-function]
632  [06/10/2017 12:02AM]:  StringCharacterStreamIterator::StringCharacterStreamIterator(
633  [06/10/2017 12:02AM]:  ^~~~~~~~~~~~~~~~~~~~~~~~~~~~~
634  [06/10/2017 12:02AM]:   g++ -DV8_TARGET_ARCH_X64 -DENABLE_DISASSEMBLER -DV8_I18N_SUPPORT -DV8_IMMINENT_DEPRECATION_WARNINGS -DICU_UTIL_DATA_IMPL=ICU_UTIL_DATA_STATIC -I../deps/v8 -I../deps -I/usr/include/openssl-1.0  -pthread -Wall -Wextra -Wno-unused-parameter -m64 -fno-strict-aliasing -m64 -fdata-sections -ffunction-sections -O3 -O3 -fno-omit-frame-pointer -fno-rtti -fno-exceptions -std=gnu++0x -MMD -MF /pkg/src/node-v6.11.0/out/Release/.deps//pkg/src/node-v6.11.0/out/Release/obj.target/v8_base/deps/v8/src/counters.o.d.raw -D_FORTIFY_SOURCE=2 -march=x86-64 -mtune=generic -O2 -pipe -fstack-protector-strong -c -o /pkg/src/node-v6.11.0/out/Release/obj.target/v8_base/deps/v8/src/counters.o ../deps/v8/src/counters.cc
635  [06/10/2017 12:02AM]: In file included from ../deps/v8/src/counters.h:14:0,
636  [06/10/2017 12:02AM]:                  from ../deps/v8/src/counters.cc:5:
637  [06/10/2017 12:02AM]: In file included from ../deps/v8/src/counters.h:8:0,
638  [06/10/2017 12:02AM]:   g++ -DV8_TARGET_ARCH_X64 -DENABLE_DISASSEMBLER -DV8_I18N_SUPPORT -DV8_IMMINENT_DEPRECATION_WARNINGS -DICU_UTIL_DATA_IMPL=ICU_UTIL_DATA_STATIC -I../deps/v8 -I../deps -I/usr/include/openssl-1.0  -pthread -Wall -Wextra -Wno-unused-parameter -m64 -fno-strict-aliasing -m64 -fdata-sections -ffunction-sections -O3 -O3 -fno-omit-frame-pointer -fno-rtti -fno-exceptions -std=gnu++0x -MMD -MF /pkg/src/node-v6.11.0/out/Release/.deps//pkg/src/node-v6.11.0/out/Release/obj.target/v8_base/deps/v8/src/crankshaft/compilation-phase.o.d.raw -D_FORTIFY_SOURCE=2 -march=x86-64 -mtune=generic -O2 -pipe -fstack-protector-strong -c -o /pkg/src/node-v6.11.0/out/Release/obj.target/v8_base/deps/v8/src/crankshaft/compilation-phase.o ../deps/v8/src/crankshaft/compilation-phase.cc
639  [06/10/2017 12:02AM]:                  from ../deps/v8/src/crankshaft/compilation-phase.h:9,
640  [06/10/2017 12:02AM]:                  from ../deps/v8/src/crankshaft/compilation-phase.cc:5:
641  [06/10/2017 12:02AM]:                  from ../deps/v8/src/crankshaft/compilation-phase.h:8,
642  [06/10/2017 12:02AM]:   g++ -DV8_TARGET_ARCH_X64 -DENABLE_DISASSEMBLER -DV8_I18N_SUPPORT -DV8_IMMINENT_DEPRECATION_WARNINGS -DICU_UTIL_DATA_IMPL=ICU_UTIL_DATA_STATIC -I../deps/v8 -I../deps -I/usr/include/openssl-1.0  -pthread -Wall -Wextra -Wno-unused-parameter -m64 -fno-strict-aliasing -m64 -fdata-sections -ffunction-sections -O3 -O3 -fno-omit-frame-pointer -fno-rtti -fno-exceptions -std=gnu++0x -MMD -MF /pkg/src/node-v6.11.0/out/Release/.deps//pkg/src/node-v6.11.0/out/Release/obj.target/v8_base/deps/v8/src/crankshaft/hydrogen-bce.o.d.raw -D_FORTIFY_SOURCE=2 -march=x86-64 -mtune=generic -O2 -pipe -fstack-protector-strong -c -o /pkg/src/node-v6.11.0/out/Release/obj.target/v8_base/deps/v8/src/crankshaft/hydrogen-bce.o ../deps/v8/src/crankshaft/hydrogen-bce.cc
643  [06/10/2017 12:02AM]:                  from ../deps/v8/src/crankshaft/hydrogen.h:10,
644  [06/10/2017 12:02AM]:                  from ../deps/v8/src/crankshaft/hydrogen-bce.h:8,
645  [06/10/2017 12:02AM]:                  from ../deps/v8/src/crankshaft/hydrogen-bce.cc:5:
646  [06/10/2017 12:02AM]:                  from ../deps/v8/src/crankshaft/hydrogen.h:8,
647  [06/10/2017 12:02AM]:   g++ -DV8_TARGET_ARCH_X64 -DENABLE_DISASSEMBLER -DV8_I18N_SUPPORT -DV8_IMMINENT_DEPRECATION_WARNINGS -DICU_UTIL_DATA_IMPL=ICU_UTIL_DATA_STATIC -I../deps/v8 -I../deps -I/usr/include/openssl-1.0  -pthread -Wall -Wextra -Wno-unused-parameter -m64 -fno-strict-aliasing -m64 -fdata-sections -ffunction-sections -O3 -O3 -fno-omit-frame-pointer -fno-rtti -fno-exceptions -std=gnu++0x -MMD -MF /pkg/src/node-v6.11.0/out/Release/.deps//pkg/src/node-v6.11.0/out/Release/obj.target/v8_base/deps/v8/src/crankshaft/hydrogen-canonicalize.o.d.raw -D_FORTIFY_SOURCE=2 -march=x86-64 -mtune=generic -O2 -pipe -fstack-protector-strong -c -o /pkg/src/node-v6.11.0/out/Release/obj.target/v8_base/deps/v8/src/crankshaft/hydrogen-canonicalize.o ../deps/v8/src/crankshaft/hydrogen-canonicalize.cc
648  [06/10/2017 12:02AM]:                  from ../deps/v8/src/crankshaft/hydrogen-canonicalize.h:8,
649  [06/10/2017 12:02AM]:                  from ../deps/v8/src/crankshaft/hydrogen-canonicalize.cc:5:
650  [06/10/2017 12:03AM]:   g++ -DV8_TARGET_ARCH_X64 -DENABLE_DISASSEMBLER -DV8_I18N_SUPPORT -DV8_IMMINENT_DEPRECATION_WARNINGS -DICU_UTIL_DATA_IMPL=ICU_UTIL_DATA_STATIC -I../deps/v8 -I../deps -I/usr/include/openssl-1.0  -pthread -Wall -Wextra -Wno-unused-parameter -m64 -fno-strict-aliasing -m64 -fdata-sections -ffunction-sections -O3 -O3 -fno-omit-frame-pointer -fno-rtti -fno-exceptions -std=gnu++0x -MMD -MF /pkg/src/node-v6.11.0/out/Release/.deps//pkg/src/node-v6.11.0/out/Release/obj.target/v8_base/deps/v8/src/crankshaft/hydrogen-check-elimination.o.d.raw -D_FORTIFY_SOURCE=2 -march=x86-64 -mtune=generic -O2 -pipe -fstack-protector-strong -c -o /pkg/src/node-v6.11.0/out/Release/obj.target/v8_base/deps/v8/src/crankshaft/hydrogen-check-elimination.o ../deps/v8/src/crankshaft/hydrogen-check-elimination.cc
651  [06/10/2017 12:03AM]:                  from ../deps/v8/src/crankshaft/hydrogen-check-elimination.h:8,
652  [06/10/2017 12:03AM]:                  from ../deps/v8/src/crankshaft/hydrogen-check-elimination.cc:5:
653  [06/10/2017 12:03AM]:   g++ -DV8_TARGET_ARCH_X64 -DENABLE_DISASSEMBLER -DV8_I18N_SUPPORT -DV8_IMMINENT_DEPRECATION_WARNINGS -DICU_UTIL_DATA_IMPL=ICU_UTIL_DATA_STATIC -I../deps/v8 -I../deps -I/usr/include/openssl-1.0  -pthread -Wall -Wextra -Wno-unused-parameter -m64 -fno-strict-aliasing -m64 -fdata-sections -ffunction-sections -O3 -O3 -fno-omit-frame-pointer -fno-rtti -fno-exceptions -std=gnu++0x -MMD -MF /pkg/src/node-v6.11.0/out/Release/.deps//pkg/src/node-v6.11.0/out/Release/obj.target/v8_base/deps/v8/src/crankshaft/hydrogen-dce.o.d.raw -D_FORTIFY_SOURCE=2 -march=x86-64 -mtune=generic -O2 -pipe -fstack-protector-strong -c -o /pkg/src/node-v6.11.0/out/Release/obj.target/v8_base/deps/v8/src/crankshaft/hydrogen-dce.o ../deps/v8/src/crankshaft/hydrogen-dce.cc
654  [06/10/2017 12:03AM]:                  from ../deps/v8/src/crankshaft/hydrogen-dce.h:8,
655  [06/10/2017 12:03AM]:                  from ../deps/v8/src/crankshaft/hydrogen-dce.cc:5:
656  [06/10/2017 12:03AM]:   g++ -DV8_TARGET_ARCH_X64 -DENABLE_DISASSEMBLER -DV8_I18N_SUPPORT -DV8_IMMINENT_DEPRECATION_WARNINGS -DICU_UTIL_DATA_IMPL=ICU_UTIL_DATA_STATIC -I../deps/v8 -I../deps -I/usr/include/openssl-1.0  -pthread -Wall -Wextra -Wno-unused-parameter -m64 -fno-strict-aliasing -m64 -fdata-sections -ffunction-sections -O3 -O3 -fno-omit-frame-pointer -fno-rtti -fno-exceptions -std=gnu++0x -MMD -MF /pkg/src/node-v6.11.0/out/Release/.deps//pkg/src/node-v6.11.0/out/Release/obj.target/v8_base/deps/v8/src/crankshaft/hydrogen-dehoist.o.d.raw -D_FORTIFY_SOURCE=2 -march=x86-64 -mtune=generic -O2 -pipe -fstack-protector-strong -c -o /pkg/src/node-v6.11.0/out/Release/obj.target/v8_base/deps/v8/src/crankshaft/hydrogen-dehoist.o ../deps/v8/src/crankshaft/hydrogen-dehoist.cc
657  [06/10/2017 12:03AM]:                  from ../deps/v8/src/crankshaft/hydrogen-dehoist.h:8,
658  [06/10/2017 12:03AM]:                  from ../deps/v8/src/crankshaft/hydrogen-dehoist.cc:5:
659  [06/10/2017 12:03AM]:   g++ -DV8_TARGET_ARCH_X64 -DENABLE_DISASSEMBLER -DV8_I18N_SUPPORT -DV8_IMMINENT_DEPRECATION_WARNINGS -DICU_UTIL_DATA_IMPL=ICU_UTIL_DATA_STATIC -I../deps/v8 -I../deps -I/usr/include/openssl-1.0  -pthread -Wall -Wextra -Wno-unused-parameter -m64 -fno-strict-aliasing -m64 -fdata-sections -ffunction-sections -O3 -O3 -fno-omit-frame-pointer -fno-rtti -fno-exceptions -std=gnu++0x -MMD -MF /pkg/src/node-v6.11.0/out/Release/.deps//pkg/src/node-v6.11.0/out/Release/obj.target/v8_base/deps/v8/src/crankshaft/hydrogen-environment-liveness.o.d.raw -D_FORTIFY_SOURCE=2 -march=x86-64 -mtune=generic -O2 -pipe -fstack-protector-strong -c -o /pkg/src/node-v6.11.0/out/Release/obj.target/v8_base/deps/v8/src/crankshaft/hydrogen-environment-liveness.o ../deps/v8/src/crankshaft/hydrogen-environment-liveness.cc
660  [06/10/2017 12:03AM]:                  from ../deps/v8/src/crankshaft/hydrogen-environment-liveness.h:8,
661  [06/10/2017 12:03AM]:                  from ../deps/v8/src/crankshaft/hydrogen-environment-liveness.cc:6:
662  [06/10/2017 12:03AM]:   g++ -DV8_TARGET_ARCH_X64 -DENABLE_DISASSEMBLER -DV8_I18N_SUPPORT -DV8_IMMINENT_DEPRECATION_WARNINGS -DICU_UTIL_DATA_IMPL=ICU_UTIL_DATA_STATIC -I../deps/v8 -I../deps -I/usr/include/openssl-1.0  -pthread -Wall -Wextra -Wno-unused-parameter -m64 -fno-strict-aliasing -m64 -fdata-sections -ffunction-sections -O3 -O3 -fno-omit-frame-pointer -fno-rtti -fno-exceptions -std=gnu++0x -MMD -MF /pkg/src/node-v6.11.0/out/Release/.deps//pkg/src/node-v6.11.0/out/Release/obj.target/v8_base/deps/v8/src/crankshaft/hydrogen-escape-analysis.o.d.raw -D_FORTIFY_SOURCE=2 -march=x86-64 -mtune=generic -O2 -pipe -fstack-protector-strong -c -o /pkg/src/node-v6.11.0/out/Release/obj.target/v8_base/deps/v8/src/crankshaft/hydrogen-escape-analysis.o ../deps/v8/src/crankshaft/hydrogen-escape-analysis.cc
663  [06/10/2017 12:03AM]:                  from ../deps/v8/src/crankshaft/hydrogen-escape-analysis.h:9,
664  [06/10/2017 12:03AM]:                  from ../deps/v8/src/crankshaft/hydrogen-escape-analysis.cc:5:
665  [06/10/2017 12:03AM]:                  from ../deps/v8/src/crankshaft/hydrogen-escape-analysis.h:8,
666  [06/10/2017 12:03AM]:   g++ -DV8_TARGET_ARCH_X64 -DENABLE_DISASSEMBLER -DV8_I18N_SUPPORT -DV8_IMMINENT_DEPRECATION_WARNINGS -DICU_UTIL_DATA_IMPL=ICU_UTIL_DATA_STATIC -I../deps/v8 -I../deps -I/usr/include/openssl-1.0  -pthread -Wall -Wextra -Wno-unused-parameter -m64 -fno-strict-aliasing -m64 -fdata-sections -ffunction-sections -O3 -O3 -fno-omit-frame-pointer -fno-rtti -fno-exceptions -std=gnu++0x -MMD -MF /pkg/src/node-v6.11.0/out/Release/.deps//pkg/src/node-v6.11.0/out/Release/obj.target/v8_base/deps/v8/src/crankshaft/hydrogen-gvn.o.d.raw -D_FORTIFY_SOURCE=2 -march=x86-64 -mtune=generic -O2 -pipe -fstack-protector-strong -c -o /pkg/src/node-v6.11.0/out/Release/obj.target/v8_base/deps/v8/src/crankshaft/hydrogen-gvn.o ../deps/v8/src/crankshaft/hydrogen-gvn.cc
667  [06/10/2017 12:03AM]:                  from ../deps/v8/src/crankshaft/hydrogen-gvn.h:10,
668  [06/10/2017 12:03AM]:                  from ../deps/v8/src/crankshaft/hydrogen-gvn.cc:5:
669  [06/10/2017 12:03AM]:   g++ -DV8_TARGET_ARCH_X64 -DENABLE_DISASSEMBLER -DV8_I18N_SUPPORT -DV8_IMMINENT_DEPRECATION_WARNINGS -DICU_UTIL_DATA_IMPL=ICU_UTIL_DATA_STATIC -I../deps/v8 -I../deps -I/usr/include/openssl-1.0  -pthread -Wall -Wextra -Wno-unused-parameter -m64 -fno-strict-aliasing -m64 -fdata-sections -ffunction-sections -O3 -O3 -fno-omit-frame-pointer -fno-rtti -fno-exceptions -std=gnu++0x -MMD -MF /pkg/src/node-v6.11.0/out/Release/.deps//pkg/src/node-v6.11.0/out/Release/obj.target/v8_base/deps/v8/src/crankshaft/hydrogen-infer-representation.o.d.raw -D_FORTIFY_SOURCE=2 -march=x86-64 -mtune=generic -O2 -pipe -fstack-protector-strong -c -o /pkg/src/node-v6.11.0/out/Release/obj.target/v8_base/deps/v8/src/crankshaft/hydrogen-infer-representation.o ../deps/v8/src/crankshaft/hydrogen-infer-representation.cc
670  [06/10/2017 12:03AM]:                  from ../deps/v8/src/crankshaft/hydrogen-infer-representation.h:8,
671  [06/10/2017 12:03AM]:                  from ../deps/v8/src/crankshaft/hydrogen-infer-representation.cc:5:
672  [06/10/2017 12:03AM]:   g++ -DV8_TARGET_ARCH_X64 -DENABLE_DISASSEMBLER -DV8_I18N_SUPPORT -DV8_IMMINENT_DEPRECATION_WARNINGS -DICU_UTIL_DATA_IMPL=ICU_UTIL_DATA_STATIC -I../deps/v8 -I../deps -I/usr/include/openssl-1.0  -pthread -Wall -Wextra -Wno-unused-parameter -m64 -fno-strict-aliasing -m64 -fdata-sections -ffunction-sections -O3 -O3 -fno-omit-frame-pointer -fno-rtti -fno-exceptions -std=gnu++0x -MMD -MF /pkg/src/node-v6.11.0/out/Release/.deps//pkg/src/node-v6.11.0/out/Release/obj.target/v8_base/deps/v8/src/crankshaft/hydrogen-infer-types.o.d.raw -D_FORTIFY_SOURCE=2 -march=x86-64 -mtune=generic -O2 -pipe -fstack-protector-strong -c -o /pkg/src/node-v6.11.0/out/Release/obj.target/v8_base/deps/v8/src/crankshaft/hydrogen-infer-types.o ../deps/v8/src/crankshaft/hydrogen-infer-types.cc
673  [06/10/2017 12:03AM]:                  from ../deps/v8/src/crankshaft/hydrogen-infer-types.h:8,
674  [06/10/2017 12:03AM]:                  from ../deps/v8/src/crankshaft/hydrogen-infer-types.cc:5:
675  [06/10/2017 12:03AM]:   g++ -DV8_TARGET_ARCH_X64 -DENABLE_DISASSEMBLER -DV8_I18N_SUPPORT -DV8_IMMINENT_DEPRECATION_WARNINGS -DICU_UTIL_DATA_IMPL=ICU_UTIL_DATA_STATIC -I../deps/v8 -I../deps -I/usr/include/openssl-1.0  -pthread -Wall -Wextra -Wno-unused-parameter -m64 -fno-strict-aliasing -m64 -fdata-sections -ffunction-sections -O3 -O3 -fno-omit-frame-pointer -fno-rtti -fno-exceptions -std=gnu++0x -MMD -MF /pkg/src/node-v6.11.0/out/Release/.deps//pkg/src/node-v6.11.0/out/Release/obj.target/v8_base/deps/v8/src/crankshaft/hydrogen-instructions.o.d.raw -D_FORTIFY_SOURCE=2 -march=x86-64 -mtune=generic -O2 -pipe -fstack-protector-strong -c -o /pkg/src/node-v6.11.0/out/Release/obj.target/v8_base/deps/v8/src/crankshaft/hydrogen-instructions.o ../deps/v8/src/crankshaft/hydrogen-instructions.cc
676  [06/10/2017 12:03AM]:                  from ../deps/v8/src/crankshaft/hydrogen-instructions.h:14,
677  [06/10/2017 12:03AM]:                  from ../deps/v8/src/crankshaft/hydrogen-instructions.cc:5:
678  [06/10/2017 12:03AM]:                  from ../deps/v8/src/crankshaft/hydrogen-instructions.h:11,
679  [06/10/2017 12:03AM]:   g++ -DV8_TARGET_ARCH_X64 -DENABLE_DISASSEMBLER -DV8_I18N_SUPPORT -DV8_IMMINENT_DEPRECATION_WARNINGS -DICU_UTIL_DATA_IMPL=ICU_UTIL_DATA_STATIC -I../deps/v8 -I../deps -I/usr/include/openssl-1.0  -pthread -Wall -Wextra -Wno-unused-parameter -m64 -fno-strict-aliasing -m64 -fdata-sections -ffunction-sections -O3 -O3 -fno-omit-frame-pointer -fno-rtti -fno-exceptions -std=gnu++0x -MMD -MF /pkg/src/node-v6.11.0/out/Release/.deps//pkg/src/node-v6.11.0/out/Release/obj.target/v8_base/deps/v8/src/crankshaft/hydrogen-load-elimination.o.d.raw -D_FORTIFY_SOURCE=2 -march=x86-64 -mtune=generic -O2 -pipe -fstack-protector-strong -c -o /pkg/src/node-v6.11.0/out/Release/obj.target/v8_base/deps/v8/src/crankshaft/hydrogen-load-elimination.o ../deps/v8/src/crankshaft/hydrogen-load-elimination.cc
680  [06/10/2017 12:03AM]:                  from ../deps/v8/src/crankshaft/hydrogen-load-elimination.h:8,
681  [06/10/2017 12:03AM]:                  from ../deps/v8/src/crankshaft/hydrogen-load-elimination.cc:5:
682  [06/10/2017 12:03AM]:   g++ -DV8_TARGET_ARCH_X64 -DENABLE_DISASSEMBLER -DV8_I18N_SUPPORT -DV8_IMMINENT_DEPRECATION_WARNINGS -DICU_UTIL_DATA_IMPL=ICU_UTIL_DATA_STATIC -I../deps/v8 -I../deps -I/usr/include/openssl-1.0  -pthread -Wall -Wextra -Wno-unused-parameter -m64 -fno-strict-aliasing -m64 -fdata-sections -ffunction-sections -O3 -O3 -fno-omit-frame-pointer -fno-rtti -fno-exceptions -std=gnu++0x -MMD -MF /pkg/src/node-v6.11.0/out/Release/.deps//pkg/src/node-v6.11.0/out/Release/obj.target/v8_base/deps/v8/src/crankshaft/hydrogen-mark-deoptimize.o.d.raw -D_FORTIFY_SOURCE=2 -march=x86-64 -mtune=generic -O2 -pipe -fstack-protector-strong -c -o /pkg/src/node-v6.11.0/out/Release/obj.target/v8_base/deps/v8/src/crankshaft/hydrogen-mark-deoptimize.o ../deps/v8/src/crankshaft/hydrogen-mark-deoptimize.cc
683  [06/10/2017 12:03AM]:                  from ../deps/v8/src/crankshaft/hydrogen-mark-deoptimize.h:8,
684  [06/10/2017 12:03AM]:                  from ../deps/v8/src/crankshaft/hydrogen-mark-deoptimize.cc:5:
685  [06/10/2017 12:03AM]:   g++ -DV8_TARGET_ARCH_X64 -DENABLE_DISASSEMBLER -DV8_I18N_SUPPORT -DV8_IMMINENT_DEPRECATION_WARNINGS -DICU_UTIL_DATA_IMPL=ICU_UTIL_DATA_STATIC -I../deps/v8 -I../deps -I/usr/include/openssl-1.0  -pthread -Wall -Wextra -Wno-unused-parameter -m64 -fno-strict-aliasing -m64 -fdata-sections -ffunction-sections -O3 -O3 -fno-omit-frame-pointer -fno-rtti -fno-exceptions -std=gnu++0x -MMD -MF /pkg/src/node-v6.11.0/out/Release/.deps//pkg/src/node-v6.11.0/out/Release/obj.target/v8_base/deps/v8/src/crankshaft/hydrogen-mark-unreachable.o.d.raw -D_FORTIFY_SOURCE=2 -march=x86-64 -mtune=generic -O2 -pipe -fstack-protector-strong -c -o /pkg/src/node-v6.11.0/out/Release/obj.target/v8_base/deps/v8/src/crankshaft/hydrogen-mark-unreachable.o ../deps/v8/src/crankshaft/hydrogen-mark-unreachable.cc
686  [06/10/2017 12:03AM]:                  from ../deps/v8/src/crankshaft/hydrogen-mark-unreachable.h:8,
687  [06/10/2017 12:03AM]:                  from ../deps/v8/src/crankshaft/hydrogen-mark-unreachable.cc:5:
688  [06/10/2017 12:03AM]:   g++ -DV8_TARGET_ARCH_X64 -DENABLE_DISASSEMBLER -DV8_I18N_SUPPORT -DV8_IMMINENT_DEPRECATION_WARNINGS -DICU_UTIL_DATA_IMPL=ICU_UTIL_DATA_STATIC -I../deps/v8 -I../deps -I/usr/include/openssl-1.0  -pthread -Wall -Wextra -Wno-unused-parameter -m64 -fno-strict-aliasing -m64 -fdata-sections -ffunction-sections -O3 -O3 -fno-omit-frame-pointer -fno-rtti -fno-exceptions -std=gnu++0x -MMD -MF /pkg/src/node-v6.11.0/out/Release/.deps//pkg/src/node-v6.11.0/out/Release/obj.target/v8_base/deps/v8/src/crankshaft/hydrogen-osr.o.d.raw -D_FORTIFY_SOURCE=2 -march=x86-64 -mtune=generic -O2 -pipe -fstack-protector-strong -c -o /pkg/src/node-v6.11.0/out/Release/obj.target/v8_base/deps/v8/src/crankshaft/hydrogen-osr.o ../deps/v8/src/crankshaft/hydrogen-osr.cc
689  [06/10/2017 12:03AM]:                  from ../deps/v8/src/crankshaft/hydrogen-osr.h:8,
690  [06/10/2017 12:03AM]:                  from ../deps/v8/src/crankshaft/hydrogen-osr.cc:5:
691  [06/10/2017 12:03AM]:   g++ -DV8_TARGET_ARCH_X64 -DENABLE_DISASSEMBLER -DV8_I18N_SUPPORT -DV8_IMMINENT_DEPRECATION_WARNINGS -DICU_UTIL_DATA_IMPL=ICU_UTIL_DATA_STATIC -I../deps/v8 -I../deps -I/usr/include/openssl-1.0  -pthread -Wall -Wextra -Wno-unused-parameter -m64 -fno-strict-aliasing -m64 -fdata-sections -ffunction-sections -O3 -O3 -fno-omit-frame-pointer -fno-rtti -fno-exceptions -std=gnu++0x -MMD -MF /pkg/src/node-v6.11.0/out/Release/.deps//pkg/src/node-v6.11.0/out/Release/obj.target/v8_base/deps/v8/src/crankshaft/hydrogen-range-analysis.o.d.raw -D_FORTIFY_SOURCE=2 -march=x86-64 -mtune=generic -O2 -pipe -fstack-protector-strong -c -o /pkg/src/node-v6.11.0/out/Release/obj.target/v8_base/deps/v8/src/crankshaft/hydrogen-range-analysis.o ../deps/v8/src/crankshaft/hydrogen-range-analysis.cc
692  [06/10/2017 12:03AM]:                  from ../deps/v8/src/crankshaft/hydrogen-range-analysis.h:8,
693  [06/10/2017 12:03AM]:                  from ../deps/v8/src/crankshaft/hydrogen-range-analysis.cc:5:
694  [06/10/2017 12:03AM]:   g++ -DV8_TARGET_ARCH_X64 -DENABLE_DISASSEMBLER -DV8_I18N_SUPPORT -DV8_IMMINENT_DEPRECATION_WARNINGS -DICU_UTIL_DATA_IMPL=ICU_UTIL_DATA_STATIC -I../deps/v8 -I../deps -I/usr/include/openssl-1.0  -pthread -Wall -Wextra -Wno-unused-parameter -m64 -fno-strict-aliasing -m64 -fdata-sections -ffunction-sections -O3 -O3 -fno-omit-frame-pointer -fno-rtti -fno-exceptions -std=gnu++0x -MMD -MF /pkg/src/node-v6.11.0/out/Release/.deps//pkg/src/node-v6.11.0/out/Release/obj.target/v8_base/deps/v8/src/crankshaft/hydrogen-redundant-phi.o.d.raw -D_FORTIFY_SOURCE=2 -march=x86-64 -mtune=generic -O2 -pipe -fstack-protector-strong -c -o /pkg/src/node-v6.11.0/out/Release/obj.target/v8_base/deps/v8/src/crankshaft/hydrogen-redundant-phi.o ../deps/v8/src/crankshaft/hydrogen-redundant-phi.cc
695  [06/10/2017 12:03AM]:                  from ../deps/v8/src/crankshaft/hydrogen-redundant-phi.h:8,
696  [06/10/2017 12:03AM]:                  from ../deps/v8/src/crankshaft/hydrogen-redundant-phi.cc:5:
697  [06/10/2017 12:04AM]:   g++ -DV8_TARGET_ARCH_X64 -DENABLE_DISASSEMBLER -DV8_I18N_SUPPORT -DV8_IMMINENT_DEPRECATION_WARNINGS -DICU_UTIL_DATA_IMPL=ICU_UTIL_DATA_STATIC -I../deps/v8 -I../deps -I/usr/include/openssl-1.0  -pthread -Wall -Wextra -Wno-unused-parameter -m64 -fno-strict-aliasing -m64 -fdata-sections -ffunction-sections -O3 -O3 -fno-omit-frame-pointer -fno-rtti -fno-exceptions -std=gnu++0x -MMD -MF /pkg/src/node-v6.11.0/out/Release/.deps//pkg/src/node-v6.11.0/out/Release/obj.target/v8_base/deps/v8/src/crankshaft/hydrogen-removable-simulates.o.d.raw -D_FORTIFY_SOURCE=2 -march=x86-64 -mtune=generic -O2 -pipe -fstack-protector-strong -c -o /pkg/src/node-v6.11.0/out/Release/obj.target/v8_base/deps/v8/src/crankshaft/hydrogen-removable-simulates.o ../deps/v8/src/crankshaft/hydrogen-removable-simulates.cc
698  [06/10/2017 12:04AM]:                  from ../deps/v8/src/crankshaft/hydrogen-removable-simulates.h:8,
699  [06/10/2017 12:04AM]:                  from ../deps/v8/src/crankshaft/hydrogen-removable-simulates.cc:5:
700  [06/10/2017 12:04AM]:   g++ -DV8_TARGET_ARCH_X64 -DENABLE_DISASSEMBLER -DV8_I18N_SUPPORT -DV8_IMMINENT_DEPRECATION_WARNINGS -DICU_UTIL_DATA_IMPL=ICU_UTIL_DATA_STATIC -I../deps/v8 -I../deps -I/usr/include/openssl-1.0  -pthread -Wall -Wextra -Wno-unused-parameter -m64 -fno-strict-aliasing -m64 -fdata-sections -ffunction-sections -O3 -O3 -fno-omit-frame-pointer -fno-rtti -fno-exceptions -std=gnu++0x -MMD -MF /pkg/src/node-v6.11.0/out/Release/.deps//pkg/src/node-v6.11.0/out/Release/obj.target/v8_base/deps/v8/src/crankshaft/hydrogen-representation-changes.o.d.raw -D_FORTIFY_SOURCE=2 -march=x86-64 -mtune=generic -O2 -pipe -fstack-protector-strong -c -o /pkg/src/node-v6.11.0/out/Release/obj.target/v8_base/deps/v8/src/crankshaft/hydrogen-representation-changes.o ../deps/v8/src/crankshaft/hydrogen-representation-changes.cc
701  [06/10/2017 12:04AM]:                  from ../deps/v8/src/crankshaft/hydrogen-representation-changes.h:8,
702  [06/10/2017 12:04AM]:                  from ../deps/v8/src/crankshaft/hydrogen-representation-changes.cc:5:
703  [06/10/2017 12:04AM]:   g++ -DV8_TARGET_ARCH_X64 -DENABLE_DISASSEMBLER -DV8_I18N_SUPPORT -DV8_IMMINENT_DEPRECATION_WARNINGS -DICU_UTIL_DATA_IMPL=ICU_UTIL_DATA_STATIC -I../deps/v8 -I../deps -I/usr/include/openssl-1.0  -pthread -Wall -Wextra -Wno-unused-parameter -m64 -fno-strict-aliasing -m64 -fdata-sections -ffunction-sections -O3 -O3 -fno-omit-frame-pointer -fno-rtti -fno-exceptions -std=gnu++0x -MMD -MF /pkg/src/node-v6.11.0/out/Release/.deps//pkg/src/node-v6.11.0/out/Release/obj.target/v8_base/deps/v8/src/crankshaft/hydrogen-sce.o.d.raw -D_FORTIFY_SOURCE=2 -march=x86-64 -mtune=generic -O2 -pipe -fstack-protector-strong -c -o /pkg/src/node-v6.11.0/out/Release/obj.target/v8_base/deps/v8/src/crankshaft/hydrogen-sce.o ../deps/v8/src/crankshaft/hydrogen-sce.cc
704  [06/10/2017 12:04AM]:                  from ../deps/v8/src/crankshaft/hydrogen-sce.h:8,
705  [06/10/2017 12:04AM]:                  from ../deps/v8/src/crankshaft/hydrogen-sce.cc:5:
706  [06/10/2017 12:04AM]:   g++ -DV8_TARGET_ARCH_X64 -DENABLE_DISASSEMBLER -DV8_I18N_SUPPORT -DV8_IMMINENT_DEPRECATION_WARNINGS -DICU_UTIL_DATA_IMPL=ICU_UTIL_DATA_STATIC -I../deps/v8 -I../deps -I/usr/include/openssl-1.0  -pthread -Wall -Wextra -Wno-unused-parameter -m64 -fno-strict-aliasing -m64 -fdata-sections -ffunction-sections -O3 -O3 -fno-omit-frame-pointer -fno-rtti -fno-exceptions -std=gnu++0x -MMD -MF /pkg/src/node-v6.11.0/out/Release/.deps//pkg/src/node-v6.11.0/out/Release/obj.target/v8_base/deps/v8/src/crankshaft/hydrogen-store-elimination.o.d.raw -D_FORTIFY_SOURCE=2 -march=x86-64 -mtune=generic -O2 -pipe -fstack-protector-strong -c -o /pkg/src/node-v6.11.0/out/Release/obj.target/v8_base/deps/v8/src/crankshaft/hydrogen-store-elimination.o ../deps/v8/src/crankshaft/hydrogen-store-elimination.cc
707  [06/10/2017 12:04AM]:                  from ../deps/v8/src/crankshaft/hydrogen-store-elimination.h:8,
708  [06/10/2017 12:04AM]:                  from ../deps/v8/src/crankshaft/hydrogen-store-elimination.cc:5:
709  [06/10/2017 12:04AM]:   g++ -DV8_TARGET_ARCH_X64 -DENABLE_DISASSEMBLER -DV8_I18N_SUPPORT -DV8_IMMINENT_DEPRECATION_WARNINGS -DICU_UTIL_DATA_IMPL=ICU_UTIL_DATA_STATIC -I../deps/v8 -I../deps -I/usr/include/openssl-1.0  -pthread -Wall -Wextra -Wno-unused-parameter -m64 -fno-strict-aliasing -m64 -fdata-sections -ffunction-sections -O3 -O3 -fno-omit-frame-pointer -fno-rtti -fno-exceptions -std=gnu++0x -MMD -MF /pkg/src/node-v6.11.0/out/Release/.deps//pkg/src/node-v6.11.0/out/Release/obj.target/v8_base/deps/v8/src/crankshaft/hydrogen-types.o.d.raw -D_FORTIFY_SOURCE=2 -march=x86-64 -mtune=generic -O2 -pipe -fstack-protector-strong -c -o /pkg/src/node-v6.11.0/out/Release/obj.target/v8_base/deps/v8/src/crankshaft/hydrogen-types.o ../deps/v8/src/crankshaft/hydrogen-types.cc
710  [06/10/2017 12:04AM]:                  from ../deps/v8/src/crankshaft/hydrogen-types.h:12,
711  [06/10/2017 12:04AM]:                  from ../deps/v8/src/crankshaft/hydrogen-types.cc:5:
712  [06/10/2017 12:04AM]:                  from ../deps/v8/src/types.h:8,
713  [06/10/2017 12:04AM]:   g++ -DV8_TARGET_ARCH_X64 -DENABLE_DISASSEMBLER -DV8_I18N_SUPPORT -DV8_IMMINENT_DEPRECATION_WARNINGS -DICU_UTIL_DATA_IMPL=ICU_UTIL_DATA_STATIC -I../deps/v8 -I../deps -I/usr/include/openssl-1.0  -pthread -Wall -Wextra -Wno-unused-parameter -m64 -fno-strict-aliasing -m64 -fdata-sections -ffunction-sections -O3 -O3 -fno-omit-frame-pointer -fno-rtti -fno-exceptions -std=gnu++0x -MMD -MF /pkg/src/node-v6.11.0/out/Release/.deps//pkg/src/node-v6.11.0/out/Release/obj.target/v8_base/deps/v8/src/crankshaft/hydrogen-uint32-analysis.o.d.raw -D_FORTIFY_SOURCE=2 -march=x86-64 -mtune=generic -O2 -pipe -fstack-protector-strong -c -o /pkg/src/node-v6.11.0/out/Release/obj.target/v8_base/deps/v8/src/crankshaft/hydrogen-uint32-analysis.o ../deps/v8/src/crankshaft/hydrogen-uint32-analysis.cc
714  [06/10/2017 12:04AM]:                  from ../deps/v8/src/crankshaft/hydrogen-uint32-analysis.h:8,
715  [06/10/2017 12:04AM]:                  from ../deps/v8/src/crankshaft/hydrogen-uint32-analysis.cc:5:
716  [06/10/2017 12:04AM]:   g++ -DV8_TARGET_ARCH_X64 -DENABLE_DISASSEMBLER -DV8_I18N_SUPPORT -DV8_IMMINENT_DEPRECATION_WARNINGS -DICU_UTIL_DATA_IMPL=ICU_UTIL_DATA_STATIC -I../deps/v8 -I../deps -I/usr/include/openssl-1.0  -pthread -Wall -Wextra -Wno-unused-parameter -m64 -fno-strict-aliasing -m64 -fdata-sections -ffunction-sections -O3 -O3 -fno-omit-frame-pointer -fno-rtti -fno-exceptions -std=gnu++0x -MMD -MF /pkg/src/node-v6.11.0/out/Release/.deps//pkg/src/node-v6.11.0/out/Release/obj.target/v8_base/deps/v8/src/crankshaft/hydrogen.o.d.raw -D_FORTIFY_SOURCE=2 -march=x86-64 -mtune=generic -O2 -pipe -fstack-protector-strong -c -o /pkg/src/node-v6.11.0/out/Release/obj.target/v8_base/deps/v8/src/crankshaft/hydrogen.o ../deps/v8/src/crankshaft/hydrogen.cc
717  [06/10/2017 12:04AM]:                  from ../deps/v8/src/crankshaft/hydrogen.cc:5:
718  [06/10/2017 12:04AM]: ../deps/v8/src/crankshaft/hydrogen.cc: In member function bool v8::internal::HOptimizedGraphBuilder::TryInlineBuiltinFunctionCall(v8::internal::Call*):
719  [06/10/2017 12:04AM]: ../deps/v8/src/crankshaft/hydrogen.cc:8706:7: warning: this statement may fall through [-Wimplicit-fallthrough=]
720  [06/10/2017 12:04AM]:        if (!FLAG_fast_math) break;
721  [06/10/2017 12:04AM]: ../deps/v8/src/crankshaft/hydrogen.cc:8708:5: note: here
722  [06/10/2017 12:04AM]: ../deps/v8/src/crankshaft/hydrogen.cc: In member function bool v8::internal::HOptimizedGraphBuilder::TryInlineBuiltinMethodCall(v8::internal::Call*, v8::internal::Handle<v8::internal::JSFunction>, v8::internal::Handle<v8::internal::Map>, int):
723  [06/10/2017 12:04AM]: ../deps/v8/src/crankshaft/hydrogen.cc:8837:7: warning: this statement may fall through [-Wimplicit-fallthrough=]
724  [06/10/2017 12:04AM]: ../deps/v8/src/crankshaft/hydrogen.cc:8839:5: note: here
725  [06/10/2017 12:04AM]:   g++ -DV8_TARGET_ARCH_X64 -DENABLE_DISASSEMBLER -DV8_I18N_SUPPORT -DV8_IMMINENT_DEPRECATION_WARNINGS -DICU_UTIL_DATA_IMPL=ICU_UTIL_DATA_STATIC -I../deps/v8 -I../deps -I/usr/include/openssl-1.0  -pthread -Wall -Wextra -Wno-unused-parameter -m64 -fno-strict-aliasing -m64 -fdata-sections -ffunction-sections -O3 -O3 -fno-omit-frame-pointer -fno-rtti -fno-exceptions -std=gnu++0x -MMD -MF /pkg/src/node-v6.11.0/out/Release/.deps//pkg/src/node-v6.11.0/out/Release/obj.target/v8_base/deps/v8/src/crankshaft/lithium-allocator.o.d.raw -D_FORTIFY_SOURCE=2 -march=x86-64 -mtune=generic -O2 -pipe -fstack-protector-strong -c -o /pkg/src/node-v6.11.0/out/Release/obj.target/v8_base/deps/v8/src/crankshaft/lithium-allocator.o ../deps/v8/src/crankshaft/lithium-allocator.cc
726  [06/10/2017 12:04AM]:                  from ../deps/v8/src/crankshaft/lithium-allocator.h:9,
727  [06/10/2017 12:04AM]:                  from ../deps/v8/src/crankshaft/lithium-allocator.cc:5:
728  [06/10/2017 12:04AM]:                  from ../deps/v8/src/crankshaft/lithium-allocator.h:8,
729  [06/10/2017 12:04AM]:   g++ -DV8_TARGET_ARCH_X64 -DENABLE_DISASSEMBLER -DV8_I18N_SUPPORT -DV8_IMMINENT_DEPRECATION_WARNINGS -DICU_UTIL_DATA_IMPL=ICU_UTIL_DATA_STATIC -I../deps/v8 -I../deps -I/usr/include/openssl-1.0  -pthread -Wall -Wextra -Wno-unused-parameter -m64 -fno-strict-aliasing -m64 -fdata-sections -ffunction-sections -O3 -O3 -fno-omit-frame-pointer -fno-rtti -fno-exceptions -std=gnu++0x -MMD -MF /pkg/src/node-v6.11.0/out/Release/.deps//pkg/src/node-v6.11.0/out/Release/obj.target/v8_base/deps/v8/src/crankshaft/lithium-codegen.o.d.raw -D_FORTIFY_SOURCE=2 -march=x86-64 -mtune=generic -O2 -pipe -fstack-protector-strong -c -o /pkg/src/node-v6.11.0/out/Release/obj.target/v8_base/deps/v8/src/crankshaft/lithium-codegen.o ../deps/v8/src/crankshaft/lithium-codegen.cc
730  [06/10/2017 12:04AM]:                  from ../deps/v8/src/crankshaft/lithium-codegen.h:9,
731  [06/10/2017 12:04AM]:                  from ../deps/v8/src/crankshaft/lithium-codegen.cc:5:
732  [06/10/2017 12:04AM]:   g++ -DV8_TARGET_ARCH_X64 -DENABLE_DISASSEMBLER -DV8_I18N_SUPPORT -DV8_IMMINENT_DEPRECATION_WARNINGS -DICU_UTIL_DATA_IMPL=ICU_UTIL_DATA_STATIC -I../deps/v8 -I../deps -I/usr/include/openssl-1.0  -pthread -Wall -Wextra -Wno-unused-parameter -m64 -fno-strict-aliasing -m64 -fdata-sections -ffunction-sections -O3 -O3 -fno-omit-frame-pointer -fno-rtti -fno-exceptions -std=gnu++0x -MMD -MF /pkg/src/node-v6.11.0/out/Release/.deps//pkg/src/node-v6.11.0/out/Release/obj.target/v8_base/deps/v8/src/crankshaft/lithium.o.d.raw -D_FORTIFY_SOURCE=2 -march=x86-64 -mtune=generic -O2 -pipe -fstack-protector-strong -c -o /pkg/src/node-v6.11.0/out/Release/obj.target/v8_base/deps/v8/src/crankshaft/lithium.o ../deps/v8/src/crankshaft/lithium.cc
733  [06/10/2017 12:04AM]:                  from ../deps/v8/src/crankshaft/lithium.h:12,
734  [06/10/2017 12:04AM]:                  from ../deps/v8/src/crankshaft/lithium.cc:5:
735  [06/10/2017 12:04AM]:                  from ../deps/v8/src/crankshaft/lithium.h:10,
736  [06/10/2017 12:04AM]:   g++ -DV8_TARGET_ARCH_X64 -DENABLE_DISASSEMBLER -DV8_I18N_SUPPORT -DV8_IMMINENT_DEPRECATION_WARNINGS -DICU_UTIL_DATA_IMPL=ICU_UTIL_DATA_STATIC -I../deps/v8 -I../deps -I/usr/include/openssl-1.0  -pthread -Wall -Wextra -Wno-unused-parameter -m64 -fno-strict-aliasing -m64 -fdata-sections -ffunction-sections -O3 -O3 -fno-omit-frame-pointer -fno-rtti -fno-exceptions -std=gnu++0x -MMD -MF /pkg/src/node-v6.11.0/out/Release/.deps//pkg/src/node-v6.11.0/out/Release/obj.target/v8_base/deps/v8/src/crankshaft/typing.o.d.raw -D_FORTIFY_SOURCE=2 -march=x86-64 -mtune=generic -O2 -pipe -fstack-protector-strong -c -o /pkg/src/node-v6.11.0/out/Release/obj.target/v8_base/deps/v8/src/crankshaft/typing.o ../deps/v8/src/crankshaft/typing.cc
737  [06/10/2017 12:04AM]:                  from ../deps/v8/src/crankshaft/typing.h:9,
738  [06/10/2017 12:04AM]:                  from ../deps/v8/src/crankshaft/typing.cc:5:
739  [06/10/2017 12:04AM]:                  from ../deps/v8/src/crankshaft/typing.h:8,
740  [06/10/2017 12:04AM]:   g++ -DV8_TARGET_ARCH_X64 -DENABLE_DISASSEMBLER -DV8_I18N_SUPPORT -DV8_IMMINENT_DEPRECATION_WARNINGS -DICU_UTIL_DATA_IMPL=ICU_UTIL_DATA_STATIC -I../deps/v8 -I../deps -I/usr/include/openssl-1.0  -pthread -Wall -Wextra -Wno-unused-parameter -m64 -fno-strict-aliasing -m64 -fdata-sections -ffunction-sections -O3 -O3 -fno-omit-frame-pointer -fno-rtti -fno-exceptions -std=gnu++0x -MMD -MF /pkg/src/node-v6.11.0/out/Release/.deps//pkg/src/node-v6.11.0/out/Release/obj.target/v8_base/deps/v8/src/date.o.d.raw -D_FORTIFY_SOURCE=2 -march=x86-64 -mtune=generic -O2 -pipe -fstack-protector-strong -c -o /pkg/src/node-v6.11.0/out/Release/obj.target/v8_base/deps/v8/src/date.o ../deps/v8/src/date.cc
741  [06/10/2017 12:04AM]: In file included from ../deps/v8/src/date.cc:7:0:
742  [06/10/2017 12:04AM]:                  from ../deps/v8/src/date.h:8,
743  [06/10/2017 12:04AM]:                  from ../deps/v8/src/date.cc:5:
744  [06/10/2017 12:04AM]:   g++ -DV8_TARGET_ARCH_X64 -DENABLE_DISASSEMBLER -DV8_I18N_SUPPORT -DV8_IMMINENT_DEPRECATION_WARNINGS -DICU_UTIL_DATA_IMPL=ICU_UTIL_DATA_STATIC -I../deps/v8 -I../deps -I/usr/include/openssl-1.0  -pthread -Wall -Wextra -Wno-unused-parameter -m64 -fno-strict-aliasing -m64 -fdata-sections -ffunction-sections -O3 -O3 -fno-omit-frame-pointer -fno-rtti -fno-exceptions -std=gnu++0x -MMD -MF /pkg/src/node-v6.11.0/out/Release/.deps//pkg/src/node-v6.11.0/out/Release/obj.target/v8_base/deps/v8/src/dateparser.o.d.raw -D_FORTIFY_SOURCE=2 -march=x86-64 -mtune=generic -O2 -pipe -fstack-protector-strong -c -o /pkg/src/node-v6.11.0/out/Release/obj.target/v8_base/deps/v8/src/dateparser.o ../deps/v8/src/dateparser.cc
745  [06/10/2017 12:04AM]:                  from ../deps/v8/src/dateparser.cc:8:
746  [06/10/2017 12:04AM]:                  from ../deps/v8/src/dateparser.h:8,
747  [06/10/2017 12:04AM]:                  from ../deps/v8/src/dateparser.cc:5:
748  [06/10/2017 12:05AM]:   g++ -DV8_TARGET_ARCH_X64 -DENABLE_DISASSEMBLER -DV8_I18N_SUPPORT -DV8_IMMINENT_DEPRECATION_WARNINGS -DICU_UTIL_DATA_IMPL=ICU_UTIL_DATA_STATIC -I../deps/v8 -I../deps -I/usr/include/openssl-1.0  -pthread -Wall -Wextra -Wno-unused-parameter -m64 -fno-strict-aliasing -m64 -fdata-sections -ffunction-sections -O3 -O3 -fno-omit-frame-pointer -fno-rtti -fno-exceptions -std=gnu++0x -MMD -MF /pkg/src/node-v6.11.0/out/Release/.deps//pkg/src/node-v6.11.0/out/Release/obj.target/v8_base/deps/v8/src/debug/debug-evaluate.o.d.raw -D_FORTIFY_SOURCE=2 -march=x86-64 -mtune=generic -O2 -pipe -fstack-protector-strong -c -o /pkg/src/node-v6.11.0/out/Release/obj.target/v8_base/deps/v8/src/debug/debug-evaluate.o ../deps/v8/src/debug/debug-evaluate.cc
749  [06/10/2017 12:05AM]:                  from ../deps/v8/src/debug/debug-evaluate.h:8,
750  [06/10/2017 12:05AM]:                  from ../deps/v8/src/debug/debug-evaluate.cc:5:
751  [06/10/2017 12:05AM]:                  from ../deps/v8/src/frames.h:8,
752  [06/10/2017 12:05AM]:   g++ -DV8_TARGET_ARCH_X64 -DENABLE_DISASSEMBLER -DV8_I18N_SUPPORT -DV8_IMMINENT_DEPRECATION_WARNINGS -DICU_UTIL_DATA_IMPL=ICU_UTIL_DATA_STATIC -I../deps/v8 -I../deps -I/usr/include/openssl-1.0  -pthread -Wall -Wextra -Wno-unused-parameter -m64 -fno-strict-aliasing -m64 -fdata-sections -ffunction-sections -O3 -O3 -fno-omit-frame-pointer -fno-rtti -fno-exceptions -std=gnu++0x -MMD -MF /pkg/src/node-v6.11.0/out/Release/.deps//pkg/src/node-v6.11.0/out/Release/obj.target/v8_base/deps/v8/src/debug/debug-frames.o.d.raw -D_FORTIFY_SOURCE=2 -march=x86-64 -mtune=generic -O2 -pipe -fstack-protector-strong -c -o /pkg/src/node-v6.11.0/out/Release/obj.target/v8_base/deps/v8/src/debug/debug-frames.o ../deps/v8/src/debug/debug-frames.cc
753  [06/10/2017 12:05AM]:                  from ../deps/v8/src/macro-assembler.h:8,
754  [06/10/2017 12:05AM]:                  from ../deps/v8/src/deoptimizer.h:9,
755  [06/10/2017 12:05AM]:                  from ../deps/v8/src/debug/debug-frames.h:8,
756  [06/10/2017 12:05AM]:                  from ../deps/v8/src/debug/debug-frames.cc:5:
757  [06/10/2017 12:05AM]:                  from ../deps/v8/src/deoptimizer.h:8,
758  [06/10/2017 12:05AM]:   g++ -DV8_TARGET_ARCH_X64 -DENABLE_DISASSEMBLER -DV8_I18N_SUPPORT -DV8_IMMINENT_DEPRECATION_WARNINGS -DICU_UTIL_DATA_IMPL=ICU_UTIL_DATA_STATIC -I../deps/v8 -I../deps -I/usr/include/openssl-1.0  -pthread -Wall -Wextra -Wno-unused-parameter -m64 -fno-strict-aliasing -m64 -fdata-sections -ffunction-sections -O3 -O3 -fno-omit-frame-pointer -fno-rtti -fno-exceptions -std=gnu++0x -MMD -MF /pkg/src/node-v6.11.0/out/Release/.deps//pkg/src/node-v6.11.0/out/Release/obj.target/v8_base/deps/v8/src/debug/debug-scopes.o.d.raw -D_FORTIFY_SOURCE=2 -march=x86-64 -mtune=generic -O2 -pipe -fstack-protector-strong -c -o /pkg/src/node-v6.11.0/out/Release/obj.target/v8_base/deps/v8/src/debug/debug-scopes.o ../deps/v8/src/debug/debug-scopes.cc
759  [06/10/2017 12:05AM]:                  from ../deps/v8/src/debug/debug-scopes.h:8,
760  [06/10/2017 12:05AM]:                  from ../deps/v8/src/debug/debug-scopes.cc:5:
761  [06/10/2017 12:05AM]:   g++ -DV8_TARGET_ARCH_X64 -DENABLE_DISASSEMBLER -DV8_I18N_SUPPORT -DV8_IMMINENT_DEPRECATION_WARNINGS -DICU_UTIL_DATA_IMPL=ICU_UTIL_DATA_STATIC -I../deps/v8 -I../deps -I/usr/include/openssl-1.0  -pthread -Wall -Wextra -Wno-unused-parameter -m64 -fno-strict-aliasing -m64 -fdata-sections -ffunction-sections -O3 -O3 -fno-omit-frame-pointer -fno-rtti -fno-exceptions -std=gnu++0x -MMD -MF /pkg/src/node-v6.11.0/out/Release/.deps//pkg/src/node-v6.11.0/out/Release/obj.target/v8_base/deps/v8/src/debug/debug.o.d.raw -D_FORTIFY_SOURCE=2 -march=x86-64 -mtune=generic -O2 -pipe -fstack-protector-strong -c -o /pkg/src/node-v6.11.0/out/Release/obj.target/v8_base/deps/v8/src/debug/debug.o ../deps/v8/src/debug/debug.cc
762  [06/10/2017 12:05AM]:                  from ../deps/v8/src/debug/debug.cc:5:
763  [06/10/2017 12:05AM]:   g++ -DV8_TARGET_ARCH_X64 -DENABLE_DISASSEMBLER -DV8_I18N_SUPPORT -DV8_IMMINENT_DEPRECATION_WARNINGS -DICU_UTIL_DATA_IMPL=ICU_UTIL_DATA_STATIC -I../deps/v8 -I../deps -I/usr/include/openssl-1.0  -pthread -Wall -Wextra -Wno-unused-parameter -m64 -fno-strict-aliasing -m64 -fdata-sections -ffunction-sections -O3 -O3 -fno-omit-frame-pointer -fno-rtti -fno-exceptions -std=gnu++0x -MMD -MF /pkg/src/node-v6.11.0/out/Release/.deps//pkg/src/node-v6.11.0/out/Release/obj.target/v8_base/deps/v8/src/debug/liveedit.o.d.raw -D_FORTIFY_SOURCE=2 -march=x86-64 -mtune=generic -O2 -pipe -fstack-protector-strong -c -o /pkg/src/node-v6.11.0/out/Release/obj.target/v8_base/deps/v8/src/debug/liveedit.o ../deps/v8/src/debug/liveedit.cc
764  [06/10/2017 12:05AM]:                  from ../deps/v8/src/debug/liveedit.h:29,
765  [06/10/2017 12:05AM]:                  from ../deps/v8/src/debug/liveedit.cc:5:
766  [06/10/2017 12:05AM]:                  from ../deps/v8/src/debug/liveedit.h:28,
767  [06/10/2017 12:05AM]:   g++ -DV8_TARGET_ARCH_X64 -DENABLE_DISASSEMBLER -DV8_I18N_SUPPORT -DV8_IMMINENT_DEPRECATION_WARNINGS -DICU_UTIL_DATA_IMPL=ICU_UTIL_DATA_STATIC -I../deps/v8 -I../deps -I/usr/include/openssl-1.0  -pthread -Wall -Wextra -Wno-unused-parameter -m64 -fno-strict-aliasing -m64 -fdata-sections -ffunction-sections -O3 -O3 -fno-omit-frame-pointer -fno-rtti -fno-exceptions -std=gnu++0x -MMD -MF /pkg/src/node-v6.11.0/out/Release/.deps//pkg/src/node-v6.11.0/out/Release/obj.target/v8_base/deps/v8/src/deoptimizer.o.d.raw -D_FORTIFY_SOURCE=2 -march=x86-64 -mtune=generic -O2 -pipe -fstack-protector-strong -c -o /pkg/src/node-v6.11.0/out/Release/obj.target/v8_base/deps/v8/src/deoptimizer.o ../deps/v8/src/deoptimizer.cc
768  [06/10/2017 12:05AM]:                  from ../deps/v8/src/deoptimizer.cc:5:
769  [06/10/2017 12:05AM]:   g++ -DV8_TARGET_ARCH_X64 -DENABLE_DISASSEMBLER -DV8_I18N_SUPPORT -DV8_IMMINENT_DEPRECATION_WARNINGS -DICU_UTIL_DATA_IMPL=ICU_UTIL_DATA_STATIC -I../deps/v8 -I../deps -I/usr/include/openssl-1.0  -pthread -Wall -Wextra -Wno-unused-parameter -m64 -fno-strict-aliasing -m64 -fdata-sections -ffunction-sections -O3 -O3 -fno-omit-frame-pointer -fno-rtti -fno-exceptions -std=gnu++0x -MMD -MF /pkg/src/node-v6.11.0/out/Release/.deps//pkg/src/node-v6.11.0/out/Release/obj.target/v8_base/deps/v8/src/disassembler.o.d.raw -D_FORTIFY_SOURCE=2 -march=x86-64 -mtune=generic -O2 -pipe -fstack-protector-strong -c -o /pkg/src/node-v6.11.0/out/Release/obj.target/v8_base/deps/v8/src/disassembler.o ../deps/v8/src/disassembler.cc
770  [06/10/2017 12:05AM]:                  from ../deps/v8/src/disassembler.cc:7:
771  [06/10/2017 12:05AM]:                  from ../deps/v8/src/disassembler.h:8,
772  [06/10/2017 12:05AM]:                  from ../deps/v8/src/disassembler.cc:5:
773  [06/10/2017 12:05AM]:   g++ -DV8_TARGET_ARCH_X64 -DENABLE_DISASSEMBLER -DV8_I18N_SUPPORT -DV8_IMMINENT_DEPRECATION_WARNINGS -DICU_UTIL_DATA_IMPL=ICU_UTIL_DATA_STATIC -I../deps/v8 -I../deps -I/usr/include/openssl-1.0  -pthread -Wall -Wextra -Wno-unused-parameter -m64 -fno-strict-aliasing -m64 -fdata-sections -ffunction-sections -O3 -O3 -fno-omit-frame-pointer -fno-rtti -fno-exceptions -std=gnu++0x -MMD -MF /pkg/src/node-v6.11.0/out/Release/.deps//pkg/src/node-v6.11.0/out/Release/obj.target/v8_base/deps/v8/src/diy-fp.o.d.raw -D_FORTIFY_SOURCE=2 -march=x86-64 -mtune=generic -O2 -pipe -fstack-protector-strong -c -o /pkg/src/node-v6.11.0/out/Release/obj.target/v8_base/deps/v8/src/diy-fp.o ../deps/v8/src/diy-fp.cc
774  [06/10/2017 12:05AM]:   g++ -DV8_TARGET_ARCH_X64 -DENABLE_DISASSEMBLER -DV8_I18N_SUPPORT -DV8_IMMINENT_DEPRECATION_WARNINGS -DICU_UTIL_DATA_IMPL=ICU_UTIL_DATA_STATIC -I../deps/v8 -I../deps -I/usr/include/openssl-1.0  -pthread -Wall -Wextra -Wno-unused-parameter -m64 -fno-strict-aliasing -m64 -fdata-sections -ffunction-sections -O3 -O3 -fno-omit-frame-pointer -fno-rtti -fno-exceptions -std=gnu++0x -MMD -MF /pkg/src/node-v6.11.0/out/Release/.deps//pkg/src/node-v6.11.0/out/Release/obj.target/v8_base/deps/v8/src/dtoa.o.d.raw -D_FORTIFY_SOURCE=2 -march=x86-64 -mtune=generic -O2 -pipe -fstack-protector-strong -c -o /pkg/src/node-v6.11.0/out/Release/obj.target/v8_base/deps/v8/src/dtoa.o ../deps/v8/src/dtoa.cc
775  [06/10/2017 12:05AM]:   g++ -DV8_TARGET_ARCH_X64 -DENABLE_DISASSEMBLER -DV8_I18N_SUPPORT -DV8_IMMINENT_DEPRECATION_WARNINGS -DICU_UTIL_DATA_IMPL=ICU_UTIL_DATA_STATIC -I../deps/v8 -I../deps -I/usr/include/openssl-1.0  -pthread -Wall -Wextra -Wno-unused-parameter -m64 -fno-strict-aliasing -m64 -fdata-sections -ffunction-sections -O3 -O3 -fno-omit-frame-pointer -fno-rtti -fno-exceptions -std=gnu++0x -MMD -MF /pkg/src/node-v6.11.0/out/Release/.deps//pkg/src/node-v6.11.0/out/Release/obj.target/v8_base/deps/v8/src/elements-kind.o.d.raw -D_FORTIFY_SOURCE=2 -march=x86-64 -mtune=generic -O2 -pipe -fstack-protector-strong -c -o /pkg/src/node-v6.11.0/out/Release/obj.target/v8_base/deps/v8/src/elements-kind.o ../deps/v8/src/elements-kind.cc
776  [06/10/2017 12:05AM]:                  from ../deps/v8/src/elements-kind.cc:7:
777  [06/10/2017 12:05AM]: In file included from ../deps/v8/src/checks.h:8:0,
778  [06/10/2017 12:05AM]:                  from ../deps/v8/src/elements-kind.h:9,
779  [06/10/2017 12:05AM]:                  from ../deps/v8/src/elements-kind.cc:5:
780  [06/10/2017 12:05AM]:   g++ -DV8_TARGET_ARCH_X64 -DENABLE_DISASSEMBLER -DV8_I18N_SUPPORT -DV8_IMMINENT_DEPRECATION_WARNINGS -DICU_UTIL_DATA_IMPL=ICU_UTIL_DATA_STATIC -I../deps/v8 -I../deps -I/usr/include/openssl-1.0  -pthread -Wall -Wextra -Wno-unused-parameter -m64 -fno-strict-aliasing -m64 -fdata-sections -ffunction-sections -O3 -O3 -fno-omit-frame-pointer -fno-rtti -fno-exceptions -std=gnu++0x -MMD -MF /pkg/src/node-v6.11.0/out/Release/.deps//pkg/src/node-v6.11.0/out/Release/obj.target/v8_base/deps/v8/src/elements.o.d.raw -D_FORTIFY_SOURCE=2 -march=x86-64 -mtune=generic -O2 -pipe -fstack-protector-strong -c -o /pkg/src/node-v6.11.0/out/Release/obj.target/v8_base/deps/v8/src/elements.o ../deps/v8/src/elements.cc
781  [06/10/2017 12:05AM]:                  from ../deps/v8/src/elements.h:9,
782  [06/10/2017 12:05AM]:                  from ../deps/v8/src/elements.cc:5:
783  [06/10/2017 12:05AM]:                  from ../deps/v8/src/elements.h:8,
784  [06/10/2017 12:05AM]:   g++ -DV8_TARGET_ARCH_X64 -DENABLE_DISASSEMBLER -DV8_I18N_SUPPORT -DV8_IMMINENT_DEPRECATION_WARNINGS -DICU_UTIL_DATA_IMPL=ICU_UTIL_DATA_STATIC -I../deps/v8 -I../deps -I/usr/include/openssl-1.0  -pthread -Wall -Wextra -Wno-unused-parameter -m64 -fno-strict-aliasing -m64 -fdata-sections -ffunction-sections -O3 -O3 -fno-omit-frame-pointer -fno-rtti -fno-exceptions -std=gnu++0x -MMD -MF /pkg/src/node-v6.11.0/out/Release/.deps//pkg/src/node-v6.11.0/out/Release/obj.target/v8_base/deps/v8/src/execution.o.d.raw -D_FORTIFY_SOURCE=2 -march=x86-64 -mtune=generic -O2 -pipe -fstack-protector-strong -c -o /pkg/src/node-v6.11.0/out/Release/obj.target/v8_base/deps/v8/src/execution.o ../deps/v8/src/execution.cc
785  [06/10/2017 12:05AM]:                  from ../deps/v8/src/execution.cc:7:
786  [06/10/2017 12:05AM]:                  from ../deps/v8/src/execution.h:8,
787  [06/10/2017 12:05AM]:                  from ../deps/v8/src/execution.cc:5:
788  [06/10/2017 12:05AM]:   g++ -DV8_TARGET_ARCH_X64 -DENABLE_DISASSEMBLER -DV8_I18N_SUPPORT -DV8_IMMINENT_DEPRECATION_WARNINGS -DICU_UTIL_DATA_IMPL=ICU_UTIL_DATA_STATIC -I../deps/v8 -I../deps -I/usr/include/openssl-1.0  -pthread -Wall -Wextra -Wno-unused-parameter -m64 -fno-strict-aliasing -m64 -fdata-sections -ffunction-sections -O3 -O3 -fno-omit-frame-pointer -fno-rtti -fno-exceptions -std=gnu++0x -MMD -MF /pkg/src/node-v6.11.0/out/Release/.deps//pkg/src/node-v6.11.0/out/Release/obj.target/v8_base/deps/v8/src/extensions/externalize-string-extension.o.d.raw -D_FORTIFY_SOURCE=2 -march=x86-64 -mtune=generic -O2 -pipe -fstack-protector-strong -c -o /pkg/src/node-v6.11.0/out/Release/obj.target/v8_base/deps/v8/src/extensions/externalize-string-extension.o ../deps/v8/src/extensions/externalize-string-extension.cc
789  [06/10/2017 12:05AM]:                  from ../deps/v8/src/extensions/externalize-string-extension.cc:7:
790  [06/10/2017 12:05AM]: In file included from ../deps/v8/src/extensions/externalize-string-extension.h:8:0,
791  [06/10/2017 12:05AM]:                  from ../deps/v8/src/extensions/externalize-string-extension.cc:5:
792  [06/10/2017 12:05AM]:   g++ -DV8_TARGET_ARCH_X64 -DENABLE_DISASSEMBLER -DV8_I18N_SUPPORT -DV8_IMMINENT_DEPRECATION_WARNINGS -DICU_UTIL_DATA_IMPL=ICU_UTIL_DATA_STATIC -I../deps/v8 -I../deps -I/usr/include/openssl-1.0  -pthread -Wall -Wextra -Wno-unused-parameter -m64 -fno-strict-aliasing -m64 -fdata-sections -ffunction-sections -O3 -O3 -fno-omit-frame-pointer -fno-rtti -fno-exceptions -std=gnu++0x -MMD -MF /pkg/src/node-v6.11.0/out/Release/.deps//pkg/src/node-v6.11.0/out/Release/obj.target/v8_base/deps/v8/src/extensions/free-buffer-extension.o.d.raw -D_FORTIFY_SOURCE=2 -march=x86-64 -mtune=generic -O2 -pipe -fstack-protector-strong -c -o /pkg/src/node-v6.11.0/out/Release/obj.target/v8_base/deps/v8/src/extensions/free-buffer-extension.o ../deps/v8/src/extensions/free-buffer-extension.cc
793  [06/10/2017 12:05AM]:                  from ../deps/v8/src/extensions/free-buffer-extension.cc:8:
794  [06/10/2017 12:05AM]: In file included from ../deps/v8/src/extensions/free-buffer-extension.h:8:0,
795  [06/10/2017 12:05AM]:                  from ../deps/v8/src/extensions/free-buffer-extension.cc:5:
796  [06/10/2017 12:05AM]:   g++ -DV8_TARGET_ARCH_X64 -DENABLE_DISASSEMBLER -DV8_I18N_SUPPORT -DV8_IMMINENT_DEPRECATION_WARNINGS -DICU_UTIL_DATA_IMPL=ICU_UTIL_DATA_STATIC -I../deps/v8 -I../deps -I/usr/include/openssl-1.0  -pthread -Wall -Wextra -Wno-unused-parameter -m64 -fno-strict-aliasing -m64 -fdata-sections -ffunction-sections -O3 -O3 -fno-omit-frame-pointer -fno-rtti -fno-exceptions -std=gnu++0x -MMD -MF /pkg/src/node-v6.11.0/out/Release/.deps//pkg/src/node-v6.11.0/out/Release/obj.target/v8_base/deps/v8/src/extensions/gc-extension.o.d.raw -D_FORTIFY_SOURCE=2 -march=x86-64 -mtune=generic -O2 -pipe -fstack-protector-strong -c -o /pkg/src/node-v6.11.0/out/Release/obj.target/v8_base/deps/v8/src/extensions/gc-extension.o ../deps/v8/src/extensions/gc-extension.cc
797  [06/10/2017 12:05AM]:   g++ -DV8_TARGET_ARCH_X64 -DENABLE_DISASSEMBLER -DV8_I18N_SUPPORT -DV8_IMMINENT_DEPRECATION_WARNINGS -DICU_UTIL_DATA_IMPL=ICU_UTIL_DATA_STATIC -I../deps/v8 -I../deps -I/usr/include/openssl-1.0  -pthread -Wall -Wextra -Wno-unused-parameter -m64 -fno-strict-aliasing -m64 -fdata-sections -ffunction-sections -O3 -O3 -fno-omit-frame-pointer -fno-rtti -fno-exceptions -std=gnu++0x -MMD -MF /pkg/src/node-v6.11.0/out/Release/.deps//pkg/src/node-v6.11.0/out/Release/obj.target/v8_base/deps/v8/src/extensions/statistics-extension.o.d.raw -D_FORTIFY_SOURCE=2 -march=x86-64 -mtune=generic -O2 -pipe -fstack-protector-strong -c -o /pkg/src/node-v6.11.0/out/Release/obj.target/v8_base/deps/v8/src/extensions/statistics-extension.o ../deps/v8/src/extensions/statistics-extension.cc
798  [06/10/2017 12:05AM]:                  from ../deps/v8/src/extensions/statistics-extension.cc:7:
799  [06/10/2017 12:05AM]: In file included from ../deps/v8/src/extensions/statistics-extension.h:8:0,
800  [06/10/2017 12:05AM]:                  from ../deps/v8/src/extensions/statistics-extension.cc:5:
801  [06/10/2017 12:05AM]:   g++ -DV8_TARGET_ARCH_X64 -DENABLE_DISASSEMBLER -DV8_I18N_SUPPORT -DV8_IMMINENT_DEPRECATION_WARNINGS -DICU_UTIL_DATA_IMPL=ICU_UTIL_DATA_STATIC -I../deps/v8 -I../deps -I/usr/include/openssl-1.0  -pthread -Wall -Wextra -Wno-unused-parameter -m64 -fno-strict-aliasing -m64 -fdata-sections -ffunction-sections -O3 -O3 -fno-omit-frame-pointer -fno-rtti -fno-exceptions -std=gnu++0x -MMD -MF /pkg/src/node-v6.11.0/out/Release/.deps//pkg/src/node-v6.11.0/out/Release/obj.target/v8_base/deps/v8/src/extensions/trigger-failure-extension.o.d.raw -D_FORTIFY_SOURCE=2 -march=x86-64 -mtune=generic -O2 -pipe -fstack-protector-strong -c -o /pkg/src/node-v6.11.0/out/Release/obj.target/v8_base/deps/v8/src/extensions/trigger-failure-extension.o ../deps/v8/src/extensions/trigger-failure-extension.cc
802  [06/10/2017 12:05AM]:   g++ -DV8_TARGET_ARCH_X64 -DENABLE_DISASSEMBLER -DV8_I18N_SUPPORT -DV8_IMMINENT_DEPRECATION_WARNINGS -DICU_UTIL_DATA_IMPL=ICU_UTIL_DATA_STATIC -I../deps/v8 -I../deps -I/usr/include/openssl-1.0  -pthread -Wall -Wextra -Wno-unused-parameter -m64 -fno-strict-aliasing -m64 -fdata-sections -ffunction-sections -O3 -O3 -fno-omit-frame-pointer -fno-rtti -fno-exceptions -std=gnu++0x -MMD -MF /pkg/src/node-v6.11.0/out/Release/.deps//pkg/src/node-v6.11.0/out/Release/obj.target/v8_base/deps/v8/src/external-reference-table.o.d.raw -D_FORTIFY_SOURCE=2 -march=x86-64 -mtune=generic -O2 -pipe -fstack-protector-strong -c -o /pkg/src/node-v6.11.0/out/Release/obj.target/v8_base/deps/v8/src/external-reference-table.o ../deps/v8/src/external-reference-table.cc
803  [06/10/2017 12:05AM]:                  from ../deps/v8/src/external-reference-table.h:8,
804  [06/10/2017 12:05AM]:                  from ../deps/v8/src/external-reference-table.cc:5:
805  [06/10/2017 12:05AM]:   g++ -DV8_TARGET_ARCH_X64 -DENABLE_DISASSEMBLER -DV8_I18N_SUPPORT -DV8_IMMINENT_DEPRECATION_WARNINGS -DICU_UTIL_DATA_IMPL=ICU_UTIL_DATA_STATIC -I../deps/v8 -I../deps -I/usr/include/openssl-1.0  -pthread -Wall -Wextra -Wno-unused-parameter -m64 -fno-strict-aliasing -m64 -fdata-sections -ffunction-sections -O3 -O3 -fno-omit-frame-pointer -fno-rtti -fno-exceptions -std=gnu++0x -MMD -MF /pkg/src/node-v6.11.0/out/Release/.deps//pkg/src/node-v6.11.0/out/Release/obj.target/v8_base/deps/v8/src/factory.o.d.raw -D_FORTIFY_SOURCE=2 -march=x86-64 -mtune=generic -O2 -pipe -fstack-protector-strong -c -o /pkg/src/node-v6.11.0/out/Release/obj.target/v8_base/deps/v8/src/factory.o ../deps/v8/src/factory.cc
806  [06/10/2017 12:05AM]:                  from ../deps/v8/src/factory.cc:5:
807  [06/10/2017 12:06AM]:   g++ -DV8_TARGET_ARCH_X64 -DENABLE_DISASSEMBLER -DV8_I18N_SUPPORT -DV8_IMMINENT_DEPRECATION_WARNINGS -DICU_UTIL_DATA_IMPL=ICU_UTIL_DATA_STATIC -I../deps/v8 -I../deps -I/usr/include/openssl-1.0  -pthread -Wall -Wextra -Wno-unused-parameter -m64 -fno-strict-aliasing -m64 -fdata-sections -ffunction-sections -O3 -O3 -fno-omit-frame-pointer -fno-rtti -fno-exceptions -std=gnu++0x -MMD -MF /pkg/src/node-v6.11.0/out/Release/.deps//pkg/src/node-v6.11.0/out/Release/obj.target/v8_base/deps/v8/src/fast-accessor-assembler.o.d.raw -D_FORTIFY_SOURCE=2 -march=x86-64 -mtune=generic -O2 -pipe -fstack-protector-strong -c -o /pkg/src/node-v6.11.0/out/Release/obj.target/v8_base/deps/v8/src/fast-accessor-assembler.o ../deps/v8/src/fast-accessor-assembler.cc
808  [06/10/2017 12:06AM]:                  from ../deps/v8/src/fast-accessor-assembler.h:17,
809  [06/10/2017 12:06AM]:                  from ../deps/v8/src/fast-accessor-assembler.cc:5:
810  [06/10/2017 12:06AM]: In file included from ../deps/v8/include/v8-experimental.h:13:0,
811  [06/10/2017 12:06AM]:                  from ../deps/v8/src/fast-accessor-assembler.h:11,
812  [06/10/2017 12:06AM]:   g++ -DV8_TARGET_ARCH_X64 -DENABLE_DISASSEMBLER -DV8_I18N_SUPPORT -DV8_IMMINENT_DEPRECATION_WARNINGS -DICU_UTIL_DATA_IMPL=ICU_UTIL_DATA_STATIC -I../deps/v8 -I../deps -I/usr/include/openssl-1.0  -pthread -Wall -Wextra -Wno-unused-parameter -m64 -fno-strict-aliasing -m64 -fdata-sections -ffunction-sections -O3 -O3 -fno-omit-frame-pointer -fno-rtti -fno-exceptions -std=gnu++0x -MMD -MF /pkg/src/node-v6.11.0/out/Release/.deps//pkg/src/node-v6.11.0/out/Release/obj.target/v8_base/deps/v8/src/fast-dtoa.o.d.raw -D_FORTIFY_SOURCE=2 -march=x86-64 -mtune=generic -O2 -pipe -fstack-protector-strong -c -o /pkg/src/node-v6.11.0/out/Release/obj.target/v8_base/deps/v8/src/fast-dtoa.o ../deps/v8/src/fast-dtoa.cc
813  [06/10/2017 12:06AM]:   g++ -DV8_TARGET_ARCH_X64 -DENABLE_DISASSEMBLER -DV8_I18N_SUPPORT -DV8_IMMINENT_DEPRECATION_WARNINGS -DICU_UTIL_DATA_IMPL=ICU_UTIL_DATA_STATIC -I../deps/v8 -I../deps -I/usr/include/openssl-1.0  -pthread -Wall -Wextra -Wno-unused-parameter -m64 -fno-strict-aliasing -m64 -fdata-sections -ffunction-sections -O3 -O3 -fno-omit-frame-pointer -fno-rtti -fno-exceptions -std=gnu++0x -MMD -MF /pkg/src/node-v6.11.0/out/Release/.deps//pkg/src/node-v6.11.0/out/Release/obj.target/v8_base/deps/v8/src/field-type.o.d.raw -D_FORTIFY_SOURCE=2 -march=x86-64 -mtune=generic -O2 -pipe -fstack-protector-strong -c -o /pkg/src/node-v6.11.0/out/Release/obj.target/v8_base/deps/v8/src/field-type.o ../deps/v8/src/field-type.cc
814  [06/10/2017 12:06AM]: In file included from ../deps/v8/src/field-type.h:9:0,
815  [06/10/2017 12:06AM]:                  from ../deps/v8/src/field-type.cc:5:
816  [06/10/2017 12:06AM]:                  from ../deps/v8/src/field-type.h:8,
817  [06/10/2017 12:06AM]:   g++ -DV8_TARGET_ARCH_X64 -DENABLE_DISASSEMBLER -DV8_I18N_SUPPORT -DV8_IMMINENT_DEPRECATION_WARNINGS -DICU_UTIL_DATA_IMPL=ICU_UTIL_DATA_STATIC -I../deps/v8 -I../deps -I/usr/include/openssl-1.0  -pthread -Wall -Wextra -Wno-unused-parameter -m64 -fno-strict-aliasing -m64 -fdata-sections -ffunction-sections -O3 -O3 -fno-omit-frame-pointer -fno-rtti -fno-exceptions -std=gnu++0x -MMD -MF /pkg/src/node-v6.11.0/out/Release/.deps//pkg/src/node-v6.11.0/out/Release/obj.target/v8_base/deps/v8/src/fixed-dtoa.o.d.raw -D_FORTIFY_SOURCE=2 -march=x86-64 -mtune=generic -O2 -pipe -fstack-protector-strong -c -o /pkg/src/node-v6.11.0/out/Release/obj.target/v8_base/deps/v8/src/fixed-dtoa.o ../deps/v8/src/fixed-dtoa.cc
818  [06/10/2017 12:06AM]:   g++ -DV8_TARGET_ARCH_X64 -DENABLE_DISASSEMBLER -DV8_I18N_SUPPORT -DV8_IMMINENT_DEPRECATION_WARNINGS -DICU_UTIL_DATA_IMPL=ICU_UTIL_DATA_STATIC -I../deps/v8 -I../deps -I/usr/include/openssl-1.0  -pthread -Wall -Wextra -Wno-unused-parameter -m64 -fno-strict-aliasing -m64 -fdata-sections -ffunction-sections -O3 -O3 -fno-omit-frame-pointer -fno-rtti -fno-exceptions -std=gnu++0x -MMD -MF /pkg/src/node-v6.11.0/out/Release/.deps//pkg/src/node-v6.11.0/out/Release/obj.target/v8_base/deps/v8/src/flags.o.d.raw -D_FORTIFY_SOURCE=2 -march=x86-64 -mtune=generic -O2 -pipe -fstack-protector-strong -c -o /pkg/src/node-v6.11.0/out/Release/obj.target/v8_base/deps/v8/src/flags.o ../deps/v8/src/flags.cc
819  [06/10/2017 12:06AM]:                  from ../deps/v8/src/flags.cc:12:
820  [06/10/2017 12:06AM]: In file included from ../deps/v8/src/flags.h:8:0,
821  [06/10/2017 12:06AM]:                  from ../deps/v8/src/flags.cc:5:
822  [06/10/2017 12:06AM]:   g++ -DV8_TARGET_ARCH_X64 -DENABLE_DISASSEMBLER -DV8_I18N_SUPPORT -DV8_IMMINENT_DEPRECATION_WARNINGS -DICU_UTIL_DATA_IMPL=ICU_UTIL_DATA_STATIC -I../deps/v8 -I../deps -I/usr/include/openssl-1.0  -pthread -Wall -Wextra -Wno-unused-parameter -m64 -fno-strict-aliasing -m64 -fdata-sections -ffunction-sections -O3 -O3 -fno-omit-frame-pointer -fno-rtti -fno-exceptions -std=gnu++0x -MMD -MF /pkg/src/node-v6.11.0/out/Release/.deps//pkg/src/node-v6.11.0/out/Release/obj.target/v8_base/deps/v8/src/frames.o.d.raw -D_FORTIFY_SOURCE=2 -march=x86-64 -mtune=generic -O2 -pipe -fstack-protector-strong -c -o /pkg/src/node-v6.11.0/out/Release/obj.target/v8_base/deps/v8/src/frames.o ../deps/v8/src/frames.cc
823  [06/10/2017 12:06AM]:                  from ../deps/v8/src/frames.cc:5:
824  [06/10/2017 12:06AM]:   g++ -DV8_TARGET_ARCH_X64 -DENABLE_DISASSEMBLER -DV8_I18N_SUPPORT -DV8_IMMINENT_DEPRECATION_WARNINGS -DICU_UTIL_DATA_IMPL=ICU_UTIL_DATA_STATIC -I../deps/v8 -I../deps -I/usr/include/openssl-1.0  -pthread -Wall -Wextra -Wno-unused-parameter -m64 -fno-strict-aliasing -m64 -fdata-sections -ffunction-sections -O3 -O3 -fno-omit-frame-pointer -fno-rtti -fno-exceptions -std=gnu++0x -MMD -MF /pkg/src/node-v6.11.0/out/Release/.deps//pkg/src/node-v6.11.0/out/Release/obj.target/v8_base/deps/v8/src/full-codegen/full-codegen.o.d.raw -D_FORTIFY_SOURCE=2 -march=x86-64 -mtune=generic -O2 -pipe -fstack-protector-strong -c -o /pkg/src/node-v6.11.0/out/Release/obj.target/v8_base/deps/v8/src/full-codegen/full-codegen.o ../deps/v8/src/full-codegen/full-codegen.cc
825  [06/10/2017 12:06AM]:                  from ../deps/v8/src/full-codegen/full-codegen.h:10,
826  [06/10/2017 12:06AM]:                  from ../deps/v8/src/full-codegen/full-codegen.cc:5:
827  [06/10/2017 12:06AM]:                  from ../deps/v8/src/full-codegen/full-codegen.h:8,
828  [06/10/2017 12:06AM]:   g++ -DV8_TARGET_ARCH_X64 -DENABLE_DISASSEMBLER -DV8_I18N_SUPPORT -DV8_IMMINENT_DEPRECATION_WARNINGS -DICU_UTIL_DATA_IMPL=ICU_UTIL_DATA_STATIC -I../deps/v8 -I../deps -I/usr/include/openssl-1.0  -pthread -Wall -Wextra -Wno-unused-parameter -m64 -fno-strict-aliasing -m64 -fdata-sections -ffunction-sections -O3 -O3 -fno-omit-frame-pointer -fno-rtti -fno-exceptions -std=gnu++0x -MMD -MF /pkg/src/node-v6.11.0/out/Release/.deps//pkg/src/node-v6.11.0/out/Release/obj.target/v8_base/deps/v8/src/futex-emulation.o.d.raw -D_FORTIFY_SOURCE=2 -march=x86-64 -mtune=generic -O2 -pipe -fstack-protector-strong -c -o /pkg/src/node-v6.11.0/out/Release/obj.target/v8_base/deps/v8/src/futex-emulation.o ../deps/v8/src/futex-emulation.cc
829  [06/10/2017 12:06AM]:                  from ../deps/v8/src/futex-emulation.cc:12:
830  [06/10/2017 12:06AM]:                  from ../deps/v8/src/futex-emulation.h:10,
831  [06/10/2017 12:06AM]:                  from ../deps/v8/src/futex-emulation.cc:5:
832  [06/10/2017 12:06AM]:   g++ -DV8_TARGET_ARCH_X64 -DENABLE_DISASSEMBLER -DV8_I18N_SUPPORT -DV8_IMMINENT_DEPRECATION_WARNINGS -DICU_UTIL_DATA_IMPL=ICU_UTIL_DATA_STATIC -I../deps/v8 -I../deps -I/usr/include/openssl-1.0  -pthread -Wall -Wextra -Wno-unused-parameter -m64 -fno-strict-aliasing -m64 -fdata-sections -ffunction-sections -O3 -O3 -fno-omit-frame-pointer -fno-rtti -fno-exceptions -std=gnu++0x -MMD -MF /pkg/src/node-v6.11.0/out/Release/.deps//pkg/src/node-v6.11.0/out/Release/obj.target/v8_base/deps/v8/src/gdb-jit.o.d.raw -D_FORTIFY_SOURCE=2 -march=x86-64 -mtune=generic -O2 -pipe -fstack-protector-strong -c -o /pkg/src/node-v6.11.0/out/Release/obj.target/v8_base/deps/v8/src/gdb-jit.o ../deps/v8/src/gdb-jit.cc
833  [06/10/2017 12:06AM]:                  from ../deps/v8/src/gdb-jit.cc:9:
834  [06/10/2017 12:06AM]: In file included from ../deps/v8/src/gdb-jit.h:8:0,
835  [06/10/2017 12:06AM]:                  from ../deps/v8/src/gdb-jit.cc:5:
836  [06/10/2017 12:06AM]:   g++ -DV8_TARGET_ARCH_X64 -DENABLE_DISASSEMBLER -DV8_I18N_SUPPORT -DV8_IMMINENT_DEPRECATION_WARNINGS -DICU_UTIL_DATA_IMPL=ICU_UTIL_DATA_STATIC -I../deps/v8 -I../deps -I/usr/include/openssl-1.0  -pthread -Wall -Wextra -Wno-unused-parameter -m64 -fno-strict-aliasing -m64 -fdata-sections -ffunction-sections -O3 -O3 -fno-omit-frame-pointer -fno-rtti -fno-exceptions -std=gnu++0x -MMD -MF /pkg/src/node-v6.11.0/out/Release/.deps//pkg/src/node-v6.11.0/out/Release/obj.target/v8_base/deps/v8/src/global-handles.o.d.raw -D_FORTIFY_SOURCE=2 -march=x86-64 -mtune=generic -O2 -pipe -fstack-protector-strong -c -o /pkg/src/node-v6.11.0/out/Release/obj.target/v8_base/deps/v8/src/global-handles.o ../deps/v8/src/global-handles.cc
837  [06/10/2017 12:06AM]:                  from ../deps/v8/src/global-handles.cc:7:
838  [06/10/2017 12:06AM]: In file included from ../deps/v8/src/global-handles.h:8:0,
839  [06/10/2017 12:06AM]:                  from ../deps/v8/src/global-handles.cc:5:
840  [06/10/2017 12:06AM]:   g++ -DV8_TARGET_ARCH_X64 -DENABLE_DISASSEMBLER -DV8_I18N_SUPPORT -DV8_IMMINENT_DEPRECATION_WARNINGS -DICU_UTIL_DATA_IMPL=ICU_UTIL_DATA_STATIC -I../deps/v8 -I../deps -I/usr/include/openssl-1.0  -pthread -Wall -Wextra -Wno-unused-parameter -m64 -fno-strict-aliasing -m64 -fdata-sections -ffunction-sections -O3 -O3 -fno-omit-frame-pointer -fno-rtti -fno-exceptions -std=gnu++0x -MMD -MF /pkg/src/node-v6.11.0/out/Release/.deps//pkg/src/node-v6.11.0/out/Release/obj.target/v8_base/deps/v8/src/handles.o.d.raw -D_FORTIFY_SOURCE=2 -march=x86-64 -mtune=generic -O2 -pipe -fstack-protector-strong -c -o /pkg/src/node-v6.11.0/out/Release/obj.target/v8_base/deps/v8/src/handles.o ../deps/v8/src/handles.cc
841  [06/10/2017 12:06AM]:                  from ../deps/v8/src/handles.cc:7:
842  [06/10/2017 12:06AM]:                  from ../deps/v8/src/handles.cc:5:
843  [06/10/2017 12:06AM]:   g++ -DV8_TARGET_ARCH_X64 -DENABLE_DISASSEMBLER -DV8_I18N_SUPPORT -DV8_IMMINENT_DEPRECATION_WARNINGS -DICU_UTIL_DATA_IMPL=ICU_UTIL_DATA_STATIC -I../deps/v8 -I../deps -I/usr/include/openssl-1.0  -pthread -Wall -Wextra -Wno-unused-parameter -m64 -fno-strict-aliasing -m64 -fdata-sections -ffunction-sections -O3 -O3 -fno-omit-frame-pointer -fno-rtti -fno-exceptions -std=gnu++0x -MMD -MF /pkg/src/node-v6.11.0/out/Release/.deps//pkg/src/node-v6.11.0/out/Release/obj.target/v8_base/deps/v8/src/heap/array-buffer-tracker.o.d.raw -D_FORTIFY_SOURCE=2 -march=x86-64 -mtune=generic -O2 -pipe -fstack-protector-strong -c -o /pkg/src/node-v6.11.0/out/Release/obj.target/v8_base/deps/v8/src/heap/array-buffer-tracker.o ../deps/v8/src/heap/array-buffer-tracker.cc
844  [06/10/2017 12:06AM]:                  from ../deps/v8/src/heap/array-buffer-tracker.cc:6:
845  [06/10/2017 12:06AM]: In file included from ../deps/v8/src/heap/array-buffer-tracker.h:11:0,
846  [06/10/2017 12:06AM]:                  from ../deps/v8/src/heap/array-buffer-tracker.cc:5:
847  [06/10/2017 12:06AM]:   g++ -DV8_TARGET_ARCH_X64 -DENABLE_DISASSEMBLER -DV8_I18N_SUPPORT -DV8_IMMINENT_DEPRECATION_WARNINGS -DICU_UTIL_DATA_IMPL=ICU_UTIL_DATA_STATIC -I../deps/v8 -I../deps -I/usr/include/openssl-1.0  -pthread -Wall -Wextra -Wno-unused-parameter -m64 -fno-strict-aliasing -m64 -fdata-sections -ffunction-sections -O3 -O3 -fno-omit-frame-pointer -fno-rtti -fno-exceptions -std=gnu++0x -MMD -MF /pkg/src/node-v6.11.0/out/Release/.deps//pkg/src/node-v6.11.0/out/Release/obj.target/v8_base/deps/v8/src/heap/memory-reducer.o.d.raw -D_FORTIFY_SOURCE=2 -march=x86-64 -mtune=generic -O2 -pipe -fstack-protector-strong -c -o /pkg/src/node-v6.11.0/out/Release/obj.target/v8_base/deps/v8/src/heap/memory-reducer.o ../deps/v8/src/heap/memory-reducer.cc
848  [06/10/2017 12:06AM]:                  from ../deps/v8/src/heap/gc-tracer.h:9,
849  [06/10/2017 12:06AM]:                  from ../deps/v8/src/heap/memory-reducer.cc:8:
850  [06/10/2017 12:06AM]:                  from ../deps/v8/src/heap/memory-reducer.h:10,
851  [06/10/2017 12:06AM]:                  from ../deps/v8/src/heap/memory-reducer.cc:5:
852  [06/10/2017 12:06AM]:   g++ -DV8_TARGET_ARCH_X64 -DENABLE_DISASSEMBLER -DV8_I18N_SUPPORT -DV8_IMMINENT_DEPRECATION_WARNINGS -DICU_UTIL_DATA_IMPL=ICU_UTIL_DATA_STATIC -I../deps/v8 -I../deps -I/usr/include/openssl-1.0  -pthread -Wall -Wextra -Wno-unused-parameter -m64 -fno-strict-aliasing -m64 -fdata-sections -ffunction-sections -O3 -O3 -fno-omit-frame-pointer -fno-rtti -fno-exceptions -std=gnu++0x -MMD -MF /pkg/src/node-v6.11.0/out/Release/.deps//pkg/src/node-v6.11.0/out/Release/obj.target/v8_base/deps/v8/src/heap/gc-idle-time-handler.o.d.raw -D_FORTIFY_SOURCE=2 -march=x86-64 -mtune=generic -O2 -pipe -fstack-protector-strong -c -o /pkg/src/node-v6.11.0/out/Release/obj.target/v8_base/deps/v8/src/heap/gc-idle-time-handler.o ../deps/v8/src/heap/gc-idle-time-handler.cc
853  [06/10/2017 12:06AM]:                  from ../deps/v8/src/heap/gc-idle-time-handler.cc:8:
854  [06/10/2017 12:06AM]: In file included from ../deps/v8/src/heap/gc-idle-time-handler.h:8:0,
855  [06/10/2017 12:06AM]:                  from ../deps/v8/src/heap/gc-idle-time-handler.cc:5:
856  [06/10/2017 12:06AM]:   g++ -DV8_TARGET_ARCH_X64 -DENABLE_DISASSEMBLER -DV8_I18N_SUPPORT -DV8_IMMINENT_DEPRECATION_WARNINGS -DICU_UTIL_DATA_IMPL=ICU_UTIL_DATA_STATIC -I../deps/v8 -I../deps -I/usr/include/openssl-1.0  -pthread -Wall -Wextra -Wno-unused-parameter -m64 -fno-strict-aliasing -m64 -fdata-sections -ffunction-sections -O3 -O3 -fno-omit-frame-pointer -fno-rtti -fno-exceptions -std=gnu++0x -MMD -MF /pkg/src/node-v6.11.0/out/Release/.deps//pkg/src/node-v6.11.0/out/Release/obj.target/v8_base/deps/v8/src/heap/gc-tracer.o.d.raw -D_FORTIFY_SOURCE=2 -march=x86-64 -mtune=generic -O2 -pipe -fstack-protector-strong -c -o /pkg/src/node-v6.11.0/out/Release/obj.target/v8_base/deps/v8/src/heap/gc-tracer.o ../deps/v8/src/heap/gc-tracer.cc
857  [06/10/2017 12:06AM]:                  from ../deps/v8/src/heap/gc-tracer.cc:5:
858  [06/10/2017 12:06AM]:   g++ -DV8_TARGET_ARCH_X64 -DENABLE_DISASSEMBLER -DV8_I18N_SUPPORT -DV8_IMMINENT_DEPRECATION_WARNINGS -DICU_UTIL_DATA_IMPL=ICU_UTIL_DATA_STATIC -I../deps/v8 -I../deps -I/usr/include/openssl-1.0  -pthread -Wall -Wextra -Wno-unused-parameter -m64 -fno-strict-aliasing -m64 -fdata-sections -ffunction-sections -O3 -O3 -fno-omit-frame-pointer -fno-rtti -fno-exceptions -std=gnu++0x -MMD -MF /pkg/src/node-v6.11.0/out/Release/.deps//pkg/src/node-v6.11.0/out/Release/obj.target/v8_base/deps/v8/src/heap/heap.o.d.raw -D_FORTIFY_SOURCE=2 -march=x86-64 -mtune=generic -O2 -pipe -fstack-protector-strong -c -o /pkg/src/node-v6.11.0/out/Release/obj.target/v8_base/deps/v8/src/heap/heap.o ../deps/v8/src/heap/heap.cc
859  [06/10/2017 12:06AM]:                  from ../deps/v8/src/heap/heap.cc:5:
860  [06/10/2017 12:06AM]: In file included from ../deps/v8/src/heap/objects-visiting.h:12:0,
861  [06/10/2017 12:06AM]:                  from ../deps/v8/src/heap/object-stats.h:9,
862  [06/10/2017 12:06AM]:                  from ../deps/v8/src/heap/heap.cc:27:
863  [06/10/2017 12:06AM]: ../deps/v8/src/objects-body-descriptors.h: In static member function static void v8::internal::FixedBodyDescriptor<start_offset, end_offset, size>::IterateBody(v8::internal::HeapObject*, int):
864  [06/10/2017 12:06AM]: ../deps/v8/src/objects-body-descriptors.h:102:20: error: no matching function for call to v8::internal::FixedBodyDescriptor<start_offset, end_offset, size>::IterateBody(v8::internal::HeapObject*&)
865  [06/10/2017 12:06AM]: ../deps/v8/src/objects-body-descriptors.h:84:22: note: candidate: template<int start_offset, int end_offset, int size> template<class ObjectVisitor> static void v8::internal::FixedBodyDescriptor<start_offset, end_offset, size>::IterateBody(v8::internal::HeapObject*, ObjectVisitor*)
866  [06/10/2017 12:06AM]:    static inline void IterateBody(HeapObject* obj, ObjectVisitor* v) {
867  [06/10/2017 12:06AM]:                       ^~~~~~~~~~~
868  [06/10/2017 12:06AM]: ../deps/v8/src/objects-body-descriptors.h:84:22: note:   template argument deduction/substitution failed:
869  [06/10/2017 12:06AM]: ../deps/v8/src/objects-body-descriptors.h:102:20: note:   candidate expects 2 arguments, 1 provided
870  [06/10/2017 12:06AM]: ../deps/v8/src/objects-body-descriptors.h:89:22: note: candidate: template<int start_offset, int end_offset, int size> template<class ObjectVisitor> static void v8::internal::FixedBodyDescriptor<start_offset, end_offset, size>::IterateBody(v8::internal::HeapObject*, int, ObjectVisitor*)
871  [06/10/2017 12:06AM]:    static inline void IterateBody(HeapObject* obj, int object_size,
872  [06/10/2017 12:06AM]: ../deps/v8/src/objects-body-descriptors.h:89:22: note:   template argument deduction/substitution failed:
873  [06/10/2017 12:06AM]: ../deps/v8/src/objects-body-descriptors.h:102:20: note:   candidate expects 3 arguments, 1 provided
874  [06/10/2017 12:06AM]: ../deps/v8/src/objects-body-descriptors.h:95:22: note: candidate: template<int start_offset, int end_offset, int size> template<class StaticVisitor> static void v8::internal::FixedBodyDescriptor<start_offset, end_offset, size>::IterateBody(v8::internal::HeapObject*)
875  [06/10/2017 12:06AM]:    static inline void IterateBody(HeapObject* obj) {
876  [06/10/2017 12:06AM]: ../deps/v8/src/objects-body-descriptors.h:95:22: note:   template argument deduction/substitution failed:
877  [06/10/2017 12:06AM]: ../deps/v8/src/objects-body-descriptors.h:102:20: note:   couldnt deduce template parameter StaticVisitor
878  [06/10/2017 12:06AM]: ../deps/v8/src/objects-body-descriptors.h:101:22: note: candidate: template<int start_offset, int end_offset, int size> template<class StaticVisitor> static void v8::internal::FixedBodyDescriptor<start_offset, end_offset, size>::IterateBody(v8::internal::HeapObject*, int)
879  [06/10/2017 12:06AM]:    static inline void IterateBody(HeapObject* obj, int object_size) {
880  [06/10/2017 12:06AM]: ../deps/v8/src/objects-body-descriptors.h:101:22: note:   template argument deduction/substitution failed:
881  [06/10/2017 12:06AM]: In file included from ../deps/v8/src/heap/heap-inl.h:16:0,
882  [06/10/2017 12:06AM]:                  from ../deps/v8/src/objects-inl.h:23,
883  [06/10/2017 12:06AM]:                  from ../deps/v8/src/api.h:13,
884  [06/10/2017 12:06AM]:                  from ../deps/v8/src/heap/heap.cc:8:
885  [06/10/2017 12:06AM]: ../deps/v8/src/heap/spaces-inl.h: In member function v8::internal::MemoryChunk* v8::internal::MemoryChunkIterator::next():
886  [06/10/2017 12:06AM]: ../deps/v8/src/heap/spaces-inl.h:405:14: warning: this statement may fall through [-Wimplicit-fallthrough=]
887  [06/10/2017 12:06AM]:        state_ = kMapState;
888  [06/10/2017 12:06AM]: ../deps/v8/src/heap/spaces-inl.h:408:5: note: here
889  [06/10/2017 12:06AM]: ../deps/v8/src/heap/spaces-inl.h:412:14: warning: this statement may fall through [-Wimplicit-fallthrough=]
890  [06/10/2017 12:06AM]:        state_ = kCodeState;
891  [06/10/2017 12:06AM]:        ~~~~~~~^~~~~~~~~~~~
892  [06/10/2017 12:06AM]: ../deps/v8/src/heap/spaces-inl.h:415:5: note: here
893  [06/10/2017 12:06AM]: ../deps/v8/src/heap/spaces-inl.h:419:14: warning: this statement may fall through [-Wimplicit-fallthrough=]
894  [06/10/2017 12:06AM]:        state_ = kLargeObjectState;
895  [06/10/2017 12:06AM]: ../deps/v8/src/heap/spaces-inl.h:422:5: note: here
896  [06/10/2017 12:06AM]:      case kLargeObjectState: {
897  [06/10/2017 12:06AM]: ../deps/v8/src/heap/spaces-inl.h:427:14: warning: this statement may fall through [-Wimplicit-fallthrough=]
898  [06/10/2017 12:06AM]:        state_ = kFinishedState;
899  [06/10/2017 12:06AM]: ../deps/v8/src/heap/spaces-inl.h:430:5: note: here
900  [06/10/2017 12:06AM]: make[1]: *** [deps/v8/tools/gyp/v8_base.target.mk:482: /pkg/src/node-v6.11.0/out/Release/obj.target/v8_base/deps/v8/src/heap/heap.o] Error 1
901  [06/10/2017 12:06AM]: make[1]: Leaving directory /pkg/src/node-v6.11.0/out
902  [06/10/2017 12:06AM]: make: *** [Makefile:73: node] Error 2
903  [06/10/2017 12:06AM]: ==> ERROR: A failure occurred in build().
904  [06/10/2017 12:06AM]: rm: cannot remove **.pkg.**: No such file or directory
905  [06/10/2017 12:06AM]: [\^/\^/^\^/^\^/\^/\^/^\^/^\^/]  BUILD FAILED  [\^/\^/^\^/^\^/\^/\^/^\^/^\^/]