Build Record

Build Number: 6684

Transaction: 2987
Package: firefox-beta
Version: 55.0b2-1
Start: 06/16/2017 11:34PM
Finish: 06/16/2017 11:37PM
Result: failed
 firefox-beta/PKGBUILD CHANGED

Build Log

  1 [06/16/2017 11:34PM]: [\^/\^/^\^/^\^/\^/\^/^\^/^\^/]  SETTING UP ENVIRONMENT  [\^/\^/^\^/^\^/\^/\^/^\^/^\^/]
  2  [06/16/2017 11:34PM]: [\^/\^/^\^/^\^/\^/\^/^\^/^\^/]  ADDING UPSTREAM PGP KEYS TO KEYRING  [\^/\^/^\^/^\^/\^/\^/^\^/^\^/]
  3  [06/16/2017 11:34PM]: gpg: WARNING: unsafe ownership on homedir /tmp/antbs/.gnupg
  4  [06/16/2017 11:34PM]: gpg: keybox /tmp/antbs/.gnupg/pubring.kbx created
  5  [06/16/2017 11:34PM]: gpg: /tmp/antbs/.gnupg/trustdb.gpg: trustdb created
  6  [06/16/2017 11:34PM]: gpg: key 23EFEFE93C4CFFFE: public key Italo A. Casas <[email protected]> imported
  7  [06/16/2017 11:34PM]: gpg: key B63B535A4C206CA9: public key Evan Lucas <[email protected]> imported
  8  [06/16/2017 11:34PM]: gpg: key E73BC641CC11F4C8: public key Myles Borins <[email protected]> imported
  9  [06/16/2017 11:34PM]: gpg: key C273792F7D83545D: public key Rod Vagg <[email protected]> imported
 10  [06/16/2017 11:34PM]: gpg: key C97EC7A07EDE3FC1: public key keybase.io/jasnell <[email protected]> imported
 11  [06/16/2017 11:34PM]: gpg: key 09FE44734EB7990E: public key Jeremiah Senkpiel <[email protected]> imported
 12  [06/16/2017 11:34PM]: gpg: key 7434390BDBE9B9C5: public key Colin Ihrig <[email protected]> imported
 13  [06/16/2017 11:34PM]: gpg: key 61B7B526D98F0353: public key Mozilla Software Releases <[email protected]> imported
 14  [06/16/2017 11:34PM]: gpg: key 61B7B526D98F0353: Mozilla Software Releases <[email protected]> not changed
 15  [06/16/2017 11:34PM]: gpg: no ultimately trusted keys found
 16  [06/16/2017 11:34PM]: gpg: Total number processed: 9
 17  [06/16/2017 11:34PM]: gpg:               imported: 8
 18  [06/16/2017 11:34PM]: gpg:              unchanged: 1
 19  [06/16/2017 11:34PM]: [\^/\^/^\^/^\^/\^/\^/^\^/^\^/]  SYNCING REPO DATABASES  [\^/\^/^\^/^\^/\^/\^/^\^/^\^/]
 20  [06/16/2017 11:34PM]: :: Synchronizing package databases...
 21  [06/16/2017 11:34PM]: downloading antergos-staging.db...
 22  [06/16/2017 11:34PM]: downloading antergos.db...
 23  [06/16/2017 11:34PM]: downloading core.db...
 24  [06/16/2017 11:34PM]: downloading community.db...
 25  [06/16/2017 11:34PM]: :: Starting full system upgrade...
 26  [06/16/2017 11:34PM]: [\^/\^/^\^/^\^/\^/\^/^\^/^\^/]  TRYING BUILD  [\^/\^/^\^/^\^/\^/\^/^\^/^\^/]
 27  [06/16/2017 11:34PM]: [\^/\^/^\^/^\^/\^/\^/^\^/^\^/]  UPDATING SOURCE CHECKSUMS  [\^/\^/^\^/^\^/\^/\^/^\^/^\^/]
 28  [06/16/2017 11:34PM]: ==> Making package: firefox-beta 55.0b2-1 (Sat Jun 17 04:34:19 UTC 2017)
 29  [06/16/2017 11:34PM]: ==> Checking runtime dependencies...
 30  [06/16/2017 11:34PM]: ==> Installing missing dependencies...
 31  [06/16/2017 11:34PM]: :: There are 10 providers available for ttf-font:
 32  [06/16/2017 11:34PM]:    1) ttf-google-fonts-typewolf
 33  [06/16/2017 11:34PM]:    2) noto-fonts  3) ttf-bitstream-vera  4) ttf-croscore  5) ttf-dejavu  6) ttf-freefont  7) ttf-linux-libertine
 34  [06/16/2017 11:34PM]:    8) ttf-droid  9) ttf-liberation  10) ttf-ubuntu-font-family
 35  [06/16/2017 11:34PM]: Enter a number (default=1):
 36  [06/16/2017 11:34PM]: :: There are 3 providers available for libgl:
 37  [06/16/2017 11:34PM]:    1) libglvnd  2) nvidia-304xx-utils  3) nvidia-340xx-utils
 38  [06/16/2017 11:34PM]: :: There are 2 providers available for libx264.so=148-64:
 39  [06/16/2017 11:34PM]:    1) libx264  2) libx264-10bit
 40  [06/16/2017 11:34PM]: looking for conflicting packages...
 41  [06/16/2017 11:34PM]: warning: dependency cycle detected:
 42  [06/16/2017 11:34PM]: warning: harfbuzz will be installed before its freetype2 dependency
 43  [06/16/2017 11:34PM]: warning: mesa will be installed before its libglvnd dependency
 44  [06/16/2017 11:34PM]: Packages (137) adwaita-icon-theme-3.24.0-1  at-spi2-atk-2.24.1-1  at-spi2-core-2.24.1-1  atk-2.24.0-2  avahi-0.6.32-3  cairo-1.14.8-1  compositeproto-0.4.2-3  damageproto-1.2.1-3  dconf-0.26.0+1+g701d19d-1  desktop-file-utils-0.23-1  fixesproto-5.0+9+g4292ec1-1  flac-1.3.2-1  fontconfig-2.12.3-1  freetype2-2.8-2  fribidi-0.19.7-1  gdk-pixbuf2-2.36.6-2  giflib-5.1.4-1  graphite-1:1.3.10-1  gsm-1.0.16-1  gtk-update-icon-cache-3.22.15-1  harfbuzz-1.4.6-1  hicolor-icon-theme-0.15-1  inputproto-2.3.2-1  jack-0.125.0-3  jasper-2.0.13-1  json-glib-1.2.8-1  kbproto-1.0.7-1  lame-3.99.5-3  lcms2-2.8-2  libass-0.13.7-1  libasyncns-0.8+3+g68cd5af-1  libavc1394-0.5.4-2  libbluray-1.0.0-1  libcroco-0.6.12+4+g9ad7287-1  libcups-2.2.3-1  libdaemon-0.14-3  libdatrie-0.2.10-2  libdrm-2.4.81-1  libepoxy-1.4.3-1  libfontenc-1.1.3-1  libglvnd-0.2.999+g4ba53457-2  libice-1.0.9-1  libiec61883-1.2.0-4  libjpeg-turbo-1.5.1-1  libmodplug-0.8.9.0-1  libogg-1.3.2-1  libomxil-bellagio-0.9.3-1  libpciaccess-0.13.5-1  libpng-1.6.29-1  libpulse-10.0-3  libraw1394-2.1.2-1  librsvg-2:2.40.17-1  libsamplerate-0.1.9-1  libsm-1.2.2-2  libsndfile-1.0.28-1  libsoxr-0.1.2-1  libssh-0.7.5-2  libthai-0.1.26-1  libtheora-1.1.1-3  libtiff-4.0.8-1  libtxc_dxtn-1.0.1-6  libunwind-1.2.1-1  libva-1.8.2-1  libvdpau-1.1.1-2  libvorbis-1.3.5-1  libwebp-0.6.0-1  libx11-1.6.5-1  libx264-2:148.20170519-1  libxau-1.0.8-2  libxcb-1.12-1  libxcomposite-0.4.4-2  libxcursor-1.1.14-2  libxdamage-1.1.4-2  libxdmcp-1.1.2-1  libxext-1.3.3-1  libxfixes-5.0.3-1  libxft-2.3.2-1  libxi-1.7.9-1  libxinerama-1.1.3-2  libxkbcommon-0.7.1-1  libxml2-2.9.4+16+g07418011-2  libxrandr-1.5.1-1  libxrender-0.9.10-1  libxshmfence-1.2-1  libxtst-1.2.3-1  libxxf86vm-1.1.4-1  llvm-libs-4.0.0-3  lm_sensors-3.4.0-2  lzo-2.10-1  mesa-17.1.2-1  nspr-4.15-1  opencore-amr-0.1.5-1  openjpeg2-2.1.2-2  opus-1.1.5-1  orc-0.4.26+2+g249c709-1  pango-1.40.6+9+g92cc73c8-1  pixman-0.34.0-1  randrproto-1.5.0-1  recordproto-1.14.2-2  renderproto-0.11.1-3  schroedinger-1.0.11-3  sdl2-2.0.5-3  shared-mime-info-1.8-1  speex-1.2.0-1  speexdsp-1.2rc3-2  v4l-utils-1.12.5-1  vid.stab-1.1-1  wayland-1.13.0-1  wayland-protocols-1.8-1  x265-2.4-1  xcb-proto-1.12-3  xcb-util-0.4.0-1  xextproto-7.3.0-1  xf86vidmodeproto-2.3.1-3  xineramaproto-1.2.1-3  xkeyboard-config-2.21-1  xorg-fonts-encodings-1.0.4-4  xorg-mkfontdir-1.0.7-8  xorg-mkfontscale-1.1.2-1  xproto-7.0.31-1  xvidcore-1.3.4-1  zita-alsa-pcmi-0.2.0-3  zita-resampler-1.3.0-5  alsa-lib-1.1.4.1-1  dbus-glib-0.108-1  ffmpeg-1:3.3.2-1  gtk2-2.24.31-1  gtk3-3.22.15-1  hunspell-1.6.1-1  libevent-2.0.22-4  libvpx-1.6.1-1  libxt-1.1.5-1  mime-types-9-1  mozilla-common-1.4-4  nss-3.31-3  startup-notification-0.12-5  ttf-google-fonts-typewolf-17.2.r35eb2d7-1
 45  [06/16/2017 11:34PM]: Total Download Size:    13.39 MiB
 46  [06/16/2017 11:34PM]: Total Installed Size:  550.90 MiB
 47  [06/16/2017 11:34PM]: :: Proceed with installation? [Y/n]
 48  [06/16/2017 11:34PM]: downloading libssh-0.7.5-2-x86_64.pkg.tar.xz...
 49  [06/16/2017 11:34PM]: downloading speex-1.2.0-1-x86_64.pkg.tar.xz...
 50  [06/16/2017 11:34PM]: downloading atk-2.24.0-2-x86_64.pkg.tar.xz...
 51  [06/16/2017 11:34PM]: downloading cairo-1.14.8-1-x86_64.pkg.tar.xz...
 52  [06/16/2017 11:34PM]: downloading pango-1.40.6+9+g92cc73c8-1-x86_64.pkg.tar.xz...
 53  [06/16/2017 11:34PM]: downloading libxinerama-1.1.3-2-x86_64.pkg.tar.xz...
 54  [06/16/2017 11:34PM]: downloading libxkbcommon-0.7.1-1-x86_64.pkg.tar.xz...
 55  [06/16/2017 11:34PM]: downloading json-glib-1.2.8-1-x86_64.pkg.tar.xz...
 56  [06/16/2017 11:34PM]: downloading wayland-protocols-1.8-1-any.pkg.tar.xz...
 57  [06/16/2017 11:34PM]: checking package integrity...
 58  [06/16/2017 11:35PM]: checking for file conflicts...
 59  [06/16/2017 11:35PM]: :: Processing package changes...
 60  [06/16/2017 11:35PM]: Optional dependencies for alsa-lib
 61  [06/16/2017 11:35PM]:     python2: for python smixer plugin
 62  [06/16/2017 11:35PM]: Optional dependencies for harfbuzz
 63  [06/16/2017 11:35PM]:     cairo: hb-view program [pending]
 64  [06/16/2017 11:35PM]: warning: directory permissions differ on /var/
 65  [06/16/2017 11:35PM]: filesystem: 777  package: 755
 66  [06/16/2017 11:35PM]:   Fontconfig configuration is done via /etc/fonts/conf.avail and conf.d.
 67  [06/16/2017 11:35PM]:   Read /etc/fonts/conf.d/README for more information.
 68  [06/16/2017 11:35PM]:   Configuration via /etc/fonts/local.conf is still possible,
 69  [06/16/2017 11:35PM]:   but is no longer recommended for options available in conf.avail.
 70  [06/16/2017 11:35PM]:   Main systemwide configuration should be done by symlinks
 71  [06/16/2017 11:35PM]:   (especially for autohinting, sub-pixel and lcdfilter):
 72  [06/16/2017 11:35PM]:   ln -s ../conf.avail/XX-foo.conf
 73  [06/16/2017 11:35PM]:   Check also https://wiki.archlinux.org/index.php/Font_Configuration
 74  [06/16/2017 11:35PM]:   and https://wiki.archlinux.org/index.php/Fonts.
 75  [06/16/2017 11:35PM]: Rebuilding fontconfig cache... done.
 76  [06/16/2017 11:35PM]: installing zita-alsa-pcmi...
 77  [06/16/2017 11:35PM]: Optional dependencies for jack
 78  [06/16/2017 11:35PM]:     libffado: FireWire support
 79  [06/16/2017 11:35PM]: installing xf86vidmodeproto...
 80  [06/16/2017 11:35PM]: installing libomxil-bellagio...
 81  [06/16/2017 11:35PM]: Optional dependencies for lm_sensors
 82  [06/16/2017 11:35PM]:     rrdtool: for logging with sensord
 83  [06/16/2017 11:35PM]: Optional dependencies for mesa
 84  [06/16/2017 11:35PM]:     opengl-man-pages: for the OpenGL API man pages
 85  [06/16/2017 11:35PM]:     mesa-vdpau: for accelerated video playback
 86  [06/16/2017 11:35PM]:     libva-mesa-driver: for accelerated video playback
 87  [06/16/2017 11:35PM]: Optional dependencies for libva
 88  [06/16/2017 11:35PM]:     libva-vdpau-driver: backend for Nvidia and AMD cards
 89  [06/16/2017 11:35PM]:     libva-intel-driver: backend for Intel cards
 90  [06/16/2017 11:35PM]: Optional dependencies for libtiff
 91  [06/16/2017 11:35PM]:     freeglut: for using tiffgt
 92  [06/16/2017 11:35PM]: Optional dependencies for libwebp
 93  [06/16/2017 11:35PM]:     freeglut: vwebp viewer
 94  [06/16/2017 11:35PM]: Optional dependencies for libxcursor
 95  [06/16/2017 11:35PM]:     gnome-themes-standard: fallback icon theme
 96  [06/16/2017 11:35PM]: Optional dependencies for sdl2
 97  [06/16/2017 11:35PM]:     alsa-lib: ALSA audio driver [installed]
 98  [06/16/2017 11:35PM]:     libpulse: PulseAudio audio driver [installed]
 99  [06/16/2017 11:35PM]: installing hicolor-icon-theme...
100  [06/16/2017 11:35PM]: Optional dependencies for v4l-utils
101  [06/16/2017 11:35PM]: Optional dependencies for libbluray
102  [06/16/2017 11:35PM]:     java-environment: BD-J library
103  [06/16/2017 11:35PM]: Optional dependencies for ffmpeg
104  [06/16/2017 11:35PM]:     ladspa: LADSPA filters
105  [06/16/2017 11:35PM]: installing shared-mime-info...
106  [06/16/2017 11:35PM]: Optional dependencies for avahi
107  [06/16/2017 11:35PM]:     gtk3: avahi-discover-standalone, bshell, bssh, bvnc [pending]
108  [06/16/2017 11:35PM]:     gtk2: gtk2 bindings [pending]
109  [06/16/2017 11:35PM]:     pygtk: avahi-bookmarks, avahi-discover
110  [06/16/2017 11:35PM]:     python2-twisted: avahi-bookmarks
111  [06/16/2017 11:35PM]:     python2-dbus: avahi-discover
112  [06/16/2017 11:35PM]:     nss-mdns: NSS support for mDNS
113  [06/16/2017 11:35PM]: Optional dependencies for jasper
114  [06/16/2017 11:35PM]:     jasper-doc: documentation
115  [06/16/2017 11:35PM]: installing gtk-update-icon-cache...
116  [06/16/2017 11:35PM]: installing desktop-file-utils...
117  [06/16/2017 11:35PM]: Optional dependencies for gtk2
118  [06/16/2017 11:35PM]:     gnome-themes-standard: Default widget theme
119  [06/16/2017 11:35PM]:     adwaita-icon-theme: Default icon theme [pending]
120  [06/16/2017 11:35PM]: installing xkeyboard-config...
121  [06/16/2017 11:35PM]: installing wayland-protocols...
122  [06/16/2017 11:35PM]: Optional dependencies for gtk3
123  [06/16/2017 11:35PM]:     libcanberra: gtk3-widget-factory demo
124  [06/16/2017 11:35PM]:     gtk3-print-backends: Printing
125  [06/16/2017 11:35PM]: Optional dependencies for hunspell
126  [06/16/2017 11:35PM]:     perl: for ispellaff2myspell [installed]
127  [06/16/2017 11:35PM]: Optional dependencies for libevent
128  [06/16/2017 11:35PM]:     python2: to use event_rpcgen.py
129  [06/16/2017 11:35PM]: relogin or source /etc/profile.d/mozilla-common.sh
130  [06/16/2017 11:35PM]: installing startup-notification...
131  [06/16/2017 11:35PM]: installing xorg-fonts-encodings...
132  [06/16/2017 11:35PM]: installing xorg-mkfontscale...
133  [06/16/2017 11:35PM]: Creating X fontdir indices... done.
134  [06/16/2017 11:35PM]: installing ttf-google-fonts-typewolf...
135  [06/16/2017 11:35PM]: :: Running post-transaction hooks...
136  [06/16/2017 11:35PM]: ( 1/11) Updating fontconfig cache...
137  [06/16/2017 11:35PM]: ( 2/11) Probing GDK-Pixbuf loader modules...
138  [06/16/2017 11:35PM]: ( 3/11) Updating GIO module cache...
139  [06/16/2017 11:35PM]: ( 4/11) Compiling GSettings XML schema files...
140  [06/16/2017 11:35PM]: ( 5/11) Probing GTK2 input method modules...
141  [06/16/2017 11:35PM]: ( 7/11) Updating icon theme caches...
142  [06/16/2017 11:35PM]: ( 8/11) Arming ConditionNeedsUpdate...
143  [06/16/2017 11:35PM]: ( 9/11) Updating the desktop file MIME type cache...
144  [06/16/2017 11:35PM]: (10/11) Updating the MIME type database...
145  [06/16/2017 11:35PM]: (11/11) Updating X fontdir indices...
146  [06/16/2017 11:35PM]: Packages (26) fontsproto-2.1.3-2  js-24.2.0-4  libxfont-1.5.2-1  libxfont2-2.0.1-1  libxkbfile-1.0.9-1  libxmu-1.1.2-1  polkit-0.113+29+g3272a98-1  rust-1:1.17.0-1  xorg-bdftopcf-1.0.5-1  xorg-font-util-1.3.1-1  xorg-font-utils-7.6-4  xorg-fonts-alias-1.0.3-1  xorg-fonts-misc-1.0.3-5  xorg-server-common-1.19.3-2  xorg-setxkbmap-1.3.1-1  xorg-xauth-1.0.10-1  xorg-xkbcomp-1.4.0-1  autoconf2.13-2.13-4  cargo-0.18.0-1  gconf-3.2.6-5  imake-1.0.7-1  python2-2.7.13-2  unzip-6.0-12  xorg-server-xvfb-1.19.3-2  yasm-1.3.0-1  zip-3.0-7
147  [06/16/2017 11:35PM]: Total Download Size:     2.37 MiB
148  [06/16/2017 11:35PM]: Total Installed Size:  183.37 MiB
149  [06/16/2017 11:35PM]: downloading js-24.2.0-4-x86_64.pkg.tar.xz...
150  [06/16/2017 11:35PM]: downloading fontsproto-2.1.3-2-any.pkg.tar.xz...
151  [06/16/2017 11:35PM]: downloading libxfont-1.5.2-1-x86_64.pkg.tar.xz...
152  [06/16/2017 11:35PM]: downloading xorg-font-utils-7.6-4-any.pkg.tar.xz...
153  [06/16/2017 11:35PM]: Optional dependencies for rust
154  [06/16/2017 11:35PM]: Optional dependencies for cargo
155  [06/16/2017 11:35PM]:     gcc: for compiling C source code with gcc [installed]
156  [06/16/2017 11:35PM]:     clang: for compiling C source code with clang
157  [06/16/2017 11:35PM]: Optional dependencies for imake
158  [06/16/2017 11:35PM]:     perl: for mkhtmlindex [installed]
159  [06/16/2017 11:35PM]: Optional dependencies for python2
160  [06/16/2017 11:35PM]: installing xorg-fonts-alias...
161  [06/16/2017 11:35PM]: installing xorg-font-utils...
162  [06/16/2017 11:35PM]: installing xorg-fonts-misc...
163  [06/16/2017 11:35PM]: installing xorg-server-common...
164  [06/16/2017 11:35PM]: installing xorg-server-xvfb...
165  [06/16/2017 11:35PM]: (1/5) Updating fontconfig cache...
166  [06/16/2017 11:35PM]: (3/5) Arming ConditionNeedsUpdate...
167  [06/16/2017 11:35PM]: (4/5) Updating the info directory file...
168  [06/16/2017 11:35PM]: (5/5) Updating X fontdir indices...
169  [06/16/2017 11:35PM]:   -> Downloading firefox-55.0b2.source.tar.xz...
170  [06/16/2017 11:35PM]:   % Total    % Received % Xferd  Average Speed   Time    Time     Time  Current
171  [06/16/2017 11:35PM]:                                  Dload  Upload   Total   Spent    Left  Speed
172  [06/16/2017 11:36PM]: 
173   0     0    0     0    0     0      0      0 --:--:-- --:--:-- --:--:--     0
174   0     0    0     0    0     0      0      0 --:--:-- --:--:-- --:--:--     0
175   0  225M    0  186k    0     0   140k      0  0:27:24  0:00:01  0:27:23  140k
176   0  225M    0 1667k    0     0   722k      0  0:05:19  0:00:02  0:05:17  722k
177   2  225M    2 6919k    0     0  2102k      0  0:01:49  0:00:03  0:01:46 2101k
178   8  225M    8 18.4M    0     0  4416k      0  0:00:52  0:00:04  0:00:48 4416k
179  13  225M   13 30.0M    0     0  5845k      0  0:00:39  0:00:05  0:00:34 6160k
180  18  225M   18 41.7M    0     0  6804k      0  0:00:33  0:00:06  0:00:27 8584k
181  23  225M   23 53.4M    0     0  7524k      0  0:00:30  0:00:07  0:00:23 10.4M
182  28  225M   28 65.1M    0     0  8055k      0  0:00:28  0:00:08  0:00:20 11.7M
183  34  225M   34 77.8M    0     0  8604k      0  0:00:26  0:00:09  0:00:17 11.8M
184  41  225M   41 94.1M    0     0  9369k      0  0:00:24  0:00:10  0:00:14 12.7M
185  50  225M   50  113M    0     0  10.0M      0  0:00:22  0:00:11  0:00:11 14.3M
186  60  225M   60  136M    0     0  11.1M      0  0:00:20  0:00:12  0:00:08 16.6M
187  72  225M   72  163M    0     0  12.3M      0  0:00:18  0:00:13  0:00:05 19.7M
188  86  225M   86  195M    0     0  13.7M      0  0:00:16  0:00:14  0:00:02 23.5M
189 100  225M  100  225M    0     0  14.8M      0  0:00:15  0:00:15 --:--:-- 26.9M
190  [06/16/2017 11:36PM]:   -> Downloading SHA256SUMS.asc...
191  [06/16/2017 11:36PM]: 
192   0     0    0     0    0     0      0      0 --:--:-- --:--:-- --:--:--     0
193   0     0    0     0    0     0      0      0 --:--:-- --:--:-- --:--:--     0
194 100   836  100   836    0     0   1550      0 --:--:-- --:--:-- --:--:--  1548
195  [06/16/2017 11:36PM]:   -> Downloading fix-wifi-scanner.diff...
196  [06/16/2017 11:36PM]: 
197   0     0    0     0    0     0      0      0 --:--:-- --:--:-- --:--:--     0
198   0     0    0     0    0     0      0      0 --:--:-- --:--:-- --:--:--     0
199 100   684  100   684    0     0   1000      0 --:--:-- --:--:-- --:--:--  1000
200  [06/16/2017 11:36PM]:   -> Downloading firefox-install-dir.patch...
201  [06/16/2017 11:36PM]: 
202   0     0    0     0    0     0      0      0 --:--:-- --:--:-- --:--:--     0
203 100   679  100   679    0     0   1566      0 --:--:-- --:--:-- --:--:--  1568
204  [06/16/2017 11:36PM]:   -> Found firefox-beta.desktop
205  [06/16/2017 11:36PM]: ==> Validating source files with sha256sums...
206  [06/16/2017 11:36PM]:     firefox-55.0b2.source.tar.xz ... Passed
207  [06/16/2017 11:36PM]:     SHA256SUMS ... Skipped
208  [06/16/2017 11:36PM]:     SHA256SUMS.asc ... Skipped
209  [06/16/2017 11:36PM]:     fix-wifi-scanner.diff ... Passed
210  [06/16/2017 11:36PM]:     firefox-install-dir.patch ... Passed
211  [06/16/2017 11:36PM]:     firefox-beta.desktop ... Passed
212  [06/16/2017 11:36PM]: ==> Verifying source file signatures with gpg...
213  [06/16/2017 11:36PM]:   -> Extracting firefox-55.0b2.source.tar.xz with bsdtar
214  [06/16/2017 11:36PM]: patching file config/baseconfig.mk
215  [06/16/2017 11:36PM]: Hunk #1 succeeded at 4 with fuzz 2.
216  [06/16/2017 11:36PM]: patching file netwerk/wifi/nsWifiScannerDBus.cpp
217  [06/16/2017 11:36PM]: Hunk #1 succeeded at 67 (offset 5 lines).
218  [06/16/2017 11:36PM]: mkdir -p /pkg/src/firefox-55.0b2/obj-x86_64-pc-linux-gnu/
219  [06/16/2017 11:36PM]: python2.7 /pkg/src/firefox-55.0b2/config/pythonpath.py -I /pkg/src/firefox-55.0b2/testing/mozbase/mozfile \
220  [06/16/2017 11:36PM]:     /pkg/src/firefox-55.0b2/python/mozbuild/mozbuild/controller/clobber.py /pkg/src/firefox-55.0b2 /pkg/src/firefox-55.0b2/obj-x86_64-pc-linux-gnu
221  [06/16/2017 11:36PM]: > /pkg/src/firefox-55.0b2/obj-x86_64-pc-linux-gnu/.mozconfig.mk
222  [06/16/2017 11:36PM]: make -f /pkg/src/firefox-55.0b2/client.mk realbuild CREATE_MOZCONFIG_JSON=
223  [06/16/2017 11:36PM]: make[1]: Entering directory /pkg/src/firefox-55.0b2
224  [06/16/2017 11:36PM]: Adding client.mk options from /pkg/src/firefox-55.0b2/.mozconfig:
225  [06/16/2017 11:36PM]:     MOZ_OBJDIR=/pkg/src/firefox-55.0b2/obj-x86_64-pc-linux-gnu
226  [06/16/2017 11:36PM]:     OBJDIR=/pkg/src/firefox-55.0b2/obj-x86_64-pc-linux-gnu
227  [06/16/2017 11:36PM]:     FOUND_MOZCONFIG=/pkg/src/firefox-55.0b2/.mozconfig
228  [06/16/2017 11:36PM]: cp /pkg/src/firefox-55.0b2/.mozconfig /pkg/src/firefox-55.0b2/obj-x86_64-pc-linux-gnu/.mozconfig
229  [06/16/2017 11:36PM]: cd /pkg/src/firefox-55.0b2/obj-x86_64-pc-linux-gnu
230  [06/16/2017 11:36PM]: /pkg/src/firefox-55.0b2/configure
231  [06/16/2017 11:36PM]: Creating Python environment
232  [06/16/2017 11:36PM]: New python executable in /pkg/src/firefox-55.0b2/obj-x86_64-pc-linux-gnu/_virtualenv/bin/python2.7
233  [06/16/2017 11:36PM]: Also creating executable in /pkg/src/firefox-55.0b2/obj-x86_64-pc-linux-gnu/_virtualenv/bin/python
234  [06/16/2017 11:36PM]: Installing setuptools, pip, wheel...done.
235  [06/16/2017 11:36PM]: copying build/lib.linux-x86_64-2.7/psutil/_psutil_linux.so -> psutil
236  [06/16/2017 11:36PM]: copying build/lib.linux-x86_64-2.7/psutil/_psutil_posix.so -> psutil
237  [06/16/2017 11:36PM]: Reexecuting in the virtualenv
238  [06/16/2017 11:36PM]: Adding configure options from /pkg/src/firefox-55.0b2/.mozconfig
239  [06/16/2017 11:36PM]:   --enable-application=browser
240  [06/16/2017 11:36PM]:   --enable-official-branding
241  [06/16/2017 11:36PM]:   --enable-update-channel=beta
242  [06/16/2017 11:36PM]:   --enable-system-hunspell
243  [06/16/2017 11:36PM]:   --enable-startup-notification
244  [06/16/2017 11:36PM]:   --with-google-api-keyfile=/pkg/src/firefox-55.0b2/google-api-key
245  [06/16/2017 11:36PM]:   --with-mozilla-api-keyfile=/pkg/src/firefox-55.0b2/mozilla-api-key
246  [06/16/2017 11:36PM]:   STRIP_FLAGS=--strip-debug
247  [06/16/2017 11:36PM]: checking for a shell... /usr/bin/sh
248  [06/16/2017 11:36PM]: checking for host system type... x86_64-pc-linux-gnu
249  [06/16/2017 11:36PM]: checking for target system type... x86_64-pc-linux-gnu
250  [06/16/2017 11:36PM]: checking whether cross compiling... no
251  [06/16/2017 11:36PM]: checking for the target C compiler... /usr/bin/gcc
252  [06/16/2017 11:36PM]: checking whether the target C compiler can be used... yes
253  [06/16/2017 11:36PM]: checking for pkg_config... /usr/bin/pkg-config
254  [06/16/2017 11:36PM]: checking for pkg-config version... 0.29.2
255  [06/16/2017 11:36PM]: checking for yasm... /usr/bin/yasm
256  [06/16/2017 11:36PM]: checking yasm version... 1.3.0
257  [06/16/2017 11:36PM]: checking the target C compiler version... 7.1.1
258  [06/16/2017 11:36PM]: checking the target C compiler works... yes
259  [06/16/2017 11:36PM]: checking for the target C++ compiler... /usr/bin/g++
260  [06/16/2017 11:36PM]: checking whether the target C++ compiler can be used... yes
261  [06/16/2017 11:36PM]: checking the target C++ compiler version... 7.1.1
262  [06/16/2017 11:36PM]: checking the target C++ compiler works... yes
263  [06/16/2017 11:36PM]: checking for the host C compiler... /usr/bin/gcc
264  [06/16/2017 11:36PM]: checking whether the host C compiler can be used... yes
265  [06/16/2017 11:36PM]: checking the host C compiler version... 7.1.1
266  [06/16/2017 11:36PM]: checking the host C compiler works... yes
267  [06/16/2017 11:36PM]: checking for the host C++ compiler... /usr/bin/g++
268  [06/16/2017 11:36PM]: checking whether the host C++ compiler can be used... yes
269  [06/16/2017 11:36PM]: checking for 64-bit OS... yes
270  [06/16/2017 11:36PM]: checking for stdint.h... yes
271  [06/16/2017 11:36PM]: checking for inttypes.h... yes
272  [06/16/2017 11:36PM]: checking for sys/byteorder.h... no
273  [06/16/2017 11:36PM]: checking for cpuid.h... yes
274  [06/16/2017 11:36PM]: checking for sys/statvfs.h... yes
275  [06/16/2017 11:36PM]: checking for sys/statfs.h... yes
276  [06/16/2017 11:36PM]: checking for sys/mount.h... yes
277  [06/16/2017 11:36PM]: checking for linux/if_addr.h... yes
278  [06/16/2017 11:36PM]: checking for linux/rtnetlink.h... yes
279  [06/16/2017 11:36PM]: checking for linux/perf_event.h... yes
280  [06/16/2017 11:36PM]: checking for perf_event_open system call... yes
281  [06/16/2017 11:36PM]: checking whether the C compiler supports -Wclass-varargs... no
282  [06/16/2017 11:36PM]: checking whether the C++ compiler supports -Wclass-varargs... no
283  [06/16/2017 11:36PM]: checking whether the C compiler supports -Wloop-analysis... no
284  [06/16/2017 11:36PM]: checking whether the C++ compiler supports -Wloop-analysis... no
285  [06/16/2017 11:36PM]: checking whether the C++ compiler supports -Wc++11-compat-pedantic... no
286  [06/16/2017 11:36PM]: checking whether the C++ compiler supports -Wc++14-compat... yes
287  [06/16/2017 11:36PM]: checking whether the C++ compiler supports -Wc++14-compat-pedantic... no
288  [06/16/2017 11:36PM]: checking whether the C++ compiler supports -Wc++1z-compat... yes
289  [06/16/2017 11:36PM]: checking whether the C++ compiler supports -Wcomma... no
290  [06/16/2017 11:36PM]: checking whether the C++ compiler supports -Wimplicit-fallthrough... yes
291  [06/16/2017 11:36PM]: checking whether the C compiler supports -Wstring-conversion... no
292  [06/16/2017 11:36PM]: checking whether the C++ compiler supports -Wstring-conversion... no
293  [06/16/2017 11:36PM]: checking whether the C++ compiler supports -Wno-inline-new-delete... no
294  [06/16/2017 11:36PM]: checking whether the C compiler supports -Wno-error=maybe-uninitialized... yes
295  [06/16/2017 11:36PM]: checking whether the C++ compiler supports -Wno-error=maybe-uninitialized... yes
296  [06/16/2017 11:36PM]: checking whether the C compiler supports -Wno-error=deprecated-declarations... yes
297  [06/16/2017 11:36PM]: checking whether the C++ compiler supports -Wno-error=deprecated-declarations... yes
298  [06/16/2017 11:36PM]: checking whether the C compiler supports -Wno-error=array-bounds... yes
299  [06/16/2017 11:36PM]: checking whether the C++ compiler supports -Wno-error=array-bounds... yes
300  [06/16/2017 11:36PM]: checking whether the C compiler supports -Wno-error=free-nonheap-object... yes
301  [06/16/2017 11:36PM]: checking whether the C++ compiler supports -Wno-error=free-nonheap-object... yes
302  [06/16/2017 11:36PM]: checking whether the C compiler supports -Wformat... yes
303  [06/16/2017 11:36PM]: checking whether the C++ compiler supports -Wformat... yes
304  [06/16/2017 11:36PM]: checking whether the C compiler supports -Wno-gnu-zero-variadic-macro-arguments... no
305  [06/16/2017 11:36PM]: checking whether the C++ compiler supports -Wno-gnu-zero-variadic-macro-arguments... no
306  [06/16/2017 11:36PM]: checking whether the C compiler supports -Wformat-security... no
307  [06/16/2017 11:36PM]: checking whether the C++ compiler supports -Wformat-security... no
308  [06/16/2017 11:36PM]: checking whether the C compiler supports -Wformat-overflow=2... yes
309  [06/16/2017 11:36PM]: checking whether the C++ compiler supports -Wformat-overflow=2... yes
310  [06/16/2017 11:36PM]: checking for libffi > 3.0.9... yes
311  [06/16/2017 11:36PM]: checking MOZ_FFI_CFLAGS... -I/usr/lib/libffi-3.2.1/include
312  [06/16/2017 11:36PM]: checking MOZ_FFI_LIBS... -L/usr/lib/../lib -lffi
313  [06/16/2017 11:36PM]: checking for rustc... /usr/bin/rustc
314  [06/16/2017 11:36PM]: checking for cargo... /usr/bin/cargo
315  [06/16/2017 11:36PM]: checking rustc version... 1.17.0
316  [06/16/2017 11:36PM]: checking cargo version... 0.18.0
317  [06/16/2017 11:36PM]: checking for pango >= 1.22.0 pangoft2 >= 1.22.0 pangocairo >= 1.22.0... yes
318  [06/16/2017 11:36PM]: checking MOZ_PANGO_CFLAGS... -I/usr/include/pango-1.0 -I/usr/include/cairo -I/usr/include/pixman-1 -I/usr/include/freetype2 -I/usr/include/libpng16 -I/usr/include/harfbuzz -I/usr/include/glib-2.0 -I/usr/lib/glib-2.0/include -I/usr/include/freetype2 -I/usr/include/harfbuzz -I/usr/include/glib-2.0 -I/usr/lib/glib-2.0/include -I/usr/include/libdrm -I/usr/include/libpng16
319  [06/16/2017 11:36PM]: checking MOZ_PANGO_LIBS... -lpangoft2-1.0 -lfontconfig -lfreetype -lpangocairo-1.0 -lpango-1.0 -lgobject-2.0 -lglib-2.0 -lcairo
320  [06/16/2017 11:36PM]: checking for fontconfig >= 2.7.0... yes
321  [06/16/2017 11:36PM]: checking _FONTCONFIG_CFLAGS... -I/usr/include/freetype2 -I/usr/include/libpng16 -I/usr/include/harfbuzz -I/usr/include/glib-2.0 -I/usr/lib/glib-2.0/include -I/usr/include/freetype2 -I/usr/include/libpng16 -I/usr/include/harfbuzz -I/usr/include/glib-2.0 -I/usr/lib/glib-2.0/include
322  [06/16/2017 11:36PM]: checking _FONTCONFIG_LIBS... -lfontconfig -lfreetype
323  [06/16/2017 11:36PM]: checking for freetype2 >= 6.1.0... yes
324  [06/16/2017 11:36PM]: checking _FT2_CFLAGS... -I/usr/include/freetype2 -I/usr/include/libpng16 -I/usr/include/harfbuzz -I/usr/include/glib-2.0 -I/usr/lib/glib-2.0/include
325  [06/16/2017 11:36PM]: checking _FT2_LIBS... -lfreetype
326  [06/16/2017 11:36PM]: checking for tar... /usr/bin/tar
327  [06/16/2017 11:36PM]: checking for unzip... /usr/bin/unzip
328  [06/16/2017 11:36PM]: checking for zip... /usr/bin/zip
329  [06/16/2017 11:36PM]: checking for the Mozilla API key... yes
330  [06/16/2017 11:36PM]: checking for the Google API key... yes
331  [06/16/2017 11:36PM]: checking for the Bing API key... no
332  [06/16/2017 11:36PM]: checking for the Adjust SDK key... no
333  [06/16/2017 11:36PM]: checking for the Leanplum SDK key... no
334  [06/16/2017 11:36PM]: checking for awk... /usr/bin/gawk
335  [06/16/2017 11:36PM]: checking for perl... /usr/bin/perl
336  [06/16/2017 11:36PM]: checking for minimum required perl version >= 5.006... 5.026000
337  [06/16/2017 11:36PM]: checking for full perl installation... yes
338  [06/16/2017 11:36PM]: checking for gmake... /usr/bin/make
339  [06/16/2017 11:36PM]: checking for doxygen... not found
340  [06/16/2017 11:36PM]: checking for xargs... /usr/bin/xargs
341  [06/16/2017 11:36PM]: checking for rpmbuild... not found
342  [06/16/2017 11:36PM]: checking MOZ_HUNSPELL_CFLAGS... -I/usr/include/hunspell
343  [06/16/2017 11:36PM]: checking MOZ_HUNSPELL_LIBS... -lhunspell-1.6
344  [06/16/2017 11:36PM]: checking for autoconf... /usr/bin/autoconf-2.13
345  [06/16/2017 11:36PM]: creating cache ./config.cache
346  [06/16/2017 11:36PM]: checking host system type... x86_64-pc-linux-gnu
347  [06/16/2017 11:36PM]: checking target system type... x86_64-pc-linux-gnu
348  [06/16/2017 11:36PM]: checking build system type... x86_64-pc-linux-gnu
349  [06/16/2017 11:36PM]: checking for objcopy... /usr/bin/objcopy
350  [06/16/2017 11:36PM]: checking for gcc... /usr/bin/gcc -std=gnu99
351  [06/16/2017 11:36PM]: checking whether the C compiler (/usr/bin/gcc -std=gnu99 -march=x86-64 -mtune=generic -O2 -pipe -fstack-protector-strong -Wl,-O1,--sort-common,--as-needed,-z,relro -Wl,-z,now) works... yes
352  [06/16/2017 11:36PM]: checking whether the C compiler (/usr/bin/gcc -std=gnu99 -march=x86-64 -mtune=generic -O2 -pipe -fstack-protector-strong -Wl,-O1,--sort-common,--as-needed,-z,relro -Wl,-z,now) is a cross-compiler... no
353  [06/16/2017 11:36PM]: checking whether we are using GNU C... yes
354  [06/16/2017 11:36PM]: checking whether /usr/bin/gcc -std=gnu99 accepts -g... yes
355  [06/16/2017 11:36PM]: checking for c++... /usr/bin/g++ -std=gnu++11
356  [06/16/2017 11:36PM]: checking whether the C++ compiler (/usr/bin/g++ -std=gnu++11 -march=x86-64 -mtune=generic -O2 -pipe -fstack-protector-strong -fno-delete-null-pointer-checks -fno-schedule-insns2 -Wl,-O1,--sort-common,--as-needed,-z,relro -Wl,-z,now) works... yes
357  [06/16/2017 11:36PM]: checking whether the C++ compiler (/usr/bin/g++ -std=gnu++11 -march=x86-64 -mtune=generic -O2 -pipe -fstack-protector-strong -fno-delete-null-pointer-checks -fno-schedule-insns2 -Wl,-O1,--sort-common,--as-needed,-z,relro -Wl,-z,now) is a cross-compiler... no
358  [06/16/2017 11:36PM]: checking whether we are using GNU C++... yes
359  [06/16/2017 11:36PM]: checking whether /usr/bin/g++ -std=gnu++11 accepts -g... yes
360  [06/16/2017 11:36PM]: checking for ranlib... ranlib
361  [06/16/2017 11:36PM]: checking for as... /usr/bin/as
362  [06/16/2017 11:36PM]: checking for strip... strip
363  [06/16/2017 11:36PM]: checking for windres... no
364  [06/16/2017 11:36PM]: checking for X... libraries /usr/lib64, headers
365  [06/16/2017 11:36PM]: checking for dnet_ntoa in -ldnet... no
366  [06/16/2017 11:36PM]: checking for dnet_ntoa in -ldnet_stub... no
367  [06/16/2017 11:36PM]: checking for gethostbyname... yes
368  [06/16/2017 11:36PM]: checking for IceConnectionNumber in -lICE... yes
369  [06/16/2017 11:36PM]: checking for --noexecstack option to as... yes
370  [06/16/2017 11:36PM]: checking for -z noexecstack option to ld... yes
371  [06/16/2017 11:36PM]: checking for -z text option to ld... yes
372  [06/16/2017 11:36PM]: checking for --build-id option to ld... yes
373  [06/16/2017 11:36PM]: checking for --ignore-unresolved-symbol option to ld... yes
374  [06/16/2017 11:36PM]: checking if toolchain supports -mssse3 option... yes
375  [06/16/2017 11:36PM]: checking if toolchain supports -msse4.1 option... yes
376  [06/16/2017 11:36PM]: checking for x86 AVX2 asm support in compiler... yes
377  [06/16/2017 11:36PM]: checking whether the linker supports Identical Code Folding... yes
378  [06/16/2017 11:36PM]: checking whether removing dead symbols breaks debugging... no
379  [06/16/2017 11:36PM]: checking for working const... yes
380  [06/16/2017 11:36PM]: checking whether 64-bits std::atomic requires -latomic... no
381  [06/16/2017 11:36PM]: checking for dirent.h that defines DIR... yes
382  [06/16/2017 11:36PM]: checking for opendir in -ldir... no
383  [06/16/2017 11:36PM]: checking for sockaddr_in.sin_len... false
384  [06/16/2017 11:36PM]: checking for sockaddr_in6.sin6_len... false
385  [06/16/2017 11:36PM]: checking for sockaddr.sa_len... false
386  [06/16/2017 11:36PM]: checking for gethostbyname_r in -lc_r... no
387  [06/16/2017 11:36PM]: checking for library containing dlopen... -ldl
388  [06/16/2017 11:36PM]: checking for socket in -lsocket... no
389  [06/16/2017 11:36PM]: checking for XDrawLines in -lX11... yes
390  [06/16/2017 11:36PM]: checking for XextAddDisplay in -lXext... yes
391  [06/16/2017 11:36PM]: checking for XtFree in -lXt... yes
392  [06/16/2017 11:36PM]: checking for xcb_connect in -lxcb... yes
393  [06/16/2017 11:36PM]: checking for xcb_shm_query_version in -lxcb-shm... yes
394  [06/16/2017 11:36PM]: checking for XGetXCBConnection in -lX11-xcb... yes
395  [06/16/2017 11:36PM]: checking for X11/extensions/scrnsaver.h... no
396  [06/16/2017 11:36PM]: checking for pthread_create in -lpthreads... no
397  [06/16/2017 11:36PM]: checking for pthread_create in -lpthread... yes
398  [06/16/2017 11:36PM]: checking whether /usr/bin/gcc -std=gnu99 accepts -pthread... yes
399  [06/16/2017 11:36PM]: checking whether /usr/bin/gcc -std=gnu99 needs -traditional... no
400  [06/16/2017 11:36PM]: checking for 8-bit clean memcmp... yes
401  [06/16/2017 11:36PM]: checking for arc4random... no
402  [06/16/2017 11:36PM]: checking for arc4random_buf... no
403  [06/16/2017 11:36PM]: checking for clock_gettime(CLOCK_MONOTONIC)...
404  [06/16/2017 11:36PM]: checking for pthread_cond_timedwait_monotonic_np...
405  [06/16/2017 11:36PM]: checking for iconv() with const input... no
406  [06/16/2017 11:36PM]: checking for nl_langinfo and CODESET... yes
407  [06/16/2017 11:36PM]: checking for an implementation of va_copy()... yes
408  [06/16/2017 11:36PM]: checking whether va_list can be copied by value... no
409  [06/16/2017 11:36PM]: checking for C++ dynamic_cast to void*... yes
410  [06/16/2017 11:36PM]: checking for __thread keyword for TLS variables... yes
411  [06/16/2017 11:36PM]: checking for posix_memalign... yes
412  [06/16/2017 11:36PM]: checking for malloc_usable_size... yes
413  [06/16/2017 11:36PM]: checking whether malloc_usable_size definition can use const argument... no
414  [06/16/2017 11:36PM]: checking for valloc in malloc.h... yes
415  [06/16/2017 11:36PM]: checking for valloc in unistd.h... no
416  [06/16/2017 11:36PM]: checking NSPR selection... system
417  [06/16/2017 11:36PM]: checking for nspr-config... /usr/bin/nspr-config
418  [06/16/2017 11:36PM]: checking for NSPR - version >= 4.14... yes
419  [06/16/2017 11:36PM]: checking MOZ_LIBEVENT_CFLAGS...
420  [06/16/2017 11:36PM]: checking MOZ_LIBEVENT_LIBS... -levent
421  [06/16/2017 11:36PM]: checking for nss-config... /usr/bin/nss-config
422  [06/16/2017 11:36PM]: checking for NSS - version >= 3.31... yes
423  [06/16/2017 11:36PM]: checking for jpeg_destroy_compress in -ljpeg... yes
424  [06/16/2017 11:36PM]: checking for gzread in -lz... yes
425  [06/16/2017 11:36PM]: checking for BZ2_bzread in -lbz2... yes
426  [06/16/2017 11:36PM]: checking if app-specific confvars.sh exists... /pkg/src/firefox-55.0b2/browser/confvars.sh
427  [06/16/2017 11:36PM]: checking for gtk+-3.0 >= 3.4.0 gtk+-unix-print-3.0 glib-2.0 gobject-2.0 ... yes
428  [06/16/2017 11:36PM]: checking MOZ_GTK3_CFLAGS... -pthread -I/usr/include/gtk-3.0/unix-print -I/usr/include/gtk-3.0 -I/usr/include/at-spi2-atk/2.0 -I/usr/include/at-spi-2.0 -I/usr/include/dbus-1.0 -I/usr/lib/dbus-1.0/include -I/usr/include/gtk-3.0 -I/usr/include/gio-unix-2.0/ -I/usr/include/cairo -I/usr/include/pango-1.0 -I/usr/include/atk-1.0 -I/usr/include/cairo -I/usr/include/pixman-1 -I/usr/include/freetype2 -I/usr/include/libpng16 -I/usr/include/harfbuzz -I/usr/include/glib-2.0 -I/usr/lib/glib-2.0/include -I/usr/include/freetype2 -I/usr/include/harfbuzz -I/usr/include/libdrm -I/usr/include/libpng16 -I/usr/include/gdk-pixbuf-2.0 -I/usr/include/libpng16 -I/usr/include/glib-2.0 -I/usr/lib/glib-2.0/include
429  [06/16/2017 11:36PM]: checking MOZ_GTK3_LIBS... -lgtk-3 -lgdk-3 -lpangocairo-1.0 -lpango-1.0 -latk-1.0 -lcairo-gobject -lcairo -lgdk_pixbuf-2.0 -lgio-2.0 -lgobject-2.0 -lglib-2.0
430  [06/16/2017 11:36PM]: checking for gtk+-2.0 >= 2.18.0 gtk+-unix-print-2.0 glib-2.0 >= 2.22 gobject-2.0 gdk-x11-2.0... yes
431  [06/16/2017 11:36PM]: checking MOZ_GTK2_CFLAGS... -pthread -I/usr/include/gtk-2.0 -I/usr/include/gtk-unix-print-2.0 -I/usr/include/gtk-2.0 -I/usr/include/atk-1.0 -I/usr/include/gtk-2.0 -I/usr/lib/gtk-2.0/include -I/usr/include/pango-1.0 -I/usr/include/cairo -I/usr/include/pixman-1 -I/usr/include/freetype2 -I/usr/include/libpng16 -I/usr/include/harfbuzz -I/usr/include/glib-2.0 -I/usr/lib/glib-2.0/include -I/usr/include/freetype2 -I/usr/include/harfbuzz -I/usr/include/libdrm -I/usr/include/libpng16 -I/usr/include/gdk-pixbuf-2.0 -I/usr/include/libpng16 -I/usr/include/glib-2.0 -I/usr/lib/glib-2.0/include
432  [06/16/2017 11:36PM]: checking MOZ_GTK2_LIBS... -lgtk-x11-2.0 -latk-1.0 -lgio-2.0 -lpangoft2-1.0 -lfontconfig -lfreetype -lgdk-x11-2.0 -lpangocairo-1.0 -lpango-1.0 -lcairo -lgdk_pixbuf-2.0 -lgobject-2.0 -lglib-2.0
433  [06/16/2017 11:36PM]: checking for libstartup-notification-1.0 >= 0.8... yes
434  [06/16/2017 11:36PM]: checking MOZ_STARTUP_NOTIFICATION_CFLAGS... -I/usr/include/startup-notification-1.0
435  [06/16/2017 11:36PM]: checking MOZ_STARTUP_NOTIFICATION_LIBS... -lstartup-notification-1
436  [06/16/2017 11:36PM]: checking for gconf-2.0 >= 1.2.1 gobject-2.0 ... yes
437  [06/16/2017 11:36PM]: checking MOZ_GCONF_CFLAGS... -pthread -I/usr/include/gconf/2 -I/usr/include/dbus-1.0 -I/usr/lib/dbus-1.0/include -I/usr/include/glib-2.0 -I/usr/lib/glib-2.0/include
438  [06/16/2017 11:36PM]: checking MOZ_GCONF_LIBS... -lgconf-2 -lgobject-2.0 -lglib-2.0
439  [06/16/2017 11:36PM]: checking for dbus-1 >= 0.60... yes
440  [06/16/2017 11:36PM]: checking MOZ_DBUS_CFLAGS... -I/usr/include/dbus-1.0 -I/usr/lib/dbus-1.0/include
441  [06/16/2017 11:36PM]: checking MOZ_DBUS_LIBS... -ldbus-1
442  [06/16/2017 11:36PM]: checking for dbus-glib-1 >= 0.60... yes
443  [06/16/2017 11:36PM]: checking MOZ_DBUS_GLIB_CFLAGS... -I/usr/include/dbus-1.0 -I/usr/lib/dbus-1.0/include -I/usr/include/glib-2.0 -I/usr/lib/glib-2.0/include
444  [06/16/2017 11:36PM]: checking MOZ_DBUS_GLIB_LIBS... -ldbus-glib-1 -ldbus-1 -lgobject-2.0 -lglib-2.0
445  [06/16/2017 11:36PM]: checking MOZ_LIBVPX_CFLAGS...
446  [06/16/2017 11:36PM]: checking MOZ_LIBVPX_LIBS... -lvpx -lm
447  [06/16/2017 11:36PM]: checking for vpx/vpx_decoder.h... yes
448  [06/16/2017 11:36PM]: checking for vpx_codec_dec_init_ver in -lvpx... yes
449  [06/16/2017 11:36PM]: checking for vpx_mem/vpx_mem.h... no
450  [06/16/2017 11:36PM]: checking MOZ_PULSEAUDIO_CFLAGS... -D_REENTRANT
451  [06/16/2017 11:36PM]: checking MOZ_PULSEAUDIO_LIBS... -lpulse
452  [06/16/2017 11:36PM]: checking for linux/joystick.h... yes
453  [06/16/2017 11:36PM]: /pkg/src/firefox-55.0b2/old-configure: line 14851: test: : integer expression expected
454  [06/16/2017 11:36PM]: checking for sqlite3 >= 3.19.3... yes
455  [06/16/2017 11:36PM]: checking SQLITE_LIBS... -lsqlite3
456  [06/16/2017 11:36PM]: checking for SQLITE_SECURE_DELETE support in system SQLite... yes
457  [06/16/2017 11:36PM]: checking for SQLITE_THREADSAFE support in system SQLite... yes
458  [06/16/2017 11:36PM]: checking for SQLITE_ENABLE_FTS3 support in system SQLite... yes
459  [06/16/2017 11:36PM]: checking for SQLITE_ENABLE_UNLOCK_NOTIFY support in system SQLite... yes
460  [06/16/2017 11:36PM]: checking for SQLITE_ENABLE_DBSTAT_VTAB support in system SQLite... yes
461  [06/16/2017 11:36PM]: checking for valid C compiler optimization flags... yes
462  [06/16/2017 11:36PM]: checking whether linker creates PT_GNU_RELRO segments... yes
463  [06/16/2017 11:36PM]: configure: warning: Disabling elfhack
464  [06/16/2017 11:36PM]: checking for __cxa_demangle... yes
465  [06/16/2017 11:36PM]: checking for _Unwind_Backtrace... yes
466  [06/16/2017 11:36PM]: checking whether C compiler supports -fprofile-generate... yes
467  [06/16/2017 11:36PM]: checking what kind of list files are supported by the linker... linkerscript
468  [06/16/2017 11:36PM]: checking what kind of ordering can be done with the linker... section-ordering-file
469  [06/16/2017 11:36PM]: checking for glib-2.0 >= 1.3.7 gobject-2.0... yes
470  [06/16/2017 11:36PM]: checking GLIB_CFLAGS... -I/usr/include/glib-2.0 -I/usr/lib/glib-2.0/include
471  [06/16/2017 11:36PM]: checking GLIB_LIBS... -lgobject-2.0 -lglib-2.0
472  [06/16/2017 11:36PM]: checking for FT_Bitmap_Size.y_ppem... yes
473  [06/16/2017 11:36PM]: checking for FT_GlyphSlot_Embolden... yes
474  [06/16/2017 11:36PM]: checking for FT_Load_Sfnt_Table... yes
475  [06/16/2017 11:36PM]: checking for fontconfig/fcfreetype.h... yes
476  [06/16/2017 11:36PM]: checking for pixman-1 >= 0.19.2... yes
477  [06/16/2017 11:36PM]: checking MOZ_PIXMAN_CFLAGS... -I/usr/include/pixman-1
478  [06/16/2017 11:36PM]: checking MOZ_PIXMAN_LIBS... -lpixman-1
479  [06/16/2017 11:36PM]: checking for icu-i18n >= 58.1... yes
480  [06/16/2017 11:36PM]: checking MOZ_ICU_LIBS... -licui18n -licuuc -licudata
481  [06/16/2017 11:36PM]: checking for posix_fallocate... yes
482  [06/16/2017 11:36PM]: js/src> running /pkg/src/firefox-55.0b2/obj-x86_64-pc-linux-gnu/_virtualenv/bin/python /pkg/src/firefox-55.0b2/build/../configure.py --enable-project=js --target=x86_64-pc-linux-gnu --host=x86_64-pc-linux-gnu --disable-crashreporter --enable-gold --enable-official-branding --enable-pie --enable-release --enable-startup-notification --enable-system-pixman --enable-system-sqlite --disable-updater --prefix=/usr --with-system-bz2 --with-system-icu --with-system-jpeg --with-system-libevent --with-system-libvpx --with-system-nss --with-system-zlib --enable-tests --disable-debug --disable-rust-debug --without-toolchain-prefix --enable-debug-symbols --enable-jemalloc --without-linux-headers --disable-warnings-as-errors --disable-js-shell --disable-shared-js --disable-export-js --disable-instruments --disable-callgrind --disable-profiling --disable-vtune --disable-gc-trace --disable-perf --disable-more-deterministic --enable-ctypes --with-system-ffi --disable-fuzzing --with-nspr-cflags=-I/usr/include/nspr --with-nspr-libs=-L/usr/lib -lplds4 -lplc4 -lnspr4 -lpthread -ldl --prefix=/pkg/src/firefox-55.0b2/obj-x86_64-pc-linux-gnu/dist JS_STANDALONE= --cache-file=/pkg/src/firefox-55.0b2/obj-x86_64-pc-linux-gnu/config.cache
483  [06/16/2017 11:36PM]: js/src> checking for a shell... /usr/bin/sh
484  [06/16/2017 11:36PM]: js/src> checking for host system type... x86_64-pc-linux-gnu
485  [06/16/2017 11:36PM]: js/src> checking for target system type... x86_64-pc-linux-gnu
486  [06/16/2017 11:36PM]: js/src> checking for the Android toolchain directory... not found
487  [06/16/2017 11:36PM]: js/src> checking whether cross compiling... no
488  [06/16/2017 11:36PM]: js/src> checking for the target C compiler... /usr/bin/gcc
489  [06/16/2017 11:36PM]: js/src> checking whether the target C compiler can be used... yes
490  [06/16/2017 11:36PM]: js/src> checking for pkg_config... /usr/bin/pkg-config
491  [06/16/2017 11:36PM]: js/src> checking for pkg-config version... 0.29.2
492  [06/16/2017 11:36PM]: js/src> checking for yasm... /usr/bin/yasm
493  [06/16/2017 11:36PM]: js/src> checking yasm version... 1.3.0
494  [06/16/2017 11:36PM]: js/src> checking for android ndk version... no
495  [06/16/2017 11:36PM]: js/src> checking for android platform directory... no
496  [06/16/2017 11:36PM]: js/src> checking the target C compiler version... 7.1.1
497  [06/16/2017 11:36PM]: js/src> checking the target C compiler works... yes
498  [06/16/2017 11:36PM]: js/src> checking for the target C++ compiler... /usr/bin/g++
499  [06/16/2017 11:36PM]: js/src> checking whether the target C++ compiler can be used... yes
500  [06/16/2017 11:36PM]: js/src> checking the target C++ compiler version... 7.1.1
501  [06/16/2017 11:36PM]: js/src> checking the target C++ compiler works... yes
502  [06/16/2017 11:36PM]: js/src> checking for the host C compiler... /usr/bin/gcc
503  [06/16/2017 11:36PM]: js/src> checking whether the host C compiler can be used... yes
504  [06/16/2017 11:36PM]: js/src> checking the host C compiler version... 7.1.1
505  [06/16/2017 11:36PM]: js/src> checking the host C compiler works... yes
506  [06/16/2017 11:36PM]: js/src> checking for the host C++ compiler... /usr/bin/g++
507  [06/16/2017 11:36PM]: js/src> checking whether the host C++ compiler can be used... yes
508  [06/16/2017 11:36PM]: js/src> checking the host C++ compiler version... 7.1.1
509  [06/16/2017 11:36PM]: js/src> checking the host C++ compiler works... yes
510  [06/16/2017 11:36PM]: js/src> checking for 64-bit OS... yes
511  [06/16/2017 11:36PM]: js/src> checking for stdint.h... yes
512  [06/16/2017 11:36PM]: js/src> checking for inttypes.h... yes
513  [06/16/2017 11:36PM]: js/src> checking for malloc.h... yes
514  [06/16/2017 11:36PM]: js/src> checking for alloca.h... yes
515  [06/16/2017 11:36PM]: js/src> checking for sys/byteorder.h... no
516  [06/16/2017 11:36PM]: js/src> checking for getopt.h... yes
517  [06/16/2017 11:36PM]: js/src> checking for unistd.h... yes
518  [06/16/2017 11:36PM]: js/src> checking for cpuid.h... yes
519  [06/16/2017 11:36PM]: js/src> checking for sys/statvfs.h... yes
520  [06/16/2017 11:36PM]: js/src> checking for sys/statfs.h... yes
521  [06/16/2017 11:36PM]: js/src> checking for sys/vfs.h... yes
522  [06/16/2017 11:36PM]: js/src> checking for sys/mount.h... yes
523  [06/16/2017 11:36PM]: js/src> checking for sys/quota.h... yes
524  [06/16/2017 11:36PM]: js/src> checking for linux/quota.h... yes
525  [06/16/2017 11:36PM]: js/src> checking for linux/if_addr.h... yes
526  [06/16/2017 11:36PM]: js/src> checking for linux/rtnetlink.h... yes
527  [06/16/2017 11:36PM]: js/src> checking for sys/queue.h... yes
528  [06/16/2017 11:36PM]: js/src> checking for sys/types.h... yes
529  [06/16/2017 11:36PM]: js/src> checking for netinet/in.h... yes
530  [06/16/2017 11:36PM]: js/src> checking for byteswap.h... yes
531  [06/16/2017 11:36PM]: js/src> checking for linux/perf_event.h... yes
532  [06/16/2017 11:36PM]: js/src> checking for perf_event_open system call... yes
533  [06/16/2017 11:36PM]: js/src> checking whether the C compiler supports -Wclass-varargs... no
534  [06/16/2017 11:36PM]: js/src> checking whether the C++ compiler supports -Wclass-varargs... no
535  [06/16/2017 11:36PM]: js/src> checking whether the C compiler supports -Wloop-analysis... no
536  [06/16/2017 11:36PM]: js/src> checking whether the C++ compiler supports -Wloop-analysis... no
537  [06/16/2017 11:36PM]: js/src> checking whether the C++ compiler supports -Wc++11-compat-pedantic... no
538  [06/16/2017 11:36PM]: js/src> checking whether the C++ compiler supports -Wc++14-compat... yes
539  [06/16/2017 11:36PM]: js/src> checking whether the C++ compiler supports -Wc++14-compat-pedantic... no
540  [06/16/2017 11:36PM]: js/src> checking whether the C++ compiler supports -Wc++1z-compat... yes
541  [06/16/2017 11:36PM]: js/src> checking whether the C++ compiler supports -Wcomma... no
542  [06/16/2017 11:36PM]: js/src> checking whether the C++ compiler supports -Wimplicit-fallthrough... yes
543  [06/16/2017 11:36PM]: js/src> checking whether the C compiler supports -Wstring-conversion... no
544  [06/16/2017 11:36PM]: js/src> checking whether the C++ compiler supports -Wstring-conversion... no
545  [06/16/2017 11:36PM]: js/src> checking whether the C++ compiler supports -Wno-inline-new-delete... no
546  [06/16/2017 11:36PM]: js/src> checking whether the C compiler supports -Wno-error=maybe-uninitialized... yes
547  [06/16/2017 11:36PM]: js/src> checking whether the C++ compiler supports -Wno-error=maybe-uninitialized... yes
548  [06/16/2017 11:36PM]: js/src> checking whether the C compiler supports -Wno-error=deprecated-declarations... yes
549  [06/16/2017 11:36PM]: js/src> checking whether the C++ compiler supports -Wno-error=deprecated-declarations... yes
550  [06/16/2017 11:36PM]: js/src> checking whether the C compiler supports -Wno-error=array-bounds... yes
551  [06/16/2017 11:36PM]: js/src> checking whether the C++ compiler supports -Wno-error=array-bounds... yes
552  [06/16/2017 11:36PM]: js/src> checking whether the C compiler supports -Wno-error=free-nonheap-object... yes
553  [06/16/2017 11:36PM]: js/src> checking whether the C++ compiler supports -Wno-error=free-nonheap-object... yes
554  [06/16/2017 11:36PM]: js/src> checking whether the C compiler supports -Wformat... yes
555  [06/16/2017 11:36PM]: js/src> checking whether the C++ compiler supports -Wformat... yes
556  [06/16/2017 11:36PM]: js/src> checking whether the C compiler supports -Wno-gnu-zero-variadic-macro-arguments... no
557  [06/16/2017 11:36PM]: js/src> checking whether the C++ compiler supports -Wno-gnu-zero-variadic-macro-arguments... no
558  [06/16/2017 11:36PM]: js/src> checking whether the C compiler supports -Wformat-security... no
559  [06/16/2017 11:36PM]: js/src> checking whether the C++ compiler supports -Wformat-security... no
560  [06/16/2017 11:36PM]: js/src> checking whether the C compiler supports -Wformat-overflow=2... yes
561  [06/16/2017 11:36PM]: js/src> checking whether the C++ compiler supports -Wformat-overflow=2... yes
562  [06/16/2017 11:36PM]: js/src> checking for libffi > 3.0.9... yes
563  [06/16/2017 11:36PM]: js/src> checking MOZ_FFI_CFLAGS... -I/usr/lib/libffi-3.2.1/include
564  [06/16/2017 11:36PM]: js/src> checking MOZ_FFI_LIBS... -L/usr/lib/../lib -lffi
565  [06/16/2017 11:36PM]: js/src> checking for awk... /usr/bin/gawk
566  [06/16/2017 11:36PM]: js/src> checking for perl... /usr/bin/perl
567  [06/16/2017 11:36PM]: js/src> checking for minimum required perl version >= 5.006... 5.026000
568  [06/16/2017 11:36PM]: js/src> checking for full perl installation... yes
569  [06/16/2017 11:36PM]: js/src> checking for gmake... /usr/bin/make
570  [06/16/2017 11:36PM]: js/src> checking for doxygen... not found
571  [06/16/2017 11:36PM]: js/src> checking for xargs... /usr/bin/xargs
572  [06/16/2017 11:36PM]: js/src> checking for rpmbuild... not found
573  [06/16/2017 11:36PM]: js/src> checking for autoconf... /usr/bin/autoconf-2.13
574  [06/16/2017 11:36PM]: js/src> Refreshing /pkg/src/firefox-55.0b2/js/src/old-configure with /usr/bin/autoconf-2.13
575  [06/16/2017 11:36PM]: js/src> loading cache /pkg/src/firefox-55.0b2/obj-x86_64-pc-linux-gnu/config.cache
576  [06/16/2017 11:36PM]: js/src> checking host system type... x86_64-pc-linux-gnu
577  [06/16/2017 11:36PM]: js/src> checking target system type... x86_64-pc-linux-gnu
578  [06/16/2017 11:36PM]: js/src> checking build system type... x86_64-pc-linux-gnu
579  [06/16/2017 11:36PM]: js/src> checking for gcc... (cached) /usr/bin/gcc -std=gnu99
580  [06/16/2017 11:36PM]: js/src> checking whether the C compiler (/usr/bin/gcc -std=gnu99 -march=x86-64 -mtune=generic -O2 -pipe -fstack-protector-strong -Wl,-O1,--sort-common,--as-needed,-z,relro -Wl,-z,now) works... yes
581  [06/16/2017 11:36PM]: js/src> checking whether the C compiler (/usr/bin/gcc -std=gnu99 -march=x86-64 -mtune=generic -O2 -pipe -fstack-protector-strong -Wl,-O1,--sort-common,--as-needed,-z,relro -Wl,-z,now) is a cross-compiler... no
582  [06/16/2017 11:36PM]: js/src> checking whether we are using GNU C... (cached) yes
583  [06/16/2017 11:36PM]: js/src> checking whether /usr/bin/gcc -std=gnu99 accepts -g... (cached) yes
584  [06/16/2017 11:36PM]: js/src> checking for c++... (cached) /usr/bin/g++ -std=gnu++11
585  [06/16/2017 11:36PM]: js/src> checking whether the C++ compiler (/usr/bin/g++ -std=gnu++11 -march=x86-64 -mtune=generic -O2 -pipe -fstack-protector-strong -fno-delete-null-pointer-checks -fno-schedule-insns2 -Wl,-O1,--sort-common,--as-needed,-z,relro -Wl,-z,now) works... yes
586  [06/16/2017 11:36PM]: js/src> checking whether the C++ compiler (/usr/bin/g++ -std=gnu++11 -march=x86-64 -mtune=generic -O2 -pipe -fstack-protector-strong -fno-delete-null-pointer-checks -fno-schedule-insns2 -Wl,-O1,--sort-common,--as-needed,-z,relro -Wl,-z,now) is a cross-compiler... no
587  [06/16/2017 11:36PM]: js/src> checking whether we are using GNU C++... (cached) yes
588  [06/16/2017 11:36PM]: js/src> checking whether /usr/bin/g++ -std=gnu++11 accepts -g... (cached) yes
589  [06/16/2017 11:36PM]: js/src> checking for ranlib... (cached) ranlib
590  [06/16/2017 11:36PM]: js/src> checking for as... (cached) /usr/bin/as
591  [06/16/2017 11:36PM]: js/src> checking for ar... (cached) ar
592  [06/16/2017 11:36PM]: js/src> checking for strip... (cached) strip
593  [06/16/2017 11:36PM]: js/src> checking for windres... no
594  [06/16/2017 11:36PM]: js/src> checking for sb-conf... no
595  [06/16/2017 11:36PM]: js/src> checking for X... (cached) libraries /usr/lib64, headers
596  [06/16/2017 11:36PM]: js/src> checking for dnet_ntoa in -ldnet... (cached) no
597  [06/16/2017 11:36PM]: js/src> checking for dnet_ntoa in -ldnet_stub... (cached) no
598  [06/16/2017 11:36PM]: js/src> checking for gethostbyname... (cached) yes
599  [06/16/2017 11:36PM]: js/src> checking for connect... (cached) yes
600  [06/16/2017 11:36PM]: js/src> checking for remove... (cached) yes
601  [06/16/2017 11:36PM]: js/src> checking for shmat... (cached) yes
602  [06/16/2017 11:36PM]: js/src> checking for IceConnectionNumber in -lICE... (cached) yes
603  [06/16/2017 11:36PM]: js/src> checking for --noexecstack option to as... yes
604  [06/16/2017 11:36PM]: js/src> checking for -z noexecstack option to ld... yes
605  [06/16/2017 11:36PM]: js/src> checking for -z text option to ld... yes
606  [06/16/2017 11:36PM]: js/src> checking for --build-id option to ld... yes
607  [06/16/2017 11:36PM]: js/src> checking whether the linker supports Identical Code Folding... yes
608  [06/16/2017 11:36PM]: js/src> checking whether removing dead symbols breaks debugging... no
609  [06/16/2017 11:36PM]: js/src> checking for PIE support... yes
610  [06/16/2017 11:36PM]: js/src> checking for working const... (cached) yes
611  [06/16/2017 11:36PM]: js/src> checking for mode_t... (cached) yes
612  [06/16/2017 11:36PM]: js/src> checking for ssize_t... yes
613  [06/16/2017 11:36PM]: js/src> checking whether 64-bits std::atomic requires -latomic... (cached) no
614  [06/16/2017 11:36PM]: js/src> checking for dirent.h that defines DIR... (cached) yes
615  [06/16/2017 11:36PM]: js/src> checking for opendir in -ldir... (cached) no
616  [06/16/2017 11:36PM]: js/src> checking for gethostbyname_r in -lc_r... (cached) no
617  [06/16/2017 11:36PM]: js/src> checking for library containing dlopen... (cached) -ldl
618  [06/16/2017 11:36PM]: js/src> checking for dlfcn.h... (cached) yes
619  [06/16/2017 11:36PM]: js/src> checking for socket in -lsocket... (cached) no
620  [06/16/2017 11:36PM]: js/src> checking for pthread_create in -lpthreads... (cached) no
621  [06/16/2017 11:36PM]: js/src> checking for pthread_create in -lpthread... (cached) yes
622  [06/16/2017 11:36PM]: js/src> checking whether /usr/bin/gcc -std=gnu99 accepts -pthread... yes
623  [06/16/2017 11:36PM]: js/src> checking whether /usr/bin/gcc -std=gnu99 needs -traditional... (cached) no
624  [06/16/2017 11:36PM]: js/src> checking for 8-bit clean memcmp... (cached) yes
625  [06/16/2017 11:36PM]: js/src> checking for getc_unlocked... yes
626  [06/16/2017 11:36PM]: js/src> checking for _getc_nolock... no
627  [06/16/2017 11:36PM]: js/src> checking for gmtime_r... (cached) yes
628  [06/16/2017 11:36PM]: js/src> checking for localtime_r... (cached) yes
629  [06/16/2017 11:36PM]: js/src> checking for pthread_getname_np... yes
630  [06/16/2017 11:36PM]: js/src> checking for clock_gettime(CLOCK_MONOTONIC)... (cached)
631  [06/16/2017 11:36PM]: js/src> checking for sin in -lm... yes
632  [06/16/2017 11:36PM]: js/src> checking for sincos in -lm... yes
633  [06/16/2017 11:36PM]: js/src> checking for __sincos in -lm... no
634  [06/16/2017 11:36PM]: js/src> checking for wcrtomb... (cached) yes
635  [06/16/2017 11:36PM]: js/src> checking for mbrtowc... (cached) yes
636  [06/16/2017 11:36PM]: js/src> checking for res_ninit()... (cached) yes
637  [06/16/2017 11:36PM]: js/src> checking for nl_langinfo and CODESET... (cached) yes
638  [06/16/2017 11:36PM]: js/src> checking for an implementation of va_copy()... (cached) yes
639  [06/16/2017 11:36PM]: js/src> checking whether va_list can be copied by value... (cached) no
640  [06/16/2017 11:36PM]: js/src> checking for C++ dynamic_cast to void*... (cached) yes
641  [06/16/2017 11:36PM]: js/src> checking for __thread keyword for TLS variables... (cached) yes
642  [06/16/2017 11:36PM]: js/src> checking for LC_MESSAGES... (cached) yes
643  [06/16/2017 11:36PM]: js/src> checking for localeconv... (cached) yes
644  [06/16/2017 11:36PM]: js/src> checking NSPR selection... command-line
645  [06/16/2017 11:36PM]: js/src> checking for valid optimization flags... yes
646  [06/16/2017 11:36PM]: js/src> checking for __cxa_demangle... (cached) yes
647  [06/16/2017 11:36PM]: js/src> checking for -pipe support... yes
648  [06/16/2017 11:36PM]: js/src> checking whether C compiler supports -fprofile-generate... yes
649  [06/16/2017 11:36PM]: js/src> checking for tm_zone tm_gmtoff in struct tm... yes
650  [06/16/2017 11:36PM]: js/src> checking what kind of list files are supported by the linker... linkerscript
651  [06/16/2017 11:36PM]: js/src> checking what kind of ordering can be done with the linker... section-ordering-file
652  [06/16/2017 11:36PM]: js/src> checking for icu-i18n >= 58.1... yes
653  [06/16/2017 11:36PM]: js/src> checking MOZ_ICU_CFLAGS...
654  [06/16/2017 11:36PM]: js/src> checking MOZ_ICU_LIBS... -licui18n -licuuc -licudata
655  [06/16/2017 11:36PM]: js/src> checking for posix_fadvise... (cached) yes
656  [06/16/2017 11:36PM]: js/src> checking for posix_fallocate... (cached) yes
657  [06/16/2017 11:36PM]: js/src> checking for malloc.h... (cached) yes
658  [06/16/2017 11:36PM]: js/src> checking for strndup... (cached) yes
659  [06/16/2017 11:36PM]: js/src> checking for posix_memalign... (cached) yes
660  [06/16/2017 11:36PM]: js/src> checking for memalign... (cached) yes
661  [06/16/2017 11:36PM]: js/src> checking for malloc_usable_size... (cached) yes
662  [06/16/2017 11:36PM]: js/src> checking whether malloc_usable_size definition can use const argument... no
663  [06/16/2017 11:36PM]: js/src> checking for valloc in malloc.h... yes
664  [06/16/2017 11:36PM]: js/src> checking for valloc in unistd.h... no
665  [06/16/2017 11:36PM]: js/src> checking for setlocale... yes
666  [06/16/2017 11:36PM]: js/src> updating cache /pkg/src/firefox-55.0b2/obj-x86_64-pc-linux-gnu/config.cache
667  [06/16/2017 11:36PM]: js/src> creating ./config.data
668  [06/16/2017 11:36PM]: js/src> Creating config.status
669  [06/16/2017 11:37PM]: Traceback (most recent call last):
670  [06/16/2017 11:37PM]:   File /pkg/src/firefox-55.0b2/configure.py, line 124, in <module>
671  [06/16/2017 11:37PM]:     sys.exit(main(sys.argv))
672  [06/16/2017 11:37PM]:   File /pkg/src/firefox-55.0b2/configure.py, line 34, in main
673  [06/16/2017 11:37PM]:     return config_status(config)
674  [06/16/2017 11:37PM]:   File /pkg/src/firefox-55.0b2/configure.py, line 119, in config_status
675  [06/16/2017 11:37PM]:     return config_status(args=[], **encode(sanitized_config, encoding))
676  [06/16/2017 11:37PM]:   File /pkg/src/firefox-55.0b2/python/mozbuild/mozbuild/config_status.py, line 147, in config_status
677  [06/16/2017 11:37PM]:     definitions = list(definitions)
678  [06/16/2017 11:37PM]:   File /pkg/src/firefox-55.0b2/python/mozbuild/mozbuild/frontend/emitter.py, line 194, in emit
679  [06/16/2017 11:37PM]:     objs = list(self._emit_libs_derived(contexts))
680  [06/16/2017 11:37PM]:   File /pkg/src/firefox-55.0b2/python/mozbuild/mozbuild/frontend/emitter.py, line 228, in _emit_libs_derived
681  [06/16/2017 11:37PM]:     self._link_libraries(context, obj, variable)
682  [06/16/2017 11:37PM]:   File /pkg/src/firefox-55.0b2/python/mozbuild/mozbuild/frontend/emitter.py, line 341, in _link_libraries
683  [06/16/2017 11:37PM]: mozbuild.frontend.reader.SandboxValidationError:
684  [06/16/2017 11:37PM]: ==============================
685  [06/16/2017 11:37PM]: ERROR PROCESSING MOZBUILD FILE
686  [06/16/2017 11:37PM]: The error occurred while processing the following file or one of the files it includes:
687  [06/16/2017 11:37PM]:     /pkg/src/firefox-55.0b2/media/webrtc/trunk/gtest/moz.build
688  [06/16/2017 11:37PM]: The error occurred when validating the result of the execution. The reported error is:
689  [06/16/2017 11:37PM]:     USE_LIBS contains media_libjpeg, which does not match any LIBRARY_NAME in the tree.
690  [06/16/2017 11:37PM]: *** Fix above errors and then restart with\
691  [06/16/2017 11:37PM]:                make -f client.mk build
692  [06/16/2017 11:37PM]: make[2]: *** [/pkg/src/firefox-55.0b2/client.mk:383: configure] Error 1
693  [06/16/2017 11:37PM]: make[2]: Leaving directory /pkg/src/firefox-55.0b2
694  [06/16/2017 11:37PM]: make[1]: *** [/pkg/src/firefox-55.0b2/client.mk:396: /pkg/src/firefox-55.0b2/obj-x86_64-pc-linux-gnu/Makefile] Error 2
695  [06/16/2017 11:37PM]: make: *** [client.mk:170: build] Error 2
696  [06/16/2017 11:37PM]: ==> ERROR: A failure occurred in build().
697  [06/16/2017 11:37PM]: rm: cannot remove **.pkg.**: No such file or directory
698  [06/16/2017 11:37PM]: [\^/\^/^\^/^\^/\^/\^/^\^/^\^/]  BUILD FAILED  [\^/\^/^\^/^\^/\^/\^/^\^/^\^/]