Build Record

Build Number: 6970

Transaction: 3199
Package: cjs
Version: 3.4.4-1
Start: 08/09/2017 06:43AM
Finish: 08/09/2017 06:51AM
Result: completed
 cjs/PKGBUILD CHANGED

Build Log

   1 [08/09/2017 06:43AM]: [\^/\^/^\^/^\^/\^/\^/^\^/^\^/]  SETTING UP ENVIRONMENT  [\^/\^/^\^/^\^/\^/\^/^\^/^\^/]
   2  [08/09/2017 06:43AM]: [\^/\^/^\^/^\^/\^/\^/^\^/^\^/]  ADDING UPSTREAM PGP KEYS TO KEYRING  [\^/\^/^\^/^\^/\^/\^/^\^/^\^/]
   3  [08/09/2017 06:43AM]: gpg: WARNING: unsafe ownership on homedir /tmp/antbs/.gnupg
   4  [08/09/2017 06:43AM]: gpg: keybox /tmp/antbs/.gnupg/pubring.kbx created
   5  [08/09/2017 06:43AM]: key 23EFEFE93C4CFFFE:
   6  [08/09/2017 06:43AM]: 1 signature not checked due to a missing key
   7  [08/09/2017 06:43AM]: gpg: /tmp/antbs/.gnupg/trustdb.gpg: trustdb created
   8  [08/09/2017 06:43AM]: gpg: key 23EFEFE93C4CFFFE: public key Italo A. Casas <[email protected]> imported
   9  [08/09/2017 06:43AM]: 8 signatures not checked due to missing keys
  10  [08/09/2017 06:43AM]: gpg: key B63B535A4C206CA9: public key Evan Lucas <[email protected]> imported
  11  [08/09/2017 06:43AM]: 14 signatures not checked due to missing keys
  12  [08/09/2017 06:43AM]: gpg: key E73BC641CC11F4C8: public key Myles Borins <[email protected]> imported
  13  [08/09/2017 06:43AM]: gpg: key C273792F7D83545D: public key Rod Vagg <[email protected]> imported
  14  [08/09/2017 06:43AM]: gpg: key C97EC7A07EDE3FC1: public key keybase.io/jasnell <[email protected]> imported
  15  [08/09/2017 06:43AM]: gpg: key 09FE44734EB7990E: public key Jeremiah Senkpiel <[email protected]> imported
  16  [08/09/2017 06:43AM]: gpg: key 7434390BDBE9B9C5: public key Colin Ihrig <[email protected]> imported
  17  [08/09/2017 06:43AM]: gpg: key 61B7B526D98F0353: public key Mozilla Software Releases <[email protected]> imported
  18  [08/09/2017 06:43AM]: gpg: key 61B7B526D98F0353: Mozilla Software Releases <[email protected]> not changed
  19  [08/09/2017 06:43AM]: gpg: no ultimately trusted keys found
  20  [08/09/2017 06:43AM]: gpg: Total number processed: 9
  21  [08/09/2017 06:43AM]: gpg:               imported: 8
  22  [08/09/2017 06:43AM]: gpg:              unchanged: 1
  23  [08/09/2017 06:43AM]: [\^/\^/^\^/^\^/\^/\^/^\^/^\^/]  SYNCING REPO DATABASES  [\^/\^/^\^/^\^/\^/\^/^\^/^\^/]
  24  [08/09/2017 06:43AM]: :: Synchronizing package databases...
  25  [08/09/2017 06:43AM]: downloading antergos-staging.db...
  26  [08/09/2017 06:43AM]: downloading antergos.db...
  27  [08/09/2017 06:43AM]: downloading community.db...
  28  [08/09/2017 06:43AM]: :: Starting full system upgrade...
  29  [08/09/2017 06:43AM]: [\^/\^/^\^/^\^/\^/\^/^\^/^\^/]  i686 DETECTED  [\^/\^/^\^/^\^/\^/\^/^\^/^\^/]
  30  [08/09/2017 06:43AM]: cp: -r not specified; omitting directory /pkg/32bit
  31  [08/09/2017 06:43AM]: cp: -r not specified; omitting directory /pkg/32build
  32  [08/09/2017 06:43AM]: [\^/\^/^\^/^\^/\^/\^/^\^/^\^/]  TRYING BUILD  [\^/\^/^\^/^\^/\^/\^/^\^/^\^/]
  33  [08/09/2017 06:43AM]: [\^/\^/^\^/^\^/\^/\^/^\^/^\^/]  UPDATING SOURCE CHECKSUMS  [\^/\^/^\^/^\^/\^/\^/^\^/^\^/]
  34  [08/09/2017 06:43AM]:   -> Downloading cjs-3.4.4.tar.gz...
  35  [08/09/2017 06:43AM]:   % Total    % Received % Xferd  Average Speed   Time    Time     Time  Current
  36  [08/09/2017 06:43AM]:                                  Dload  Upload   Total   Spent    Left  Speed
  37  [08/09/2017 06:43AM]: 
  38   0     0    0     0    0     0      0      0 --:--:-- --:--:-- --:--:--     0
  39 100   120    0   120    0     0    736      0 --:--:-- --:--:-- --:--:--   740
  40  [08/09/2017 06:43AM]: 
  41 100  416k    0  416k    0     0   867k      0 --:--:-- --:--:-- --:--:--  867k
  42  [08/09/2017 06:43AM]: ==> Generating checksums for source files...
  43  [08/09/2017 06:43AM]: ==> Making package: cjs 3.4.4-1 (Wed Aug  9 11:43:50 UTC 2017)
  44  [08/09/2017 06:43AM]: ==> Checking runtime dependencies...
  45  [08/09/2017 06:43AM]: ==> Installing missing dependencies...
  46  [08/09/2017 06:43AM]: :: There are 3 providers available for libgl:
  47  [08/09/2017 06:43AM]:    1) libglvnd  2) nvidia-304xx-utils  3) nvidia-340xx-utils
  48  [08/09/2017 06:43AM]: Enter a number (default=1):
  49  [08/09/2017 06:43AM]: looking for conflicting packages...
  50  [08/09/2017 06:43AM]: warning: dependency cycle detected:
  51  [08/09/2017 06:43AM]: warning: harfbuzz will be installed before its freetype2 dependency
  52  [08/09/2017 06:43AM]: warning: mesa will be installed before its libglvnd dependency
  53  [08/09/2017 06:43AM]: Packages (41) damageproto-1.2.1-3  fixesproto-5.0+9+g4292ec1-1  fontconfig-2.12.4-1  freetype2-2.8-2  graphite-1:1.3.10-1  harfbuzz-1.4.8-1  kbproto-1.0.7-1  libdrm-2.4.82-1  libglvnd-0.2.999+g4ba53457-2  libomxil-bellagio-0.9.3-1  libpciaccess-0.13.5-1  libpng-1.6.31-1  libtxc_dxtn-1.0.1-6  libunwind-1.2.1-1  libx11-1.6.5-1  libxau-1.0.8-2  libxcb-1.12-1  libxdamage-1.1.4-2  libxdmcp-1.1.2-1  libxext-1.3.3-1  libxfixes-5.0.3-1  libxml2-2.9.4+96+gfb56f80e-1  libxrender-0.9.10-1  libxshmfence-1.2-1  libxxf86vm-1.1.4-1  llvm-libs-4.0.1-5  lm_sensors-3.4.0-2  lzo-2.10-1  mesa-17.1.6-1  nspr-4.15-1  pixman-0.34.0-1  renderproto-0.11.1-3  wayland-1.13.0-1  xcb-proto-1.12-3  xextproto-7.3.0-1  xf86vidmodeproto-2.3.1-3  xproto-7.0.31-1  cairo-1.14.10-1  dbus-glib-0.108-1  gobject-introspection-runtime-1.52.1-1  js38-38.8.0-3
  54  [08/09/2017 06:43AM]: Total Download Size:     2.73 MiB
  55  [08/09/2017 06:43AM]: Total Installed Size:  167.95 MiB
  56  [08/09/2017 06:43AM]: :: Proceed with installation? [Y/n]
  57  [08/09/2017 06:43AM]: downloading harfbuzz-1.4.8-1-x86_64.pkg.tar.xz...
  58  [08/09/2017 06:43AM]: downloading wayland-1.13.0-1-x86_64.pkg.tar.xz...
  59  [08/09/2017 06:43AM]: downloading js38-38.8.0-3-x86_64.pkg.tar.xz...
  60  [08/09/2017 06:43AM]: checking package integrity...
  61  [08/09/2017 06:44AM]: checking for file conflicts...
  62  [08/09/2017 06:44AM]: :: Processing package changes...
  63  [08/09/2017 06:44AM]: Optional dependencies for harfbuzz
  64  [08/09/2017 06:44AM]:     cairo: hb-view program [pending]
  65  [08/09/2017 06:44AM]: warning: directory permissions differ on /var/
  66  [08/09/2017 06:44AM]: filesystem: 777  package: 755
  67  [08/09/2017 06:44AM]:   Fontconfig configuration is done via /etc/fonts/conf.avail and conf.d.
  68  [08/09/2017 06:44AM]:   Read /etc/fonts/conf.d/README for more information.
  69  [08/09/2017 06:44AM]:   Configuration via /etc/fonts/local.conf is still possible,
  70  [08/09/2017 06:44AM]:   but is no longer recommended for options available in conf.avail.
  71  [08/09/2017 06:44AM]:   Main systemwide configuration should be done by symlinks
  72  [08/09/2017 06:44AM]:   (especially for autohinting, sub-pixel and lcdfilter):
  73  [08/09/2017 06:44AM]:   ln -s ../conf.avail/XX-foo.conf
  74  [08/09/2017 06:44AM]:   Check also https://wiki.archlinux.org/index.php/Font_Configuration
  75  [08/09/2017 06:44AM]:   and https://wiki.archlinux.org/index.php/Fonts.
  76  [08/09/2017 06:44AM]: Rebuilding fontconfig cache... done.
  77  [08/09/2017 06:44AM]: installing xf86vidmodeproto...
  78  [08/09/2017 06:44AM]: installing libomxil-bellagio...
  79  [08/09/2017 06:44AM]: Optional dependencies for lm_sensors
  80  [08/09/2017 06:44AM]:     rrdtool: for logging with sensord
  81  [08/09/2017 06:44AM]: Optional dependencies for mesa
  82  [08/09/2017 06:44AM]:     opengl-man-pages: for the OpenGL API man pages
  83  [08/09/2017 06:44AM]:     mesa-vdpau: for accelerated video playback
  84  [08/09/2017 06:44AM]:     libva-mesa-driver: for accelerated video playback
  85  [08/09/2017 06:44AM]: installing gobject-introspection-runtime...
  86  [08/09/2017 06:44AM]: :: Running post-transaction hooks...
  87  [08/09/2017 06:44AM]: (1/1) Arming ConditionNeedsUpdate...
  88  [08/09/2017 06:44AM]: Packages (24) autoconf-archive-1:2017.03.21-1  boost-libs-1.64.0-4  docbook-xml-4.5-6  docbook-xsl-1.79.2-3  glib2-docs-2.52.3-1  gtk-doc-1.25+33+g567353f-1  intltool-0.51.0-3  itstool-2.0.2+5+g676f3f7-2  libxslt-1.1.29+42+gac341cbd-1  perl-xml-parser-2.44-4  python-appdirs-1.4.3-1  python-beaker-1.8.1-2  python-mako-1.0.7-1  python-markupsafe-1.0-1  python-packaging-16.8-2  python-pyparsing-2.2.0-1  python-setuptools-1:36.2.7-1  python-six-1.10.0-3  source-highlight-3.1.8-12  yelp-tools-3.18.0+1+g193c2bd-1  yelp-xsl-3.20.1-2  gnome-common-3.18.0-2  gobject-introspection-1.52.1-1  python2-2.7.13-4
  89  [08/09/2017 06:44AM]: Total Download Size:    12.12 MiB
  90  [08/09/2017 06:44AM]: Total Installed Size:  144.09 MiB
  91  [08/09/2017 06:44AM]: downloading python2-2.7.13-4-x86_64.pkg.tar.xz...
  92  [08/09/2017 06:44AM]: downloading gobject-introspection-1.52.1-1-x86_64.pkg.tar.xz...
  93  [08/09/2017 06:44AM]: installing autoconf-archive...
  94  [08/09/2017 06:44AM]: Optional dependencies for autoconf-archive
  95  [08/09/2017 06:44AM]:     automake: macros for use with it [installed]
  96  [08/09/2017 06:44AM]: installing perl-xml-parser...
  97  [08/09/2017 06:44AM]: Optional dependencies for python2
  98  [08/09/2017 06:44AM]: Optional dependencies for boost-libs
  99  [08/09/2017 06:44AM]:     openmpi: for mpi support
 100  [08/09/2017 06:44AM]: installing source-highlight...
 101  [08/09/2017 06:44AM]: Optional dependencies for gtk-doc
 102  [08/09/2017 06:44AM]: installing python-markupsafe...
 103  [08/09/2017 06:44AM]: installing python-pyparsing...
 104  [08/09/2017 06:44AM]: installing python-appdirs...
 105  [08/09/2017 06:44AM]: installing python-setuptools...
 106  [08/09/2017 06:44AM]: installing gobject-introspection...
 107  [08/09/2017 06:44AM]: (2/2) Updating the info directory file...
 108  [08/09/2017 06:44AM]:   -> Found cjs-3.4.4.tar.gz
 109  [08/09/2017 06:44AM]: ==> Validating source files with md5sums...
 110  [08/09/2017 06:44AM]:     cjs-3.4.4.tar.gz ... Passed
 111  [08/09/2017 06:44AM]:   -> Extracting cjs-3.4.4.tar.gz with bsdtar
 112  [08/09/2017 06:44AM]: autoreconf: Entering directory `.
 113  [08/09/2017 06:44AM]: autoreconf: configure.ac: not using Gettext
 114  [08/09/2017 06:44AM]: autoreconf: running: aclocal --force -I m4
 115  [08/09/2017 06:44AM]: autoreconf: configure.ac: tracing
 116  [08/09/2017 06:44AM]: autoreconf: running: libtoolize --copy --force
 117  [08/09/2017 06:44AM]: libtoolize: putting auxiliary files in ..
 118  [08/09/2017 06:44AM]: libtoolize: copying file ./ltmain.sh
 119  [08/09/2017 06:44AM]: libtoolize: putting macros in AC_CONFIG_MACRO_DIRS, m4.
 120  [08/09/2017 06:44AM]: libtoolize: copying file m4/libtool.m4
 121  [08/09/2017 06:44AM]: libtoolize: copying file m4/ltoptions.m4
 122  [08/09/2017 06:44AM]: libtoolize: copying file m4/ltsugar.m4
 123  [08/09/2017 06:44AM]: libtoolize: copying file m4/ltversion.m4
 124  [08/09/2017 06:44AM]: libtoolize: copying file m4/lt~obsolete.m4
 125  [08/09/2017 06:44AM]: autoreconf: running: /usr/bin/autoconf --force
 126  [08/09/2017 06:44AM]: autoreconf: running: /usr/bin/autoheader --force
 127  [08/09/2017 06:44AM]: autoreconf: running: automake --add-missing --copy --force-missing
 128  [08/09/2017 06:44AM]: configure.ac:39: installing ./compile
 129  [08/09/2017 06:44AM]: configure.ac:39: installing ./config.guess
 130  [08/09/2017 06:44AM]: configure.ac:39: installing ./config.sub
 131  [08/09/2017 06:44AM]: configure.ac:12: installing ./install-sh
 132  [08/09/2017 06:44AM]: configure.ac:12: installing ./missing
 133  [08/09/2017 06:44AM]: configure.ac:18: installing ./tap-driver.sh
 134  [08/09/2017 06:44AM]: Makefile.am: installing ./INSTALL
 135  [08/09/2017 06:44AM]: Makefile.am: installing ./depcomp
 136  [08/09/2017 06:44AM]: autoreconf: Leaving directory `.
 137  [08/09/2017 06:44AM]: checking for a BSD-compatible install... /usr/bin/install -c
 138  [08/09/2017 06:44AM]: checking whether build environment is sane... yes
 139  [08/09/2017 06:44AM]: checking for a thread-safe mkdir -p... /usr/bin/mkdir -p
 140  [08/09/2017 06:44AM]: checking whether make sets $(MAKE)... yes
 141  [08/09/2017 06:44AM]: checking whether make supports nested variables... yes
 142  [08/09/2017 06:44AM]: checking whether UID 1001 is supported by ustar format... yes
 143  [08/09/2017 06:44AM]: checking whether GID 100 is supported by ustar format... yes
 144  [08/09/2017 06:44AM]: checking how to create a ustar tar archive... gnutar
 145  [08/09/2017 06:44AM]: checking whether to enable maintainer-specific portions of Makefiles... yes
 146  [08/09/2017 06:44AM]: checking whether make supports nested variables... (cached) yes
 147  [08/09/2017 06:44AM]: checking for pkg-config... /usr/bin/pkg-config
 148  [08/09/2017 06:44AM]: checking pkg-config is at least version 0.9.0... yes
 149  [08/09/2017 06:44AM]: checking whether the C++ compiler works... yes
 150  [08/09/2017 06:44AM]: checking for C++ compiler default output file name... a.out
 151  [08/09/2017 06:44AM]: checking for suffix of executables...
 152  [08/09/2017 06:44AM]: checking whether we are cross compiling... no
 153  [08/09/2017 06:44AM]: checking for suffix of object files... o
 154  [08/09/2017 06:44AM]: checking whether we are using the GNU C++ compiler... yes
 155  [08/09/2017 06:44AM]: checking whether g++ accepts -g... yes
 156  [08/09/2017 06:44AM]: checking for style of include used by make... GNU
 157  [08/09/2017 06:44AM]: checking dependency style of g++... gcc3
 158  [08/09/2017 06:44AM]: checking whether g++ supports C++11 features by default... yes
 159  [08/09/2017 06:44AM]: checking build system type... x86_64-pc-linux-gnu
 160  [08/09/2017 06:44AM]: checking host system type... x86_64-pc-linux-gnu
 161  [08/09/2017 06:44AM]: checking how to print strings... printf
 162  [08/09/2017 06:44AM]: checking whether we are using the GNU C compiler... yes
 163  [08/09/2017 06:44AM]: checking for gcc option to accept ISO C89... none needed
 164  [08/09/2017 06:44AM]: checking whether gcc understands -c and -o together... yes
 165  [08/09/2017 06:44AM]: checking dependency style of gcc... gcc3
 166  [08/09/2017 06:44AM]: checking for a sed that does not truncate output... /usr/bin/sed
 167  [08/09/2017 06:44AM]: checking for grep that handles long lines and -e... /usr/bin/grep
 168  [08/09/2017 06:44AM]: checking for egrep... /usr/bin/grep -E
 169  [08/09/2017 06:44AM]: checking for fgrep... /usr/bin/grep -F
 170  [08/09/2017 06:44AM]: checking for ld used by gcc... /usr/bin/ld
 171  [08/09/2017 06:44AM]: checking if the linker (/usr/bin/ld) is GNU ld... yes
 172  [08/09/2017 06:44AM]: checking for BSD- or MS-compatible name lister (nm)... /usr/bin/nm -B
 173  [08/09/2017 06:44AM]: checking the name lister (/usr/bin/nm -B) interface... BSD nm
 174  [08/09/2017 06:44AM]: checking whether ln -s works... yes
 175  [08/09/2017 06:44AM]: checking the maximum length of command line arguments... 1572864
 176  [08/09/2017 06:44AM]: checking how to convert x86_64-pc-linux-gnu file names to x86_64-pc-linux-gnu format... func_convert_file_noop
 177  [08/09/2017 06:44AM]: checking how to convert x86_64-pc-linux-gnu file names to toolchain format... func_convert_file_noop
 178  [08/09/2017 06:44AM]: checking for /usr/bin/ld option to reload object files... -r
 179  [08/09/2017 06:44AM]: checking for objdump... objdump
 180  [08/09/2017 06:44AM]: checking how to recognize dependent libraries... pass_all
 181  [08/09/2017 06:44AM]: checking for dlltool... no
 182  [08/09/2017 06:44AM]: checking how to associate runtime and link libraries... printf %s\n
 183  [08/09/2017 06:44AM]: checking for archiver @FILE support... @
 184  [08/09/2017 06:44AM]: checking for strip... strip
 185  [08/09/2017 06:44AM]: checking for ranlib... ranlib
 186  [08/09/2017 06:44AM]: checking command to parse /usr/bin/nm -B output from gcc object... ok
 187  [08/09/2017 06:44AM]: checking for a working dd... /usr/bin/dd
 188  [08/09/2017 06:44AM]: checking how to truncate binary pipes... /usr/bin/dd bs=4096 count=1
 189  [08/09/2017 06:44AM]: checking if : is a manifest tool... no
 190  [08/09/2017 06:44AM]: checking how to run the C preprocessor... gcc -E
 191  [08/09/2017 06:44AM]: checking for ANSI C header files... yes
 192  [08/09/2017 06:44AM]: checking for sys/types.h... yes
 193  [08/09/2017 06:44AM]: checking for sys/stat.h... yes
 194  [08/09/2017 06:44AM]: checking for stdlib.h... yes
 195  [08/09/2017 06:44AM]: checking for strings.h... yes
 196  [08/09/2017 06:44AM]: checking for dlfcn.h... yes
 197  [08/09/2017 06:44AM]: checking for objdir... .libs
 198  [08/09/2017 06:44AM]: checking if gcc supports -fno-rtti -fno-exceptions... no
 199  [08/09/2017 06:44AM]: checking for gcc option to produce PIC... -fPIC -DPIC
 200  [08/09/2017 06:44AM]: checking if gcc PIC flag -fPIC -DPIC works... yes
 201  [08/09/2017 06:44AM]: checking if gcc static flag -static works... yes
 202  [08/09/2017 06:44AM]: checking if gcc supports -c -o file.o... yes
 203  [08/09/2017 06:44AM]: checking if gcc supports -c -o file.o... (cached) yes
 204  [08/09/2017 06:44AM]: checking whether the gcc linker (/usr/bin/ld -m elf_x86_64) supports shared libraries... yes
 205  [08/09/2017 06:44AM]: checking whether -lc should be explicitly linked in... no
 206  [08/09/2017 06:44AM]: checking dynamic linker characteristics... GNU/Linux ld.so
 207  [08/09/2017 06:44AM]: checking how to hardcode library paths into programs... immediate
 208  [08/09/2017 06:44AM]: checking whether stripping libraries is possible... yes
 209  [08/09/2017 06:44AM]: checking if libtool supports shared libraries... yes
 210  [08/09/2017 06:44AM]: checking whether to build shared libraries... yes
 211  [08/09/2017 06:44AM]: checking whether to build static libraries... no
 212  [08/09/2017 06:44AM]: checking how to run the C++ preprocessor... g++ -E
 213  [08/09/2017 06:44AM]: checking for ld used by g++... /usr/bin/ld -m elf_x86_64
 214  [08/09/2017 06:44AM]: checking if the linker (/usr/bin/ld -m elf_x86_64) is GNU ld... yes
 215  [08/09/2017 06:44AM]: checking dynamic linker characteristics... (cached) GNU/Linux ld.so
 216  [08/09/2017 06:44AM]: checking for a sed that does not truncate output... (cached) /usr/bin/sed
 217  [08/09/2017 06:44AM]: checking for gawk... (cached) gawk
 218  [08/09/2017 06:44AM]: checking whether C compiler accepts -Werror=unknown-warning-option... no
 219  [08/09/2017 06:44AM]: checking whether C compiler accepts -Wno-suggest-attribute=format... yes
 220  [08/09/2017 06:44AM]: checking whether C compiler accepts -fno-strict-aliasing... yes
 221  [08/09/2017 06:44AM]: checking whether C compiler accepts -Wall... yes
 222  [08/09/2017 06:44AM]: checking whether C compiler accepts -Wextra... yes
 223  [08/09/2017 06:44AM]: checking whether C compiler accepts -Wundef... yes
 224  [08/09/2017 06:44AM]: checking whether C compiler accepts -Wnested-externs... yes
 225  [08/09/2017 06:44AM]: checking whether C compiler accepts -Wwrite-strings... yes
 226  [08/09/2017 06:44AM]: checking whether C compiler accepts -Wpointer-arith... yes
 227  [08/09/2017 06:44AM]: checking whether C compiler accepts -Wmissing-declarations... yes
 228  [08/09/2017 06:44AM]: checking whether C compiler accepts -Wmissing-prototypes... yes
 229  [08/09/2017 06:44AM]: checking whether C compiler accepts -Wstrict-prototypes... yes
 230  [08/09/2017 06:44AM]: checking whether C compiler accepts -Wredundant-decls... yes
 231  [08/09/2017 06:44AM]: checking whether C compiler accepts -Wno-unused-parameter... yes
 232  [08/09/2017 06:44AM]: checking whether C compiler accepts -Wno-missing-field-initializers... yes
 233  [08/09/2017 06:44AM]: checking whether C compiler accepts -Wdeclaration-after-statement... yes
 234  [08/09/2017 06:44AM]: checking whether C compiler accepts -Wformat=2... yes
 235  [08/09/2017 06:44AM]: checking whether C compiler accepts -Wold-style-definition... yes
 236  [08/09/2017 06:44AM]: checking whether C compiler accepts -Wcast-align... yes
 237  [08/09/2017 06:44AM]: checking whether C compiler accepts -Wformat-nonliteral... yes
 238  [08/09/2017 06:44AM]: checking whether C compiler accepts -Wformat-security... yes
 239  [08/09/2017 06:44AM]: checking whether C compiler accepts -Wsign-compare... yes
 240  [08/09/2017 06:44AM]: checking whether C compiler accepts -Wstrict-aliasing... yes
 241  [08/09/2017 06:44AM]: checking whether C compiler accepts -Wshadow... yes
 242  [08/09/2017 06:44AM]: checking whether C compiler accepts -Winline... yes
 243  [08/09/2017 06:44AM]: checking whether C compiler accepts -Wpacked... yes
 244  [08/09/2017 06:44AM]: checking whether C compiler accepts -Wmissing-format-attribute... yes
 245  [08/09/2017 06:44AM]: checking whether C compiler accepts -Wmissing-noreturn... yes
 246  [08/09/2017 06:44AM]: checking whether C compiler accepts -Winit-self... yes
 247  [08/09/2017 06:44AM]: checking whether C compiler accepts -Wredundant-decls... (cached) yes
 248  [08/09/2017 06:44AM]: checking whether C compiler accepts -Wmissing-include-dirs... yes
 249  [08/09/2017 06:44AM]: checking whether C compiler accepts -Wunused-but-set-variable... yes
 250  [08/09/2017 06:44AM]: checking whether C compiler accepts -Warray-bounds... yes
 251  [08/09/2017 06:44AM]: checking whether C compiler accepts -Wimplicit-function-declaration... yes
 252  [08/09/2017 06:44AM]: checking whether C compiler accepts -Wreturn-type... yes
 253  [08/09/2017 06:44AM]: checking whether C compiler accepts -Wswitch-enum... yes
 254  [08/09/2017 06:44AM]: checking whether C compiler accepts -Wswitch-default... yes
 255  [08/09/2017 06:44AM]: checking whether C compiler accepts -Wno-error=unused-parameter... yes
 256  [08/09/2017 06:44AM]: checking whether C compiler accepts -Wno-error=missing-field-initializers... yes
 257  [08/09/2017 06:44AM]: checking whether C++ compiler accepts -Werror=unknown-warning-option... no
 258  [08/09/2017 06:44AM]: checking whether C++ compiler accepts -Wno-suggest-attribute=format... yes
 259  [08/09/2017 06:44AM]: checking whether C++ compiler accepts -fno-strict-aliasing... yes
 260  [08/09/2017 06:44AM]: checking whether C++ compiler accepts -Wall... yes
 261  [08/09/2017 06:44AM]: checking whether C++ compiler accepts -Wextra... yes
 262  [08/09/2017 06:44AM]: checking whether C++ compiler accepts -Wundef... yes
 263  [08/09/2017 06:44AM]: checking whether C++ compiler accepts -Wwrite-strings... yes
 264  [08/09/2017 06:44AM]: checking whether C++ compiler accepts -Wpointer-arith... yes
 265  [08/09/2017 06:44AM]: checking whether C++ compiler accepts -Wmissing-declarations... yes
 266  [08/09/2017 06:44AM]: checking whether C++ compiler accepts -Wredundant-decls... yes
 267  [08/09/2017 06:44AM]: checking whether C++ compiler accepts -Wno-unused-parameter... yes
 268  [08/09/2017 06:44AM]: checking whether C++ compiler accepts -Wno-missing-field-initializers... yes
 269  [08/09/2017 06:44AM]: checking whether C++ compiler accepts -Wformat=2... yes
 270  [08/09/2017 06:44AM]: checking whether C++ compiler accepts -Wcast-align... yes
 271  [08/09/2017 06:44AM]: checking whether C++ compiler accepts -Wformat-nonliteral... yes
 272  [08/09/2017 06:44AM]: checking whether C++ compiler accepts -Wformat-security... yes
 273  [08/09/2017 06:44AM]: checking whether C++ compiler accepts -Wsign-compare... yes
 274  [08/09/2017 06:44AM]: checking whether C++ compiler accepts -Wstrict-aliasing... yes
 275  [08/09/2017 06:44AM]: checking whether C++ compiler accepts -Wshadow... yes
 276  [08/09/2017 06:44AM]: checking whether C++ compiler accepts -Winline... yes
 277  [08/09/2017 06:44AM]: checking whether C++ compiler accepts -Wpacked... yes
 278  [08/09/2017 06:44AM]: checking whether C++ compiler accepts -Wmissing-format-attribute... yes
 279  [08/09/2017 06:44AM]: checking whether C++ compiler accepts -Wmissing-noreturn... yes
 280  [08/09/2017 06:44AM]: checking whether C++ compiler accepts -Winit-self... yes
 281  [08/09/2017 06:44AM]: checking whether C++ compiler accepts -Wredundant-decls... (cached) yes
 282  [08/09/2017 06:44AM]: checking whether C++ compiler accepts -Wmissing-include-dirs... yes
 283  [08/09/2017 06:44AM]: checking whether C++ compiler accepts -Wunused-but-set-variable... yes
 284  [08/09/2017 06:44AM]: checking whether C++ compiler accepts -Warray-bounds... yes
 285  [08/09/2017 06:44AM]: checking whether C++ compiler accepts -Wreturn-type... yes
 286  [08/09/2017 06:44AM]: checking whether C++ compiler accepts -Wno-overloaded-virtual... yes
 287  [08/09/2017 06:44AM]: checking whether C++ compiler accepts -Wswitch-enum... yes
 288  [08/09/2017 06:44AM]: checking whether C++ compiler accepts -Wswitch-default... yes
 289  [08/09/2017 06:44AM]: checking whether C++ compiler accepts -Wno-error=unused-parameter... yes
 290  [08/09/2017 06:44AM]: checking whether C++ compiler accepts -Wno-error=missing-field-initializers... yes
 291  [08/09/2017 06:44AM]: checking whether C++ compiler accepts -Wno-error=overloaded-virtual... yes
 292  [08/09/2017 06:44AM]: checking whether C++ compiler accepts -Werror=unknown-warning-option... (cached) no
 293  [08/09/2017 06:44AM]: checking whether the linker accepts -Wl,--no-as-needed... yes
 294  [08/09/2017 06:44AM]: checking whether the linker accepts -Wl,--fatal-warnings... yes
 295  [08/09/2017 06:44AM]: checking whether the linker accepts -Wl,-fatal_warnings... no
 296  [08/09/2017 06:44AM]: checking whether to build with code coverage support... no
 297  [08/09/2017 06:44AM]: checking whether the linker accepts -lgcov... yes
 298  [08/09/2017 06:44AM]: checking for gobject-introspection... yes
 299  [08/09/2017 06:44AM]: checking for gobject-2.0 >= 2.42.0... yes
 300  [08/09/2017 06:44AM]: checking for gobject-introspection-1.0 libffi gthread-2.0 gio-2.0 >= 2.42.0 mozjs-38... yes
 301  [08/09/2017 06:44AM]: checking for gobject-2.0 >= 2.42.0 gio-2.0... yes
 302  [08/09/2017 06:44AM]: checking for gio-unix-2.0 gobject-introspection-1.0 libffi gthread-2.0 gio-2.0 >= 2.42.0 mozjs-38... yes
 303  [08/09/2017 06:44AM]: checking for cairo cairo-gobject gthread-2.0 gio-2.0 >= 2.42.0 mozjs-38... yes
 304  [08/09/2017 06:44AM]: checking for gtk+-3.0 >= 3.14.0... no
 305  [08/09/2017 06:44AM]: checking how to link readline libs... -lreadline
 306  [08/09/2017 06:44AM]: checking readline/readline.h usability... yes
 307  [08/09/2017 06:44AM]: checking readline/readline.h presence... yes
 308  [08/09/2017 06:44AM]: checking for readline/readline.h... yes
 309  [08/09/2017 06:44AM]: checking whether printf() accepts %Id for alternative integer output... no
 310  [08/09/2017 06:44AM]: checking whether the linker accepts -Bsymbolic-functions... yes
 311  [08/09/2017 06:44AM]: checking whether C++ compiler accepts -fno-rtti... yes
 312  [08/09/2017 06:44AM]: checking for dbus-run-session... /usr/bin/dbus-run-session
 313  [08/09/2017 06:44AM]: checking whether C++ compiler accepts --param inline-unit-growth=50... yes
 314  [08/09/2017 06:44AM]: checking that generated files are newer than configure... done
 315  [08/09/2017 06:44AM]: configure: creating ./config.status
 316  [08/09/2017 06:44AM]: config.status: creating Makefile
 317  [08/09/2017 06:44AM]: config.status: creating cjs-1.0.pc
 318  [08/09/2017 06:44AM]: config.status: creating win32/config.h.win32
 319  [08/09/2017 06:44AM]: config.status: creating config.h
 320  [08/09/2017 06:44AM]: config.status: linking /usr/share/gobject-introspection-1.0/tests/gitestmacros.h to installed-tests/gitestmacros.h
 321  [08/09/2017 06:44AM]: config.status: linking /usr/share/gobject-introspection-1.0/tests/regress.c to installed-tests/regress.c
 322  [08/09/2017 06:44AM]: config.status: linking /usr/share/gobject-introspection-1.0/tests/regress.h to installed-tests/regress.h
 323  [08/09/2017 06:44AM]: config.status: linking /usr/share/gobject-introspection-1.0/tests/warnlib.c to installed-tests/warnlib.c
 324  [08/09/2017 06:44AM]: config.status: linking /usr/share/gobject-introspection-1.0/tests/warnlib.h to installed-tests/warnlib.h
 325  [08/09/2017 06:44AM]: config.status: linking /usr/share/gobject-introspection-1.0/tests/gimarshallingtests.c to installed-tests/gimarshallingtests.c
 326  [08/09/2017 06:44AM]: config.status: linking /usr/share/gobject-introspection-1.0/tests/gimarshallingtests.h to installed-tests/gimarshallingtests.h
 327  [08/09/2017 06:44AM]: config.status: executing depfiles commands
 328  [08/09/2017 06:44AM]: config.status: executing libtool commands
 329  [08/09/2017 06:44AM]: 	GJS_CFLAGS:		-I/usr/include/glib-2.0 -I/usr/lib/glib-2.0/include
 330  [08/09/2017 06:44AM]: 	GJS_LIBS:		-lgobject-2.0 -lglib-2.0
 331  [08/09/2017 06:44AM]:   GEN      mock-js-resources.c
 332  [08/09/2017 06:44AM]:   GEN      jsunit-resources.h
 333  [08/09/2017 06:44AM]:   GEN      jsunit-resources.c
 334  [08/09/2017 06:44AM]: git.mk: Generating .gitignore
 335  [08/09/2017 06:44AM]: make[1]: Entering directory /pkg/src/cjs-3.4.4
 336  [08/09/2017 06:44AM]:   CXX      gi/libcjs_la-arg.lo
 337  [08/09/2017 06:44AM]:   CXX      gi/libcjs_la-boxed.lo
 338  [08/09/2017 06:44AM]:   CXX      gi/libcjs_la-closure.lo
 339  [08/09/2017 06:44AM]:   CXX      gi/libcjs_la-enumeration.lo
 340  [08/09/2017 06:45AM]:   CXX      gi/libcjs_la-foreign.lo
 341  [08/09/2017 06:45AM]:   CXX      gi/libcjs_la-fundamental.lo
 342  [08/09/2017 06:45AM]:   CXX      gi/libcjs_la-function.lo
 343  [08/09/2017 06:45AM]:   CXX      gi/libcjs_la-gerror.lo
 344  [08/09/2017 06:45AM]:   CXX      gi/libcjs_la-gtype.lo
 345  [08/09/2017 06:45AM]:   CXX      gi/libcjs_la-interface.lo
 346  [08/09/2017 06:45AM]:   CXX      gi/libcjs_la-ns.lo
 347  [08/09/2017 06:45AM]:   CXX      gi/libcjs_la-object.lo
 348  [08/09/2017 06:45AM]:   CXX      gi/libcjs_la-param.lo
 349  [08/09/2017 06:45AM]:   CXX      gi/libcjs_la-proxyutils.lo
 350  [08/09/2017 06:45AM]:   CXX      gi/libcjs_la-repo.lo
 351  [08/09/2017 06:45AM]:   CXX      gi/libcjs_la-toggle.lo
 352  [08/09/2017 06:45AM]:   CXX      gi/libcjs_la-union.lo
 353  [08/09/2017 06:45AM]:   CXX      gi/libcjs_la-value.lo
 354  [08/09/2017 06:45AM]:   CXX      cjs/libcjs_la-byteArray.lo
 355  [08/09/2017 06:45AM]:   CXX      cjs/libcjs_la-context.lo
 356  [08/09/2017 06:45AM]:   CXX      cjs/libcjs_la-coverage.lo
 357  [08/09/2017 06:45AM]:   CXX      cjs/libcjs_la-importer.lo
 358  [08/09/2017 06:45AM]:   CXX      cjs/libcjs_la-jsapi-constructor-proxy.lo
 359  [08/09/2017 06:45AM]:   CXX      cjs/libcjs_la-jsapi-dynamic-class.lo
 360  [08/09/2017 06:45AM]:   CXX      cjs/libcjs_la-jsapi-private.lo
 361  [08/09/2017 06:45AM]:   CXX      cjs/libcjs_la-jsapi-util.lo
 362  [08/09/2017 06:45AM]:   CXX      cjs/libcjs_la-jsapi-util-error.lo
 363  [08/09/2017 06:45AM]:   CXX      cjs/libcjs_la-jsapi-util-string.lo
 364  [08/09/2017 06:45AM]:   CXX      cjs/libcjs_la-mem.lo
 365  [08/09/2017 06:45AM]:   CXX      cjs/libcjs_la-native.lo
 366  [08/09/2017 06:45AM]:   CXX      cjs/libcjs_la-runtime.lo
 367  [08/09/2017 06:45AM]:   CXX      cjs/libcjs_la-stack.lo
 368  [08/09/2017 06:45AM]:   CXX      modules/libcjs_la-modules.lo
 369  [08/09/2017 06:45AM]:   CXX      util/libcjs_la-error.lo
 370  [08/09/2017 06:45AM]:   CXX      util/libcjs_la-glib.lo
 371  [08/09/2017 06:45AM]:   CXX      util/libcjs_la-hash-x32.lo
 372  [08/09/2017 06:45AM]:   CXX      util/libcjs_la-log.lo
 373  [08/09/2017 06:45AM]:   CXX      util/libcjs_la-misc.lo
 374  [08/09/2017 06:45AM]:   CXX      libgjs-private/libcjs_la-gjs-gdbus-wrapper.lo
 375  [08/09/2017 06:45AM]:   CXX      libgjs-private/libcjs_la-gjs-util.lo
 376  [08/09/2017 06:45AM]:   CXX      modules/libconsole_la-console.lo
 377  [08/09/2017 06:45AM]: ar: `u modifier ignored since `D is the default (see `U)
 378  [08/09/2017 06:45AM]:   CXX      modules/libsystem_la-system.lo
 379  [08/09/2017 06:45AM]:   CC       libmodules_resources_la-modules-resources.lo
 380  [08/09/2017 06:45AM]:   CCLD     libmodules_resources.la
 381  [08/09/2017 06:45AM]:   CXX      modules/libcairoNative_la-cairo-region.lo
 382  [08/09/2017 06:45AM]:   CXX      modules/libcairoNative_la-cairo-context.lo
 383  [08/09/2017 06:45AM]:   CXX      modules/libcairoNative_la-cairo-path.lo
 384  [08/09/2017 06:45AM]:   CXX      modules/libcairoNative_la-cairo-surface.lo
 385  [08/09/2017 06:45AM]:   CXX      modules/libcairoNative_la-cairo-image-surface.lo
 386  [08/09/2017 06:45AM]:   CXX      modules/libcairoNative_la-cairo-ps-surface.lo
 387  [08/09/2017 06:45AM]:   CXX      modules/libcairoNative_la-cairo-pdf-surface.lo
 388  [08/09/2017 06:45AM]:   CXX      modules/libcairoNative_la-cairo-svg-surface.lo
 389  [08/09/2017 06:45AM]:   CXX      modules/libcairoNative_la-cairo-pattern.lo
 390  [08/09/2017 06:46AM]:   CXX      modules/libcairoNative_la-cairo-gradient.lo
 391  [08/09/2017 06:46AM]:   CXX      modules/libcairoNative_la-cairo-linear-gradient.lo
 392  [08/09/2017 06:46AM]:   CXX      modules/libcairoNative_la-cairo-radial-gradient.lo
 393  [08/09/2017 06:46AM]:   CXX      modules/libcairoNative_la-cairo-surface-pattern.lo
 394  [08/09/2017 06:46AM]:   CXX      modules/libcairoNative_la-cairo-solid-pattern.lo
 395  [08/09/2017 06:46AM]:   CXX      modules/libcairoNative_la-cairo.lo
 396  [08/09/2017 06:46AM]:   CXXLD    libcairoNative.la
 397  [08/09/2017 06:46AM]:   CXX      cjs/cjs_console-console.o
 398  [08/09/2017 06:46AM]:   CC       installed-tests/libregress_la-regress.lo
 399  [08/09/2017 06:46AM]:   GISCAN   Regress-1.0.gir
 400  [08/09/2017 06:46AM]: In file included from /usr/include/bits/libc-header-start.h:33:0,
 401  [08/09/2017 06:46AM]:                  from /usr/include/limits.h:26,
 402  [08/09/2017 06:46AM]:                  from /usr/lib/gcc/x86_64-pc-linux-gnu/7.1.1/include-fixed/limits.h:194,
 403  [08/09/2017 06:46AM]:                  from /usr/lib/gcc/x86_64-pc-linux-gnu/7.1.1/include-fixed/syslimits.h:7,
 404  [08/09/2017 06:46AM]:                  from /usr/lib/gcc/x86_64-pc-linux-gnu/7.1.1/include-fixed/limits.h:34,
 405  [08/09/2017 06:46AM]:                  from /usr/lib/glib-2.0/include/glibconfig.h:11,
 406  [08/09/2017 06:46AM]:                  from /usr/include/glib-2.0/glib/gtypes.h:32,
 407  [08/09/2017 06:46AM]:                  from /usr/include/glib-2.0/glib/galloca.h:32,
 408  [08/09/2017 06:46AM]:                  from /usr/include/glib-2.0/glib.h:30,
 409  [08/09/2017 06:46AM]:                  from /usr/include/glib-2.0/gobject/gbinding.h:28,
 410  [08/09/2017 06:46AM]:                  from /usr/include/glib-2.0/glib-object.h:23,
 411  [08/09/2017 06:46AM]:                  from /usr/include/cairo/cairo-gobject.h:44,
 412  [08/09/2017 06:46AM]:                  from /usr/share/gobject-introspection-1.0/tests/regress.h:5,
 413  [08/09/2017 06:46AM]:                  from /tmp/g-ir-cpp-ztrvft2r.c:4:
 414  [08/09/2017 06:46AM]: /usr/include/features.h:373:4: warning: #warning _FORTIFY_SOURCE requires compiling with optimization (-O) [-Wcpp]
 415  [08/09/2017 06:46AM]:  #  warning _FORTIFY_SOURCE requires compiling with optimization (-O)
 416  [08/09/2017 06:46AM]:   CC       installed-tests/libwarnlib_la-warnlib.lo
 417  [08/09/2017 06:46AM]:                  from /usr/include/glib-2.0/gio/gioenums.h:28,
 418  [08/09/2017 06:46AM]:                  from /usr/include/glib-2.0/gio/giotypes.h:28,
 419  [08/09/2017 06:46AM]:                  from /usr/include/glib-2.0/gio/gio.h:26,
 420  [08/09/2017 06:46AM]:                  from /usr/share/gobject-introspection-1.0/tests/warnlib.h:6,
 421  [08/09/2017 06:46AM]:                  from /tmp/g-ir-cpp-fkm_s454.c:4:
 422  [08/09/2017 06:46AM]: g-ir-scanner: WarnLib: warning: 9 warnings suppressed (use --warn-all to see them)
 423  [08/09/2017 06:46AM]:   CC       installed-tests/libgimarshallingtests_la-gimarshallingtests.lo
 424  [08/09/2017 06:46AM]:   CCLD     libgimarshallingtests.la
 425  [08/09/2017 06:46AM]:   GISCAN   GIMarshallingTests-1.0.gir
 426  [08/09/2017 06:46AM]:                  from /usr/share/gobject-introspection-1.0/tests/gimarshallingtests.h:5,
 427  [08/09/2017 06:46AM]:                  from /tmp/g-ir-cpp-wj7ywodp.c:4:
 428  [08/09/2017 06:46AM]:   GISCAN   CjsPrivate-1.0.gir
 429  [08/09/2017 06:46AM]:                  from /pkg/src/cjs-3.4.4/libgjs-private/gjs-gdbus-wrapper.h:26,
 430  [08/09/2017 06:46AM]:                  from /tmp/g-ir-cpp-sl42vlox.c:4:
 431  [08/09/2017 06:46AM]: make[1]: Leaving directory /pkg/src/cjs-3.4.4
 432  [08/09/2017 06:46AM]: make  libregress.la libwarnlib.la libgimarshallingtests.la gjs-tests minijasmine
 433  [08/09/2017 06:46AM]: make[2]: libwarnlib.la is up to date.
 434  [08/09/2017 06:46AM]: make[2]: libgimarshallingtests.la is up to date.
 435  [08/09/2017 06:46AM]:   CXX      test/gjs_tests-gjs-tests.o
 436  [08/09/2017 06:46AM]:   CXX      test/gjs_tests-gjs-test-utils.o
 437  [08/09/2017 06:46AM]:   CXX      test/gjs_tests-gjs-test-call-args.o
 438  [08/09/2017 06:46AM]:   CXX      test/gjs_tests-gjs-test-coverage.o
 439  [08/09/2017 06:46AM]:   CXX      test/gjs_tests-gjs-test-rooting.o
 440  [08/09/2017 06:46AM]:   CC       gjs_tests-mock-js-resources.o
 441  [08/09/2017 06:46AM]:   GEN      mock-cache-invalidation-before.gresource
 442  [08/09/2017 06:46AM]:   GEN      mock-cache-invalidation-after.gresource
 443  [08/09/2017 06:46AM]:   CXX      installed-tests/minijasmine-minijasmine.o
 444  [08/09/2017 06:46AM]:   CC       minijasmine-jsunit-resources.o
 445  [08/09/2017 06:46AM]: PASS: gjs-tests 1 /gjs/context/exit
 446  [08/09/2017 06:46AM]: PASS: gjs-tests 2 /gjs/context/construct/destroy
 447  [08/09/2017 06:46AM]: PASS: gjs-tests 3 /gjs/context/construct/eval
 448  [08/09/2017 06:46AM]: PASS: gjs-tests 4 /gjs/gobject/js_defined_type
 449  [08/09/2017 06:46AM]: PASS: gjs-tests 5 /gjs/jsutil/strip_shebang/no_shebang
 450  [08/09/2017 06:46AM]: PASS: gjs-tests 6 /gjs/jsutil/strip_shebang/have_shebang
 451  [08/09/2017 06:46AM]: PASS: gjs-tests 7 /gjs/jsutil/strip_shebang/only_shebang
 452  [08/09/2017 06:46AM]: PASS: gjs-tests 8 /gjs/jsapi/util/error/throw
 453  [08/09/2017 06:46AM]: PASS: gjs-tests 9 /gjs/jsapi/util/string/char16_data
 454  [08/09/2017 06:46AM]: PASS: gjs-tests 10 /gjs/jsapi/util/string/to_ucs4
 455  [08/09/2017 06:46AM]: PASS: gjs-tests 11 /gjs/jsapi/util/string/js/string/utf8
 456  [08/09/2017 06:46AM]: PASS: gjs-tests 12 /gjs/jsapi/util/debug_string/valid-utf8
 457  [08/09/2017 06:46AM]: SKIP: gjs-tests 13 /gjs/jsapi/util/debug_string/invalid-utf8 # SKIP SpiderMonkey doesnt validate UTF-8 after encoding it
 458  [08/09/2017 06:46AM]: PASS: gjs-tests 14 /gjs/jsapi/util/debug_string/object-with-complicated-to-string
 459  [08/09/2017 06:46AM]: PASS: gjs-tests 15 /gjs/coverage/file_duplicated_into_output_path
 460  [08/09/2017 06:46AM]: ERROR: gjs-tests - too few tests run (expected 99, got 15)
 461  [08/09/2017 06:46AM]: ERROR: gjs-tests - exited with status 134 (terminated by signal 6?)
 462  [08/09/2017 06:46AM]: FAIL: installed-tests/scripts/testCommandLine.sh 1 - System.exit(0) should exit successfully
 463  [08/09/2017 06:46AM]: FAIL: installed-tests/scripts/testCommandLine.sh 2 - System.exit(42) should exit with the correct exit code
 464  [08/09/2017 06:46AM]: PASS: installed-tests/scripts/testCommandLine.sh 3 - System.exit() should still exit across an FFI boundary
 465  [08/09/2017 06:46AM]: FAIL: installed-tests/scripts/testCommandLine.sh 4 - --help should succeed
 466  [08/09/2017 06:46AM]: FAIL: installed-tests/scripts/testCommandLine.sh 5 - --help should print something
 467  [08/09/2017 06:46AM]: FAIL: installed-tests/scripts/testCommandLine.sh 6 - should succeed when --help is not first arg
 468  [08/09/2017 06:46AM]: FAIL: installed-tests/scripts/testCommandLine.sh 7 - should print something when --help is not first arg
 469  [08/09/2017 06:46AM]: FAIL: installed-tests/scripts/testCommandLine.sh 8 - --help should succeed before a script file
 470  [08/09/2017 06:46AM]: FAIL: installed-tests/scripts/testCommandLine.sh 9 - --help should print something before a script file
 471  [08/09/2017 06:46AM]: FAIL: installed-tests/scripts/testCommandLine.sh 10 - --help should succeed before -c
 472  [08/09/2017 06:46AM]: FAIL: installed-tests/scripts/testCommandLine.sh 11 - --help should print something before -c
 473  [08/09/2017 06:46AM]: FAIL: installed-tests/scripts/testCommandLine.sh 12 - --help after script file should be passed to script
 474  [08/09/2017 06:46AM]: PASS: installed-tests/scripts/testCommandLine.sh 13 - --help after script file should not print anything
 475  [08/09/2017 06:46AM]: FAIL: installed-tests/scripts/testCommandLine.sh 14 - --help after -c should be passed to script
 476  [08/09/2017 06:46AM]: PASS: installed-tests/scripts/testCommandLine.sh 15 - --help after -c should not print anything
 477  [08/09/2017 06:46AM]: FAIL: installed-tests/scripts/testCommandLine.sh 16 - -I after script should succeed but give a warning
 478  [08/09/2017 06:46AM]: FAIL: installed-tests/scripts/testCommandLine.sh 17 - --coverage-prefix after script should succeed but give a warning
 479  [08/09/2017 06:46AM]: FAIL: installed-tests/scripts/testCommandLine.sh 18 - --coverage-output after script should succeed but give a warning
 480  [08/09/2017 06:46AM]: FAIL: installed-tests/scripts/testCommandLine.sh 19 - --version should work
 481  [08/09/2017 06:46AM]: FAIL: installed-tests/scripts/testCommandLine.sh 20 - --version should print something
 482  [08/09/2017 06:46AM]: FAIL: installed-tests/scripts/testCommandLine.sh 21 - --version after -c should be passed to script
 483  [08/09/2017 06:46AM]: PASS: installed-tests/scripts/testCommandLine.sh 22 - --version after -c should not print anything
 484  [08/09/2017 06:46AM]: FAIL: installed-tests/scripts/testWarnings.sh 1 - overwriting method with Signals.addSignalMethods() should warn
 485  [08/09/2017 06:46AM]: FAIL: installed-tests/scripts/testWarnings.sh 2 - passing too many arguments to a GI function should warn
 486  [08/09/2017 06:46AM]: PASS: installed-tests/js/testself.js 1 Test harness internal consistency
 487  [08/09/2017 06:46AM]: PASS: installed-tests/js/testByteArray.js 1 Byte array has length 0 for empty array
 488  [08/09/2017 06:46AM]: PASS: installed-tests/js/testByteArray.js 2 Byte array initially sized to 10 has length 10
 489  [08/09/2017 06:46AM]: PASS: installed-tests/js/testByteArray.js 3 Byte array initially sized to 10 is initialized to zeroes
 490  [08/09/2017 06:46AM]: PASS: installed-tests/js/testByteArray.js 4 Byte array assigns values correctly
 491  [08/09/2017 06:46AM]: PASS: installed-tests/js/testByteArray.js 5 Byte array assignment past end implicitly lengthens the array
 492  [08/09/2017 06:46AM]: PASS: installed-tests/js/testByteArray.js 6 Byte array assignment past end implicitly creates zero bytes
 493  [08/09/2017 06:46AM]: PASS: installed-tests/js/testByteArray.js 7 Byte array changes the length when assigning to length property
 494  [08/09/2017 06:46AM]: PASS: installed-tests/js/testByteArray.js 8 Byte array conversions gives a byte 5 when assigning 5
 495  [08/09/2017 06:46AM]: PASS: installed-tests/js/testByteArray.js 9 Byte array conversions gives a byte 0 when assigning null
 496  [08/09/2017 06:46AM]: PASS: installed-tests/js/testByteArray.js 10 Byte array conversions gives a byte 0 when assigning undefined
 497  [08/09/2017 06:46AM]: PASS: installed-tests/js/testByteArray.js 11 Byte array conversions rounds off when assigning a double
 498  [08/09/2017 06:46AM]: PASS: installed-tests/js/testByteArray.js 12 Byte array can be created from a string
 499  [08/09/2017 06:46AM]: PASS: installed-tests/js/testByteArray.js 13 Byte array can be encoded from a string
 500  [08/09/2017 06:46AM]: PASS: installed-tests/js/testByteArray.js 14 Byte array encodes as UTF-8 by default
 501  [08/09/2017 06:46AM]: PASS: installed-tests/js/testByteArray.js 15 Byte array can be created from an array
 502  [08/09/2017 06:46AM]: PASS: installed-tests/js/testByteArray.js 16 Byte array can be converted to a string of ASCII characters
 503  [08/09/2017 06:46AM]: PASS: installed-tests/js/testClass.js 1 Class framework calls _init constructors
 504  [08/09/2017 06:46AM]: PASS: installed-tests/js/testClass.js 2 Class framework calls parent constructors
 505  [08/09/2017 06:46AM]: PASS: installed-tests/js/testClass.js 3 Class framework sets the right constructor properties
 506  [08/09/2017 06:46AM]: PASS: installed-tests/js/testClass.js 4 Class framework sets up instanceof correctly
 507  [08/09/2017 06:46AM]: PASS: installed-tests/js/testClass.js 5 Class framework reports a sensible value for toString()
 508  [08/09/2017 06:46AM]: PASS: installed-tests/js/testClass.js 6 Class framework allows overriding toString()
 509  [08/09/2017 06:46AM]: PASS: installed-tests/js/testClass.js 7 Class framework is not configurable
 510  [08/09/2017 06:46AM]: PASS: installed-tests/js/testClass.js 8 Class framework allows accessors for properties
 511  [08/09/2017 06:46AM]: PASS: installed-tests/js/testClass.js 9 Class framework raises an exception when creating an abstract class
 512  [08/09/2017 06:46AM]: PASS: installed-tests/js/testClass.js 10 Class framework inherits properties from abstract base classes
 513  [08/09/2017 06:46AM]: PASS: installed-tests/js/testClass.js 11 Class framework inherits constructors from abstract base classes
 514  [08/09/2017 06:46AM]: PASS: installed-tests/js/testClass.js 12 Class framework lets methods call other methods without clobbering __caller__
 515  [08/09/2017 06:46AM]: PASS: installed-tests/js/testClass.js 13 Class framework allows custom return values from constructors
 516  [08/09/2017 06:46AM]: PASS: installed-tests/js/testClass.js 14 Class framework allows symbol-named methods
 517  [08/09/2017 06:46AM]: PASS: installed-tests/js/testCoverage.js 1 Coverage.expressionLinesForAST works with no trailing newline
 518  [08/09/2017 06:46AM]: PASS: installed-tests/js/testCoverage.js 2 Coverage.expressionLinesForAST finds lines on both sides of an assignment expression
 519  [08/09/2017 06:46AM]: PASS: installed-tests/js/testCoverage.js 3 Coverage.expressionLinesForAST finds lines inside functions
 520  [08/09/2017 06:46AM]: PASS: installed-tests/js/testCoverage.js 4 Coverage.expressionLinesForAST finds lines inside anonymous functions
 521  [08/09/2017 06:46AM]: PASS: installed-tests/js/testCoverage.js 5 Coverage.expressionLinesForAST finds lines inside body of function property
 522  [08/09/2017 06:46AM]: PASS: installed-tests/js/testCoverage.js 6 Coverage.expressionLinesForAST finds lines inside arguments of function property
 523  [08/09/2017 06:46AM]: PASS: installed-tests/js/testCoverage.js 7 Coverage.expressionLinesForAST finds lines inside multiline function arguments
 524  [08/09/2017 06:46AM]: PASS: installed-tests/js/testCoverage.js 8 Coverage.expressionLinesForAST finds lines inside function argument that is an object
 525  [08/09/2017 06:46AM]: PASS: installed-tests/js/testCoverage.js 9 Coverage.expressionLinesForAST finds lines inside a while loop
 526  [08/09/2017 06:46AM]: PASS: installed-tests/js/testCoverage.js 10 Coverage.expressionLinesForAST finds lines inside try, catch, and finally
 527  [08/09/2017 06:46AM]: PASS: installed-tests/js/testCoverage.js 11 Coverage.expressionLinesForAST finds lines inside case statements
 528  [08/09/2017 06:46AM]: PASS: installed-tests/js/testCoverage.js 12 Coverage.expressionLinesForAST finds lines inside case statements with character cases
 529  [08/09/2017 06:46AM]: PASS: installed-tests/js/testCoverage.js 13 Coverage.expressionLinesForAST finds lines inside a for loop
 530  [08/09/2017 06:46AM]: PASS: installed-tests/js/testCoverage.js 14 Coverage.expressionLinesForAST finds lines inside if-statement branches
 531  [08/09/2017 06:46AM]: PASS: installed-tests/js/testCoverage.js 15 Coverage.expressionLinesForAST finds all lines of multiline if-conditions
 532  [08/09/2017 06:46AM]: PASS: installed-tests/js/testCoverage.js 16 Coverage.expressionLinesForAST finds lines for object property literals
 533  [08/09/2017 06:46AM]: PASS: installed-tests/js/testCoverage.js 17 Coverage.expressionLinesForAST finds lines for function-valued object properties
 534  [08/09/2017 06:46AM]: PASS: installed-tests/js/testCoverage.js 18 Coverage.expressionLinesForAST finds lines inside object-valued object properties
 535  [08/09/2017 06:46AM]: PASS: installed-tests/js/testCoverage.js 19 Coverage.expressionLinesForAST finds lines inside array-valued object properties
 536  [08/09/2017 06:46AM]: PASS: installed-tests/js/testCoverage.js 20 Coverage.expressionLinesForAST finds lines inside object-valued argument to return statement
 537  [08/09/2017 06:46AM]: PASS: installed-tests/js/testCoverage.js 21 Coverage.expressionLinesForAST finds lines inside object-valued argument to throw statement
 538  [08/09/2017 06:46AM]: PASS: installed-tests/js/testCoverage.js 22 Coverage.functionsForAST works with no trailing newline
 539  [08/09/2017 06:46AM]: PASS: installed-tests/js/testCoverage.js 23 Coverage.functionsForAST finds functions
 540  [08/09/2017 06:46AM]: PASS: installed-tests/js/testCoverage.js 24 Coverage.functionsForAST finds nested functions
 541  [08/09/2017 06:46AM]: PASS: installed-tests/js/testCoverage.js 25 Coverage.functionsForAST finds functions on the same line but with different arguments
 542  [08/09/2017 06:46AM]: PASS: installed-tests/js/testCoverage.js 26 Coverage.functionsForAST finds functions inside an array expression
 543  [08/09/2017 06:46AM]: PASS: installed-tests/js/testCoverage.js 27 Coverage.functionsForAST finds functions inside an arrow expression
 544  [08/09/2017 06:46AM]: PASS: installed-tests/js/testCoverage.js 28 Coverage.functionsForAST finds functions inside a sequence
 545  [08/09/2017 06:46AM]: PASS: installed-tests/js/testCoverage.js 29 Coverage.functionsForAST finds functions inside a unary expression
 546  [08/09/2017 06:46AM]: PASS: installed-tests/js/testCoverage.js 30 Coverage.functionsForAST finds functions inside a binary expression
 547  [08/09/2017 06:46AM]: PASS: installed-tests/js/testCoverage.js 31 Coverage.functionsForAST finds functions inside an assignment expression
 548  [08/09/2017 06:46AM]: PASS: installed-tests/js/testCoverage.js 32 Coverage.functionsForAST finds functions inside a reflexive assignment expression
 549  [08/09/2017 06:46AM]: PASS: installed-tests/js/testCoverage.js 33 Coverage.functionsForAST finds functions inside if-statement conditions
 550  [08/09/2017 06:46AM]: PASS: installed-tests/js/testCoverage.js 34 Coverage.functionsForAST finds functions inside while-statement conditions
 551  [08/09/2017 06:46AM]: PASS: installed-tests/js/testCoverage.js 35 Coverage.functionsForAST finds functions inside for-statement initializer
 552  [08/09/2017 06:46AM]: PASS: installed-tests/js/testCoverage.js 36 Coverage.functionsForAST finds functions inside let-statement in for-statement initializer
 553  [08/09/2017 06:46AM]: PASS: installed-tests/js/testCoverage.js 37 Coverage.functionsForAST finds functions inside var-statement inside for-statement initializer
 554  [08/09/2017 06:46AM]: PASS: installed-tests/js/testCoverage.js 38 Coverage.functionsForAST finds functions inside for-statement condition
 555  [08/09/2017 06:46AM]: PASS: installed-tests/js/testCoverage.js 39 Coverage.functionsForAST finds functions inside for-statement increment
 556  [08/09/2017 06:46AM]: PASS: installed-tests/js/testCoverage.js 40 Coverage.functionsForAST finds functions inside for-in-statement
 557  [08/09/2017 06:46AM]: PASS: installed-tests/js/testCoverage.js 41 Coverage.functionsForAST finds functions inside for-each statement
 558  [08/09/2017 06:46AM]: PASS: installed-tests/js/testCoverage.js 42 Coverage.functionsForAST finds functions inside for-of statement
 559  [08/09/2017 06:46AM]: PASS: installed-tests/js/testCoverage.js 43 Coverage.functionsForAST finds function literals used as an object
 560  [08/09/2017 06:46AM]: PASS: installed-tests/js/testCoverage.js 44 Coverage.functionsForAST finds function literals used as an object in a dynamic property expression
 561  [08/09/2017 06:46AM]: PASS: installed-tests/js/testCoverage.js 45 Coverage.functionsForAST finds functions on either side of a logical expression
 562  [08/09/2017 06:46AM]: PASS: installed-tests/js/testCoverage.js 46 Coverage.functionsForAST finds functions on either side of a conditional expression
 563  [08/09/2017 06:46AM]: PASS: installed-tests/js/testCoverage.js 47 Coverage.functionsForAST finds functions as the argument of a yield statement
 564  [08/09/2017 06:46AM]: PASS: installed-tests/js/testCoverage.js 48 Coverage.functionsForAST finds functions in an array comprehension body
 565  [08/09/2017 06:46AM]: PASS: installed-tests/js/testCoverage.js 49 Coverage.functionsForAST finds functions in an array comprehension block
 566  [08/09/2017 06:46AM]: PASS: installed-tests/js/testCoverage.js 50 Coverage.functionsForAST finds functions in an array comprehension filter
 567  [08/09/2017 06:46AM]: PASS: installed-tests/js/testCoverage.js 51 Coverage.branchesForAST works with no trailing newline
 568  [08/09/2017 06:46AM]: PASS: installed-tests/js/testCoverage.js 52 Coverage.branchesForAST finds both branch exits for a simple branch
 569  [08/09/2017 06:46AM]: PASS: installed-tests/js/testCoverage.js 53 Coverage.branchesForAST finds a single exit for a branch with one consequent
 570  [08/09/2017 06:46AM]: PASS: installed-tests/js/testCoverage.js 54 Coverage.branchesForAST finds multiple exits for nested if-else branches
 571  [08/09/2017 06:46AM]: PASS: installed-tests/js/testCoverage.js 55 Coverage.branchesForAST finds a simple two-exit branch without blocks
 572  [08/09/2017 06:46AM]: PASS: installed-tests/js/testCoverage.js 56 Coverage.branchesForAST does not find a branch if the consequent was empty
 573  [08/09/2017 06:46AM]: PASS: installed-tests/js/testCoverage.js 57 Coverage.branchesForAST finds a single exit if only the alternate exit was defined
 574  [08/09/2017 06:46AM]: PASS: installed-tests/js/testCoverage.js 58 Coverage.branchesForAST finds an implicit branch for while statement
 575  [08/09/2017 06:46AM]: PASS: installed-tests/js/testCoverage.js 59 Coverage.branchesForAST finds an implicit branch for a do-while statement
 576  [08/09/2017 06:46AM]: PASS: installed-tests/js/testCoverage.js 60 Coverage.branchesForAST finds all exits for case statements
 577  [08/09/2017 06:46AM]: PASS: installed-tests/js/testCoverage.js 61 Coverage.branchesForAST finds all exits for case statements with fallthrough
 578  [08/09/2017 06:46AM]: PASS: installed-tests/js/testCoverage.js 62 Coverage.branchesForAST finds no exits for case statements with only no-ops
 579  [08/09/2017 06:46AM]: PASS: installed-tests/js/testCoverage.js 63 Coverage gets the number of lines in the script
 580  [08/09/2017 06:46AM]: PASS: installed-tests/js/testCoverage.js 64 Coverage turns zero expression lines into counters
 581  [08/09/2017 06:46AM]: PASS: installed-tests/js/testCoverage.js 65 Coverage turns a single expression line into counters
 582  [08/09/2017 06:46AM]: PASS: installed-tests/js/testCoverage.js 66 Coverage returns empty array for no branches
 583  [08/09/2017 06:46AM]: PASS: installed-tests/js/testCoverage.js 67 Coverage branch counters gets same number of counters as number of lines plus one
 584  [08/09/2017 06:46AM]: PASS: installed-tests/js/testCoverage.js 68 Coverage branch counters branches on lines for array indices
 585  [08/09/2017 06:46AM]: PASS: installed-tests/js/testCoverage.js 69 Coverage branch counters sets exits for branch
 586  [08/09/2017 06:46AM]: PASS: installed-tests/js/testCoverage.js 70 Coverage branch counters sets last exit to highest exit start line
 587  [08/09/2017 06:46AM]: PASS: installed-tests/js/testCoverage.js 71 Coverage branch counters always has hit initially false
 588  [08/09/2017 06:46AM]: PASS: installed-tests/js/testCoverage.js 72 Coverage branch counters branch tracker sets branch to hit on point execution
 589  [08/09/2017 06:46AM]: PASS: installed-tests/js/testCoverage.js 73 Coverage branch counters branch tracker sets exit to hit on execution
 590  [08/09/2017 06:46AM]: PASS: installed-tests/js/testCoverage.js 74 Coverage branch counters branch tracker finds next branch
 591  [08/09/2017 06:46AM]: PASS: installed-tests/js/testCoverage.js 75 Coverage function key from function with name matches schema
 592  [08/09/2017 06:46AM]: PASS: installed-tests/js/testCoverage.js 76 Coverage function key from function without name is anonymous
 593  [08/09/2017 06:46AM]: PASS: installed-tests/js/testCoverage.js 77 Coverage returns a function counter map for function keys
 594  [08/09/2017 06:46AM]: PASS: installed-tests/js/testCoverage.js 78 Coverage reports an error when two indistinguishable functions are present
 595  [08/09/2017 06:46AM]: PASS: installed-tests/js/testCoverage.js 79 Coverage populates a known functions array
 596  [08/09/2017 06:46AM]: PASS: installed-tests/js/testCoverage.js 80 Coverage converts function counters to an array
 597  [08/09/2017 06:46AM]: PASS: installed-tests/js/testCoverage.js 81 Coverage.incrementFunctionCounters increments for function on same execution start line
 598  [08/09/2017 06:46AM]: PASS: installed-tests/js/testCoverage.js 82 Coverage.incrementFunctionCounters can disambiguate two functions with the same name
 599  [08/09/2017 06:46AM]: PASS: installed-tests/js/testCoverage.js 83 Coverage.incrementFunctionCounters can disambiguate two functions on same line with different params
 600  [08/09/2017 06:46AM]: PASS: installed-tests/js/testCoverage.js 84 Coverage.incrementFunctionCounters can disambiguate two functions on same line by guessing closest params
 601  [08/09/2017 06:46AM]: PASS: installed-tests/js/testCoverage.js 85 Coverage.incrementFunctionCounters increments for function on earlier start line
 602  [08/09/2017 06:46AM]: PASS: installed-tests/js/testCoverage.js 86 Coverage.incrementFunctionCounters throws an error on unexpected function
 603  [08/09/2017 06:46AM]: PASS: installed-tests/js/testCoverage.js 87 Coverage.incrementFunctionCounters throws if line out of range
 604  [08/09/2017 06:46AM]: PASS: installed-tests/js/testCoverage.js 88 Coverage.incrementFunctionCounters increments if in range
 605  [08/09/2017 06:46AM]: PASS: installed-tests/js/testCoverage.js 89 Coverage.incrementFunctionCounters warns if we hit a non-executable line
 606  [08/09/2017 06:46AM]: PASS: installed-tests/js/testCoverage.js 90 Coverage statistics container fetches valid statistics for file
 607  [08/09/2017 06:46AM]: PASS: installed-tests/js/testCoverage.js 91 Coverage statistics container throws for nonexisting file
 608  [08/09/2017 06:46AM]: PASS: installed-tests/js/testCoverage.js 92 Coverage statistics container with cache fetches counters from cache
 609  [08/09/2017 06:46AM]: PASS: installed-tests/js/testCoverage.js 93 Coverage statistics container with cache fetches counters from reflection if missed
 610  [08/09/2017 06:46AM]: PASS: installed-tests/js/testCoverage.js 94 Coverage statistics container with cache cache is not stale if all hit
 611  [08/09/2017 06:46AM]: PASS: installed-tests/js/testCoverage.js 95 Coverage statistics container with cache cache is stale if missed
 612  [08/09/2017 06:46AM]: PASS: installed-tests/js/testCoverage.js 96 Coverage statistics container coverage counters from cache have same executable lines as reflection
 613  [08/09/2017 06:46AM]: PASS: installed-tests/js/testCoverage.js 97 Coverage statistics container coverage counters from cache have same branch exits as reflection
 614  [08/09/2017 06:46AM]: PASS: installed-tests/js/testCoverage.js 98 Coverage statistics container coverage counters from cache have same branch points as reflection
 615  [08/09/2017 06:46AM]: PASS: installed-tests/js/testCoverage.js 99 Coverage statistics container coverage counters from cache have same function keys as reflection
 616  [08/09/2017 06:46AM]: PASS: installed-tests/js/testExceptions.js 1 Exceptions are thrown from property setter
 617  [08/09/2017 06:46AM]: PASS: installed-tests/js/testExceptions.js 2 Exceptions are thrown from property getter
 618  [08/09/2017 06:46AM]: ERROR: installed-tests/js/testExceptions.js - too few tests run (expected 17, got 2)
 619  [08/09/2017 06:46AM]: ERROR: installed-tests/js/testExceptions.js - exited with status 133 (terminated by signal 5?)
 620  [08/09/2017 06:46AM]: PASS: installed-tests/js/testEverythingBasic.js 1 Life, the Universe and Everything includes booleans
 621  [08/09/2017 06:46AM]: PASS: installed-tests/js/testEverythingBasic.js 2 Life, the Universe and Everything includes 8-bit integers
 622  [08/09/2017 06:46AM]: PASS: installed-tests/js/testEverythingBasic.js 3 Life, the Universe and Everything includes unsigned 8-bit integers
 623  [08/09/2017 06:46AM]: PASS: installed-tests/js/testEverythingBasic.js 4 Life, the Universe and Everything includes 16-bit integers
 624  [08/09/2017 06:46AM]: PASS: installed-tests/js/testEverythingBasic.js 5 Life, the Universe and Everything includes unsigned 16-bit integers
 625  [08/09/2017 06:46AM]: PASS: installed-tests/js/testEverythingBasic.js 6 Life, the Universe and Everything includes 32-bit integers
 626  [08/09/2017 06:46AM]: PASS: installed-tests/js/testEverythingBasic.js 7 Life, the Universe and Everything includes unsigned 32-bit integers
 627  [08/09/2017 06:46AM]: PASS: installed-tests/js/testEverythingBasic.js 8 Life, the Universe and Everything includes 64-bit integers
 628  [08/09/2017 06:46AM]: PASS: installed-tests/js/testEverythingBasic.js 9 Life, the Universe and Everything includes unsigned 64-bit integers
 629  [08/09/2017 06:46AM]: PASS: installed-tests/js/testEverythingBasic.js 10 Life, the Universe and Everything includes shorts
 630  [08/09/2017 06:46AM]: PASS: installed-tests/js/testEverythingBasic.js 11 Life, the Universe and Everything includes ints
 631  [08/09/2017 06:46AM]: PASS: installed-tests/js/testEverythingBasic.js 12 Life, the Universe and Everything includes longs
 632  [08/09/2017 06:46AM]: PASS: installed-tests/js/testEverythingBasic.js 13 Life, the Universe and Everything includes ssizes
 633  [08/09/2017 06:46AM]: PASS: installed-tests/js/testEverythingBasic.js 14 Life, the Universe and Everything includes floats
 634  [08/09/2017 06:46AM]: PASS: installed-tests/js/testEverythingBasic.js 15 Life, the Universe and Everything includes doubles
 635  [08/09/2017 06:46AM]: PASS: installed-tests/js/testEverythingBasic.js 16 Life, the Universe and Everything includes ushorts
 636  [08/09/2017 06:46AM]: PASS: installed-tests/js/testEverythingBasic.js 17 Life, the Universe and Everything includes uints
 637  [08/09/2017 06:46AM]: PASS: installed-tests/js/testEverythingBasic.js 18 Life, the Universe and Everything includes ulongs
 638  [08/09/2017 06:46AM]: PASS: installed-tests/js/testEverythingBasic.js 19 Life, the Universe and Everything includes sizes
 639  [08/09/2017 06:46AM]: PASS: installed-tests/js/testEverythingBasic.js 20 Life, the Universe and Everything includes wide characters
 640  [08/09/2017 06:46AM]: PASS: installed-tests/js/testEverythingBasic.js 21 Life, the Universe and Everything includes time_t
 641  [08/09/2017 06:46AM]: PASS: installed-tests/js/testEverythingBasic.js 22 Life, the Universe and Everything Limits marshals max value of unsigned 8-bit integers
 642  [08/09/2017 06:46AM]: PASS: installed-tests/js/testEverythingBasic.js 23 Life, the Universe and Everything Limits marshals min value of signed 8-bit integers
 643  [08/09/2017 06:46AM]: PASS: installed-tests/js/testEverythingBasic.js 24 Life, the Universe and Everything Limits marshals max value of signed 8-bit integers
 644  [08/09/2017 06:46AM]: PASS: installed-tests/js/testEverythingBasic.js 25 Life, the Universe and Everything Limits marshals max value of unsigned 16-bit integers
 645  [08/09/2017 06:46AM]: PASS: installed-tests/js/testEverythingBasic.js 26 Life, the Universe and Everything Limits marshals min value of signed 16-bit integers
 646  [08/09/2017 06:46AM]: PASS: installed-tests/js/testEverythingBasic.js 27 Life, the Universe and Everything Limits marshals max value of signed 16-bit integers
 647  [08/09/2017 06:46AM]: PASS: installed-tests/js/testEverythingBasic.js 28 Life, the Universe and Everything Limits marshals max value of unsigned 32-bit integers
 648  [08/09/2017 06:46AM]: PASS: installed-tests/js/testEverythingBasic.js 29 Life, the Universe and Everything Limits marshals min value of signed 32-bit integers
 649  [08/09/2017 06:46AM]: PASS: installed-tests/js/testEverythingBasic.js 30 Life, the Universe and Everything Limits marshals max value of signed 32-bit integers
 650  [08/09/2017 06:46AM]: SKIP: installed-tests/js/testEverythingBasic.js 31 Life, the Universe and Everything Limits marshals max value of unsigned 64-bit integers # SKIP This test doesnt work
 651  [08/09/2017 06:46AM]: PASS: installed-tests/js/testEverythingBasic.js 32 Life, the Universe and Everything Limits marshals min value of signed 64-bit integers
 652  [08/09/2017 06:46AM]: SKIP: installed-tests/js/testEverythingBasic.js 33 Life, the Universe and Everything Limits marshals max value of signed 64-bit integers # SKIP This test doesnt work
 653  [08/09/2017 06:46AM]: ERROR: installed-tests/js/testEverythingBasic.js - too few tests run (expected 132, got 33)
 654  [08/09/2017 06:46AM]: ERROR: installed-tests/js/testEverythingBasic.js - exited with status 133 (terminated by signal 5?)
 655  [08/09/2017 06:46AM]: PASS: installed-tests/js/testEverythingEncapsulated.js 1 Introspected structs simple sets fields correctly
 656  [08/09/2017 06:46AM]: PASS: installed-tests/js/testEverythingEncapsulated.js 2 Introspected structs simple can clone
 657  [08/09/2017 06:46AM]: PASS: installed-tests/js/testEverythingEncapsulated.js 3 Introspected structs nested sets fields correctly
 658  [08/09/2017 06:46AM]: PASS: installed-tests/js/testEverythingEncapsulated.js 4 Introspected structs nested can clone
 659  [08/09/2017 06:46AM]: PASS: installed-tests/js/testEverythingEncapsulated.js 5 Introspected structs constructors copies an object from a hash of field values
 660  [08/09/2017 06:46AM]: PASS: installed-tests/js/testEverythingEncapsulated.js 6 Introspected structs constructors catches bad field names
 661  [08/09/2017 06:46AM]: PASS: installed-tests/js/testEverythingEncapsulated.js 7 Introspected structs constructors copies an object from another object of the same type
 662  [08/09/2017 06:46AM]: PASS: installed-tests/js/testEverythingEncapsulated.js 8 Introspected structs containing fixed array
 663  [08/09/2017 06:46AM]: PASS: installed-tests/js/testEverythingEncapsulated.js 9 Introspected boxed types sets fields correctly
 664  [08/09/2017 06:46AM]: PASS: installed-tests/js/testEverythingEncapsulated.js 10 Introspected boxed types copy constructors copies an object from a hash of field values
 665  [08/09/2017 06:46AM]: PASS: installed-tests/js/testEverythingEncapsulated.js 11 Introspected boxed types copy constructors catches bad field names
 666  [08/09/2017 06:46AM]: PASS: installed-tests/js/testEverythingEncapsulated.js 12 Introspected boxed types copy constructors copies an object from another object of the same type
 667  [08/09/2017 06:46AM]: PASS: installed-tests/js/testEverythingEncapsulated.js 13 Introspected boxed types nested reads fields and nested fields
 668  [08/09/2017 06:46AM]: PASS: installed-tests/js/testEverythingEncapsulated.js 14 Introspected boxed types nested assigns nested struct field from an instance
 669  [08/09/2017 06:46AM]: PASS: installed-tests/js/testEverythingEncapsulated.js 15 Introspected boxed types nested assigns nested struct field directly from a hash of field values
 670  [08/09/2017 06:46AM]: PASS: installed-tests/js/testEverythingEncapsulated.js 16 Introspected boxed types constructs with a nested hash of field values
 671  [08/09/2017 06:46AM]: PASS: installed-tests/js/testEverythingEncapsulated.js 17 Introspected boxed types constructs using a custom constructor
 672  [08/09/2017 06:46AM]: PASS: installed-tests/js/testEverythingEncapsulated.js 18 Introspected boxed types constructs using a custom constructor in backwards compatibility mode
 673  [08/09/2017 06:46AM]: PASS: installed-tests/js/testEverythingEncapsulated.js 19 Introspected GObject can access fields with simple types
 674  [08/09/2017 06:46AM]: PASS: installed-tests/js/testEverythingEncapsulated.js 20 Introspected GObject cannot access fields with complex types (GI limitation)
 675  [08/09/2017 06:46AM]: PASS: installed-tests/js/testEverythingEncapsulated.js 21 Introspected GObject silently does not set read-only fields
 676  [08/09/2017 06:46AM]: PASS: installed-tests/js/testEverythingEncapsulated.js 22 Introspected GObject throws an error in strict mode when setting a read-only field
 677  [08/09/2017 06:46AM]: PASS: installed-tests/js/testEverythingEncapsulated.js 23 Introspected GObject has normal Object methods
 678  [08/09/2017 06:46AM]: PASS: installed-tests/js/testEverythingEncapsulated.js 24 Introspected function length skips over instance parameters of methods
 679  [08/09/2017 06:46AM]: PASS: installed-tests/js/testEverythingEncapsulated.js 25 Introspected function length skips over out and GError parameters
 680  [08/09/2017 06:46AM]: PASS: installed-tests/js/testEverythingEncapsulated.js 26 Introspected function length does not skip over inout parameters
 681  [08/09/2017 06:46AM]: SKIP: installed-tests/js/testEverythingEncapsulated.js 27 Introspected function length skips over parameters annotated with skip # SKIP Not implemented yet
 682  [08/09/2017 06:46AM]: PASS: installed-tests/js/testEverythingEncapsulated.js 28 Introspected function length gives number of arguments for static methods
 683  [08/09/2017 06:46AM]: PASS: installed-tests/js/testEverythingEncapsulated.js 29 Introspected function length skips over destroy-notify and user-data parameters
 684  [08/09/2017 06:46AM]: PASS: installed-tests/js/testEverythingEncapsulated.js 30 Garbage collection of introspected objects collects objects properly with signals connected
 685  [08/09/2017 06:46AM]: PASS: installed-tests/js/testFormat.js 1 imports.format escapes % with another % character
 686  [08/09/2017 06:46AM]: PASS: installed-tests/js/testFormat.js 2 imports.format formats a single string argument
 687  [08/09/2017 06:46AM]: PASS: installed-tests/js/testFormat.js 3 imports.format formats two string arguments
 688  [08/09/2017 06:46AM]: PASS: installed-tests/js/testFormat.js 4 imports.format formats two swapped string arguments
 689  [08/09/2017 06:46AM]: PASS: installed-tests/js/testFormat.js 5 imports.format formats a number in base 10
 690  [08/09/2017 06:46AM]: PASS: installed-tests/js/testFormat.js 6 imports.format formats a number in base 16
 691  [08/09/2017 06:46AM]: PASS: installed-tests/js/testFormat.js 7 imports.format formats a floating point number with no precision
 692  [08/09/2017 06:46AM]: PASS: installed-tests/js/testFormat.js 8 imports.format formats a floating point number with precision 2
 693  [08/09/2017 06:46AM]: PASS: installed-tests/js/testFormat.js 9 imports.format pads with zeroes
 694  [08/09/2017 06:46AM]: PASS: installed-tests/js/testFormat.js 10 imports.format pads with spaces
 695  [08/09/2017 06:46AM]: PASS: installed-tests/js/testFormat.js 11 imports.format throws an error when given incorrect modifiers for the conversion type
 696  [08/09/2017 06:46AM]: PASS: installed-tests/js/testFormat.js 12 imports.format throws an error when incorrectly instructed to swap arguments
 697  [08/09/2017 06:46AM]: PASS: installed-tests/js/testFundamental.js 1 Fundamental type support constructs a subtype of a fundamental type
 698  [08/09/2017 06:46AM]: PASS: installed-tests/js/testFundamental.js 2 Fundamental type support constructs a subtype of a hidden (no introspection data) fundamental type
 699  [08/09/2017 06:46AM]: PASS: installed-tests/js/testGettext.js 1 Gettext module setlocale returns a locale
 700  [08/09/2017 06:46AM]: PASS: installed-tests/js/testGIMarshalling.js 1 C array can be passed to a function
 701  [08/09/2017 06:46AM]: PASS: installed-tests/js/testGIMarshalling.js 2 C array can be passed to a function with its length parameter before it
 702  [08/09/2017 06:46AM]: PASS: installed-tests/js/testGIMarshalling.js 3 C array can be passed to a function with zero terminator
 703  [08/09/2017 06:46AM]: PASS: installed-tests/js/testGIMarshalling.js 4 C array can be passed to a function in the style of gtk_init()
 704  [08/09/2017 06:46AM]: PASS: installed-tests/js/testGIMarshalling.js 5 C array can be returned with zero terminator
 705  [08/09/2017 06:46AM]: PASS: installed-tests/js/testGIMarshalling.js 6 C array can be returned
 706  [08/09/2017 06:46AM]: PASS: installed-tests/js/testGIMarshalling.js 7 C array can be returned along with other arguments
 707  [08/09/2017 06:46AM]: PASS: installed-tests/js/testGIMarshalling.js 8 C array can be an out argument
 708  [08/09/2017 06:46AM]: PASS: installed-tests/js/testGIMarshalling.js 9 C array can be an out argument along with other arguments
 709  [08/09/2017 06:46AM]: PASS: installed-tests/js/testGIMarshalling.js 10 C array can be an in-out argument
 710  [08/09/2017 06:46AM]: PASS: installed-tests/js/testGIMarshalling.js 11 C array can be an in-out argument along with other arguments
 711  [08/09/2017 06:46AM]: PASS: installed-tests/js/testGIMarshalling.js 12 C array copies correctly on transfer full
 712  [08/09/2017 06:46AM]: PASS: installed-tests/js/testGIMarshalling.js 13 C array of structs can be passed to a function
 713  [08/09/2017 06:46AM]: PASS: installed-tests/js/testGIMarshalling.js 14 C array of structs can be returned with zero terminator
 714  [08/09/2017 06:46AM]: PASS: installed-tests/js/testGIMarshalling.js 15 C array of booleans is coerced to true/false when passed to a function
 715  [08/09/2017 06:46AM]: PASS: installed-tests/js/testGIMarshalling.js 16 C array of booleans can be an out argument
 716  [08/09/2017 06:46AM]: PASS: installed-tests/js/testGIMarshalling.js 17 C array of unichars can be passed to a function
 717  [08/09/2017 06:46AM]: PASS: installed-tests/js/testGIMarshalling.js 18 C array of unichars can be an out argument
 718  [08/09/2017 06:46AM]: PASS: installed-tests/js/testGIMarshalling.js 19 C array of unichars can be returned with zero terminator
 719  [08/09/2017 06:46AM]: PASS: installed-tests/js/testGIMarshalling.js 20 C array of unichars can be implicitly converted from a number array
 720  [08/09/2017 06:46AM]: PASS: installed-tests/js/testGIMarshalling.js 21 C array of strings can be passed to a function
 721  [08/09/2017 06:46AM]: PASS: installed-tests/js/testGIMarshalling.js 22 C array of enums can be passed to a function
 722  [08/09/2017 06:46AM]: PASS: installed-tests/js/testGIMarshalling.js 23 C array of bytes can be an in argument with length
 723  [08/09/2017 06:46AM]: PASS: installed-tests/js/testGIMarshalling.js 24 C array of bytes can be implicitly converted from a string
 724  [08/09/2017 06:46AM]: PASS: installed-tests/js/testGIMarshalling.js 25 C array of 64-bit ints can be passed to a function
 725  [08/09/2017 06:46AM]: PASS: installed-tests/js/testGIMarshalling.js 26 C array of 64-bit ints can be an in argument with length
 726  [08/09/2017 06:46AM]: PASS: installed-tests/js/testGIMarshalling.js 27 GArray of integers can be passed in with transfer none
 727  [08/09/2017 06:46AM]: PASS: installed-tests/js/testGIMarshalling.js 28 GArray of integers can be returned with transfer none
 728  [08/09/2017 06:46AM]: PASS: installed-tests/js/testGIMarshalling.js 29 GArray of strings can be passed in with transfer none
 729  [08/09/2017 06:46AM]: PASS: installed-tests/js/testGIMarshalling.js 30 GArray of strings can be passed as return with transfer none
 730  [08/09/2017 06:46AM]: PASS: installed-tests/js/testGIMarshalling.js 31 GArray of strings can be passed as return with transfer container
 731  [08/09/2017 06:46AM]: PASS: installed-tests/js/testGIMarshalling.js 32 GArray of strings can be passed as return with transfer full
 732  [08/09/2017 06:46AM]: PASS: installed-tests/js/testGIMarshalling.js 33 GArray of strings can be passed as out with transfer none
 733  [08/09/2017 06:46AM]: PASS: installed-tests/js/testGIMarshalling.js 34 GArray of strings can be passed as out with transfer container
 734  [08/09/2017 06:46AM]: PASS: installed-tests/js/testGIMarshalling.js 35 GArray of strings can be passed as out with transfer full
 735  [08/09/2017 06:46AM]: PASS: installed-tests/js/testGIMarshalling.js 36 GArray of booleans can be passed in with transfer none
 736  [08/09/2017 06:46AM]: PASS: installed-tests/js/testGIMarshalling.js 37 GArray of unichars can be passed in with transfer none
 737  [08/09/2017 06:46AM]: PASS: installed-tests/js/testGIMarshalling.js 38 GArray of unichars can be implicitly converted from a number array
 738  [08/09/2017 06:46AM]: PASS: installed-tests/js/testGIMarshalling.js 39 GByteArray can be passed in with transfer none
 739  [08/09/2017 06:46AM]: PASS: installed-tests/js/testGIMarshalling.js 40 GByteArray can be returned with transfer full
 740  [08/09/2017 06:46AM]: PASS: installed-tests/js/testGIMarshalling.js 41 GByteArray can be implicitly converted from a normal array
 741  [08/09/2017 06:46AM]: PASS: installed-tests/js/testGIMarshalling.js 42 GBytes can be created from an array and passed in
 742  [08/09/2017 06:46AM]: PASS: installed-tests/js/testGIMarshalling.js 43 GBytes can be created by returning from a function and passed in
 743  [08/09/2017 06:46AM]: PASS: installed-tests/js/testGIMarshalling.js 44 GBytes can be implicitly converted from a ByteArray
 744  [08/09/2017 06:46AM]: PASS: installed-tests/js/testGIMarshalling.js 45 GBytes can be created from a string and is encoded in UTF-8
 745  [08/09/2017 06:46AM]: PASS: installed-tests/js/testGIMarshalling.js 46 GBytes turns into a GByteArray on assignment
 746  [08/09/2017 06:46AM]: PASS: installed-tests/js/testGIMarshalling.js 47 GBytes cannot be passed to a function expecting a byte array
 747  [08/09/2017 06:46AM]: PASS: installed-tests/js/testGIMarshalling.js 48 GPtrArray can be passed to a function with transfer none
 748  [08/09/2017 06:46AM]: PASS: installed-tests/js/testGIMarshalling.js 49 GPtrArray can be passed as return with transfer none
 749  [08/09/2017 06:46AM]: PASS: installed-tests/js/testGIMarshalling.js 50 GPtrArray can be passed as return with transfer container
 750  [08/09/2017 06:46AM]: PASS: installed-tests/js/testGIMarshalling.js 51 GPtrArray can be passed as return with transfer full
 751  [08/09/2017 06:46AM]: PASS: installed-tests/js/testGIMarshalling.js 52 GPtrArray can be passed as out with transfer none
 752  [08/09/2017 06:46AM]: PASS: installed-tests/js/testGIMarshalling.js 53 GPtrArray can be passed as out with transfer container
 753  [08/09/2017 06:46AM]: PASS: installed-tests/js/testGIMarshalling.js 54 GPtrArray can be passed as out with transfer full
 754  [08/09/2017 06:46AM]: PASS: installed-tests/js/testGIMarshalling.js 55 GHashTable can be passed in with integer value type
 755  [08/09/2017 06:46AM]: PASS: installed-tests/js/testGIMarshalling.js 56 GHashTable can be passed in with string value type
 756  [08/09/2017 06:46AM]: PASS: installed-tests/js/testGIMarshalling.js 57 GHashTable can be passed in with float value type
 757  [08/09/2017 06:46AM]: PASS: installed-tests/js/testGIMarshalling.js 58 GHashTable can be passed in with double value type
 758  [08/09/2017 06:46AM]: PASS: installed-tests/js/testGIMarshalling.js 59 GHashTable can be passed in with int64 value type
 759  [08/09/2017 06:46AM]: PASS: installed-tests/js/testGIMarshalling.js 60 GHashTable can be passed in with uint64 value type
 760  [08/09/2017 06:46AM]: PASS: installed-tests/js/testGIMarshalling.js 61 GHashTable can be returned with integer value type
 761  [08/09/2017 06:46AM]: PASS: installed-tests/js/testGIMarshalling.js 62 GHashTable can be passed as return with transfer none
 762  [08/09/2017 06:46AM]: PASS: installed-tests/js/testGIMarshalling.js 63 GHashTable can be passed as return with transfer container
 763  [08/09/2017 06:46AM]: PASS: installed-tests/js/testGIMarshalling.js 64 GHashTable can be passed as return with transfer full
 764  [08/09/2017 06:46AM]: PASS: installed-tests/js/testGIMarshalling.js 65 GHashTable can be passed as out with transfer none
 765  [08/09/2017 06:46AM]: PASS: installed-tests/js/testGIMarshalling.js 66 GHashTable can be passed as out with transfer container
 766  [08/09/2017 06:46AM]: PASS: installed-tests/js/testGIMarshalling.js 67 GHashTable can be passed as out with transfer full
 767  [08/09/2017 06:46AM]: PASS: installed-tests/js/testGIMarshalling.js 68 GHashTable can be passed as inout with transfer none
 768  [08/09/2017 06:46AM]: SKIP: installed-tests/js/testGIMarshalling.js 69 GHashTable can be passed as inout with transfer container # SKIP Container transfer for in parameters not supported
 769  [08/09/2017 06:46AM]: SKIP: installed-tests/js/testGIMarshalling.js 70 GHashTable can be passed as inout with transfer full # SKIP https://bugzilla.gnome.org/show_bug.cgi?id=773763
 770  [08/09/2017 06:46AM]: PASS: installed-tests/js/testGIMarshalling.js 71 GValue can be passed into a function and packed
 771  [08/09/2017 06:46AM]: PASS: installed-tests/js/testGIMarshalling.js 72 GValue array can be passed into a function and packed
 772  [08/09/2017 06:46AM]: SKIP: installed-tests/js/testGIMarshalling.js 73 GValue enum can be passed into a function and packed # SKIP GJS doesnt support native enum types
 773  [08/09/2017 06:46AM]: PASS: installed-tests/js/testGIMarshalling.js 74 GValue can be returned and unpacked
 774  [08/09/2017 06:46AM]: PASS: installed-tests/js/testGIMarshalling.js 75 GValue can be passed as an out argument and unpacked
 775  [08/09/2017 06:46AM]: PASS: installed-tests/js/testGIMarshalling.js 76 GValue array can be passed as an out argument and unpacked
 776  [08/09/2017 06:46AM]: PASS: installed-tests/js/testGIMarshalling.js 77 GValue can have its type inferred from primitive values
 777  [08/09/2017 06:46AM]: PASS: installed-tests/js/testGIMarshalling.js 78 GValue type objects can be converted from primitive-like types
 778  [08/09/2017 06:46AM]: PASS: installed-tests/js/testGIMarshalling.js 79 GValue can have its type inferred as a GObject type
 779  [08/09/2017 06:46AM]: PASS: installed-tests/js/testGIMarshalling.js 80 GValue can have its type inferred as a superclass
 780  [08/09/2017 06:46AM]: PASS: installed-tests/js/testGIMarshalling.js 81 GValue can have its type inferred as an interface that it implements
 781  [08/09/2017 06:46AM]: PASS: installed-tests/js/testGIMarshalling.js 82 GValue can have its type inferred as a boxed type
 782  [08/09/2017 06:46AM]: PASS: installed-tests/js/testGIMarshalling.js 83 GValue can have its type inferred as GVariant
 783  [08/09/2017 06:46AM]: PASS: installed-tests/js/testGIMarshalling.js 84 GValue can have its type inferred as a union type
 784  [08/09/2017 06:46AM]: PASS: installed-tests/js/testGIMarshalling.js 85 GValue can have its type inferred as a GParamSpec
 785  [08/09/2017 06:46AM]: SKIP: installed-tests/js/testGIMarshalling.js 86 GValue can have its type inferred as a foreign struct # SKIP Errors out with not a subclass of GObject_Boxed
 786  [08/09/2017 06:46AM]: PASS: installed-tests/js/testGIMarshalling.js 87 GType can be passed into a function
 787  [08/09/2017 06:46AM]: PASS: installed-tests/js/testGIMarshalling.js 88 GType can be returned
 788  [08/09/2017 06:46AM]: PASS: installed-tests/js/testGIMarshalling.js 89 GType can be passed as an out argument
 789  [08/09/2017 06:46AM]: PASS: installed-tests/js/testGIMarshalling.js 90 GType can be passed as an inout argument
 790  [08/09/2017 06:46AM]: PASS: installed-tests/js/testGIMarshalling.js 91 GType can be implicitly converted from a JS type
 791  [08/09/2017 06:46AM]: PASS: installed-tests/js/testGIMarshalling.js 92 Callback marshals a return value
 792  [08/09/2017 06:46AM]: PASS: installed-tests/js/testGIMarshalling.js 93 Callback marshals one out parameter
 793  [08/09/2017 06:46AM]: PASS: installed-tests/js/testGIMarshalling.js 94 Callback marshals multiple out parameters
 794  [08/09/2017 06:46AM]: PASS: installed-tests/js/testGIMarshalling.js 95 Callback marshals a return value and one out parameter
 795  [08/09/2017 06:46AM]: PASS: installed-tests/js/testGIMarshalling.js 96 Callback marshals a return value and multiple out parameters
 796  [08/09/2017 06:46AM]: SKIP: installed-tests/js/testGIMarshalling.js 97 Callback marshals an array out parameter # SKIP Function not added to gobject-introspection test suite yet
 797  [08/09/2017 06:46AM]: PASS: installed-tests/js/testGIMarshalling.js 98 Virtual function marshals a return value
 798  [08/09/2017 06:46AM]: PASS: installed-tests/js/testGIMarshalling.js 99 Virtual function marshals one out parameter
 799  [08/09/2017 06:46AM]: PASS: installed-tests/js/testGIMarshalling.js 100 Virtual function marshals multiple out parameters
 800  [08/09/2017 06:46AM]: PASS: installed-tests/js/testGIMarshalling.js 101 Virtual function marshals a return value and one out parameter
 801  [08/09/2017 06:46AM]: PASS: installed-tests/js/testGIMarshalling.js 102 Virtual function marshals a return value and multiple out parameters
 802  [08/09/2017 06:46AM]: PASS: installed-tests/js/testGIMarshalling.js 103 Virtual function marshals an array out parameter
 803  [08/09/2017 06:46AM]: PASS: installed-tests/js/testGIMarshalling.js 104 Interface can be returned
 804  [08/09/2017 06:46AM]: PASS: installed-tests/js/testGIMarshalling.js 105 GObject properties can handle GValues
 805  [08/09/2017 06:46AM]: PASS: installed-tests/js/testGLib.js 1 GVariant constructor constructs a string variant
 806  [08/09/2017 06:46AM]: PASS: installed-tests/js/testGLib.js 2 GVariant constructor constructs a string variant (backwards compatible API)
 807  [08/09/2017 06:46AM]: PASS: installed-tests/js/testGLib.js 3 GVariant constructor constructs a struct variant
 808  [08/09/2017 06:46AM]: PASS: installed-tests/js/testGLib.js 4 GVariant constructor constructs a maybe variant
 809  [08/09/2017 06:46AM]: ERROR: installed-tests/js/testGObjectClass.js - Bail out! JS_EvaluateScript() failed
 810  [08/09/2017 06:46AM]: PASS: installed-tests/js/testGObjectInterface.js 1 GObject interface class can implement a Lang.Interface
 811  [08/09/2017 06:46AM]: PASS: installed-tests/js/testGObjectInterface.js 2 GObject interface throws when an interface requires a GObject interface but not GObject.Object
 812  [08/09/2017 06:46AM]: PASS: installed-tests/js/testGObjectInterface.js 3 GObject interface can be implemented by a GObject class along with a JS interface
 813  [08/09/2017 06:46AM]: PASS: installed-tests/js/testGObjectInterface.js 4 GObject interface is an instance of the interface classes
 814  [08/09/2017 06:46AM]: PASS: installed-tests/js/testGObjectInterface.js 5 GObject interface cannot be instantiated
 815  [08/09/2017 06:46AM]: PASS: installed-tests/js/testGObjectInterface.js 6 GObject interface reports its type name
 816  [08/09/2017 06:46AM]: PASS: installed-tests/js/testGObjectInterface.js 7 GObject interface can be implemented by a GObject class
 817  [08/09/2017 06:46AM]: PASS: installed-tests/js/testGObjectInterface.js 8 GObject interface is implemented by a GObject class with the correct class object
 818  [08/09/2017 06:46AM]: PASS: installed-tests/js/testGObjectInterface.js 9 GObject interface can be implemented by a class also implementing a Lang.Interface
 819  [08/09/2017 06:46AM]: PASS: installed-tests/js/testGObjectInterface.js 10 GObject interface can have its required function implemented
 820  [08/09/2017 06:46AM]: PASS: installed-tests/js/testGObjectInterface.js 11 GObject interface must have its required function implemented
 821  [08/09/2017 06:46AM]: PASS: installed-tests/js/testGObjectInterface.js 12 GObject interface doesnt have to have its optional function implemented
 822  [08/09/2017 06:46AM]: PASS: installed-tests/js/testGObjectInterface.js 13 GObject interface can have its optional function deferred to by the implementation
 823  [08/09/2017 06:46AM]: PASS: installed-tests/js/testGObjectInterface.js 14 GObject interface can have its function chained up to
 824  [08/09/2017 06:46AM]: PASS: installed-tests/js/testGObjectInterface.js 15 GObject interface can require another interface
 825  [08/09/2017 06:46AM]: PASS: installed-tests/js/testGObjectInterface.js 16 GObject interface can chain up to another interface
 826  [08/09/2017 06:46AM]: PASS: installed-tests/js/testGObjectInterface.js 17 GObject interface defers to the last interfaces optional function
 827  [08/09/2017 06:46AM]: PASS: installed-tests/js/testGObjectInterface.js 18 GObject interface must be implemented by a class that implements all required interfaces
 828  [08/09/2017 06:46AM]: PASS: installed-tests/js/testGObjectInterface.js 19 GObject interface must be implemented by a class that implements required interfaces in correct order
 829  [08/09/2017 06:46AM]: PASS: installed-tests/js/testGObjectInterface.js 20 GObject interface can require an interface from C
 830  [08/09/2017 06:46AM]: PASS: installed-tests/js/testGObjectInterface.js 21 GObject interface can define signals on the implementing class
 831  [08/09/2017 06:46AM]: PASS: installed-tests/js/testGObjectInterface.js 22 GObject interface can define properties on the implementing class
 832  [08/09/2017 06:46AM]: PASS: installed-tests/js/testGObjectInterface.js 23 GObject interface must have its properties overridden
 833  [08/09/2017 06:46AM]: PASS: installed-tests/js/testGObjectInterface.js 24 GObject interface gets the correct type for its metaclass
 834  [08/09/2017 06:46AM]: PASS: installed-tests/js/testGObjectInterface.js 25 GObject interface can be implemented by a class as well as its parent class
 835  [08/09/2017 06:46AM]: PASS: installed-tests/js/testGObjectInterface.js 26 GObject interface can be reimplemented by a subclass of a class that already implements it
 836  [08/09/2017 06:46AM]: PASS: installed-tests/js/testGTypeClass.js 1 Looking up param specs works
 837  [08/09/2017 06:46AM]: PASS: installed-tests/js/testGTypeClass.js 2 Looking up param specs gives the correct name
 838  [08/09/2017 06:46AM]: PASS: installed-tests/js/testGTypeClass.js 3 Looking up param specs gives the default value if present
 839  [08/09/2017 06:46AM]: PASS: installed-tests/js/testGTypeClass.js 4 GType object has a name
 840  [08/09/2017 06:46AM]: PASS: installed-tests/js/testGTypeClass.js 5 GType object has a read-only name
 841  [08/09/2017 06:46AM]: PASS: installed-tests/js/testGTypeClass.js 6 GType object has an undeletable name
 842  [08/09/2017 06:46AM]: PASS: installed-tests/js/testGTypeClass.js 7 GType object has a string representation
 843  [08/09/2017 06:46AM]: PASS: installed-tests/js/testGTypeClass.js 8 GType prototype object has no name
 844  [08/09/2017 06:46AM]: PASS: installed-tests/js/testGTypeClass.js 9 GType prototype object has a string representation
 845  [08/09/2017 06:46AM]: PASS: installed-tests/js/testImporter.js 1 GI importer can import GI modules
 846  [08/09/2017 06:46AM]: PASS: installed-tests/js/testImporter.js 2 GI importer on failure throws an exception when the overrides file cant be imported
 847  [08/09/2017 06:46AM]: PASS: installed-tests/js/testImporter.js 3 GI importer on failure throws an exception when the overrides import throws one
 848  [08/09/2017 06:46AM]: PASS: installed-tests/js/testImporter.js 4 GI importer on failure throws an exception when the overrides _init throws one
 849  [08/09/2017 06:46AM]: PASS: installed-tests/js/testImporter.js 5 GI importer on failure throws an exception when the overrides _init isnt a function
 850  [08/09/2017 06:46AM]: PASS: installed-tests/js/testImporter.js 6 Importer exists
 851  [08/09/2017 06:46AM]: PASS: installed-tests/js/testImporter.js 7 Importer has a toString representation
 852  [08/09/2017 06:46AM]: PASS: installed-tests/js/testImporter.js 8 Importer throws an import error when trying to import a nonexistent module
 853  [08/09/2017 06:46AM]: PASS: installed-tests/js/testImporter.js 9 Importer throws an error when evaluating the module file throws an error
 854  [08/09/2017 06:46AM]: PASS: installed-tests/js/testImporter.js 10 Importer can import a module
 855  [08/09/2017 06:46AM]: PASS: installed-tests/js/testImporter.js 11 Importer makes deleting the import a no-op
 856  [08/09/2017 06:46AM]: PASS: installed-tests/js/testImporter.js 12 Importer gives the same object when importing a second time
 857  [08/09/2017 06:46AM]: PASS: installed-tests/js/testImporter.js 13 Importer can import a submodule
 858  [08/09/2017 06:46AM]: PASS: installed-tests/js/testImporter.js 14 Importer imports modules with a toString representation
 859  [08/09/2017 06:46AM]: PASS: installed-tests/js/testImporter.js 15 Importer does not share the same object for a module on a different path
 860  [08/09/2017 06:46AM]: PASS: installed-tests/js/testImporter.js 16 Importer gives the same object when importing a submodule a second time
 861  [08/09/2017 06:46AM]: PASS: installed-tests/js/testImporter.js 17 Importer has no meta properties on the toplevel importer
 862  [08/09/2017 06:46AM]: PASS: installed-tests/js/testImporter.js 18 Importer sets the names of imported modules
 863  [08/09/2017 06:46AM]: PASS: installed-tests/js/testImporter.js 19 Importer gives a module the importer object as parent module
 864  [08/09/2017 06:46AM]: PASS: installed-tests/js/testImporter.js 20 Importer gives a submodule the module as parent module
 865  [08/09/2017 06:46AM]: PASS: installed-tests/js/testImporter.js 21 Importer does not make a separate copy of a module imported in two places
 866  [08/09/2017 06:46AM]: PASS: installed-tests/js/testImporter.js 22 Importer evaluates an __init__.js file in an imported directory
 867  [08/09/2017 06:46AM]: PASS: installed-tests/js/testImporter.js 23 Importer accesses a class defined in an __init__.js file
 868  [08/09/2017 06:46AM]: PASS: installed-tests/js/testImporter.js 24 Importer can import a file encoded in UTF-8
 869  [08/09/2017 06:46AM]: PASS: installed-tests/js/testImporter.js 25 Importer enumerating modules gets all of them
 870  [08/09/2017 06:46AM]: PASS: installed-tests/js/testImporter.js 26 Importer enumerating modules includes modules that throw on import
 871  [08/09/2017 06:46AM]: PASS: installed-tests/js/testImporter.js 27 Importer enumerating modules does not include meta properties
 872  [08/09/2017 06:46AM]: PASS: installed-tests/js/testInterface.js 1 An interface is an instance of Lang.Interface
 873  [08/09/2017 06:46AM]: PASS: installed-tests/js/testInterface.js 2 An interface cannot be instantiated
 874  [08/09/2017 06:46AM]: PASS: installed-tests/js/testInterface.js 3 An interface can be implemented by a class
 875  [08/09/2017 06:46AM]: PASS: installed-tests/js/testInterface.js 4 An interface can be implemented by a classs superclass
 876  [08/09/2017 06:46AM]: PASS: installed-tests/js/testInterface.js 5 An interface doesnt disturb a classs constructor
 877  [08/09/2017 06:46AM]: PASS: installed-tests/js/testInterface.js 6 An interface can have its required method implemented
 878  [08/09/2017 06:46AM]: PASS: installed-tests/js/testInterface.js 7 An interface must have a name
 879  [08/09/2017 06:46AM]: PASS: installed-tests/js/testInterface.js 8 An interface must have its required methods implemented
 880  [08/09/2017 06:46AM]: PASS: installed-tests/js/testInterface.js 9 An interface does not have to have its optional methods implemented
 881  [08/09/2017 06:46AM]: PASS: installed-tests/js/testInterface.js 10 An interface can have its optional method deferred to by the implementation
 882  [08/09/2017 06:46AM]: PASS: installed-tests/js/testInterface.js 11 An interface can be chained up to by a class
 883  [08/09/2017 06:46AM]: PASS: installed-tests/js/testInterface.js 12 An interface can include arguments when being chained up to by a class
 884  [08/09/2017 06:46AM]: PASS: installed-tests/js/testInterface.js 13 An interface can have its property getter deferred to
 885  [08/09/2017 06:46AM]: PASS: installed-tests/js/testInterface.js 14 An interface can have its property setter deferred to
 886  [08/09/2017 06:46AM]: PASS: installed-tests/js/testInterface.js 15 An interface can have its property getter overridden
 887  [08/09/2017 06:46AM]: PASS: installed-tests/js/testInterface.js 16 An interface can have its property setter overridden
 888  [08/09/2017 06:46AM]: PASS: installed-tests/js/testInterface.js 17 An interface can require another interface
 889  [08/09/2017 06:46AM]: PASS: installed-tests/js/testInterface.js 18 An interface can have empty requires
 890  [08/09/2017 06:46AM]: PASS: installed-tests/js/testInterface.js 19 An interface can chain up to another interface
 891  [08/09/2017 06:46AM]: PASS: installed-tests/js/testInterface.js 20 An interface can be chained up to with a generic
 892  [08/09/2017 06:46AM]: PASS: installed-tests/js/testInterface.js 21 An interface can chain up to another interface with a generic
 893  [08/09/2017 06:46AM]: PASS: installed-tests/js/testInterface.js 22 An interface has its optional function defer to that of the last interface
 894  [08/09/2017 06:46AM]: PASS: installed-tests/js/testInterface.js 23 An interface must have all its required interfaces implemented
 895  [08/09/2017 06:46AM]: PASS: installed-tests/js/testInterface.js 24 An interface must have all its required interfaces implemented in the correct order
 896  [08/09/2017 06:46AM]: PASS: installed-tests/js/testInterface.js 25 An interface can have its implementation on a parent class
 897  [08/09/2017 06:46AM]: PASS: installed-tests/js/testInterface.js 26 An interface can require its implementor to be a subclass of some class
 898  [08/09/2017 06:46AM]: PASS: installed-tests/js/testInterface.js 27 An interface must be implemented by an object which subclasses the required class
 899  [08/09/2017 06:46AM]: PASS: installed-tests/js/testInterface.js 28 An interface can have methods that call others of its methods
 900  [08/09/2017 06:46AM]: PASS: installed-tests/js/testInterface.js 29 An interface is implemented by a subclass of a class that implements it
 901  [08/09/2017 06:46AM]: PASS: installed-tests/js/testInterface.js 30 An interface can be reimplemented by a subclass of a class that implements it
 902  [08/09/2017 06:46AM]: PASS: installed-tests/js/testInterface.js 31 An interface tells what it is with toString()
 903  [08/09/2017 06:46AM]: PASS: installed-tests/js/testLang.js 1 Lang module counts properties with Lang.countProperties()
 904  [08/09/2017 06:46AM]: PASS: installed-tests/js/testLang.js 2 Lang module copies properties from one object to another with Lang.copyProperties()
 905  [08/09/2017 06:46AM]: PASS: installed-tests/js/testLang.js 3 Lang module copies properties without an underscore with Lang.copyPublicProperties()
 906  [08/09/2017 06:46AM]: PASS: installed-tests/js/testLang.js 4 Lang module copies property getters and setters
 907  [08/09/2017 06:46AM]: PASS: installed-tests/js/testLang.js 5 Lang module bind() calls the bound function with the supplied this-object
 908  [08/09/2017 06:46AM]: PASS: installed-tests/js/testLang.js 6 Lang module bind() throws an error when no function supplied
 909  [08/09/2017 06:46AM]: PASS: installed-tests/js/testLang.js 7 Lang module bind() throws an error when this-object undefined
 910  [08/09/2017 06:46AM]: PASS: installed-tests/js/testLang.js 8 Lang module bind() supplies extra arguments to the function
 911  [08/09/2017 06:46AM]: PASS: installed-tests/js/testLang.js 9 Lang module bind() appends the extra arguments to any arguments passed
 912  [08/09/2017 06:46AM]: PASS: installed-tests/js/testLocale.js 1 JS_SetLocaleCallbacks Intl API was compiled into SpiderMonkey
 913  [08/09/2017 06:46AM]: PASS: installed-tests/js/testLocale.js 2 JS_SetLocaleCallbacks toLocaleDateString() works
 914  [08/09/2017 06:46AM]: PASS: installed-tests/js/testLocale.js 3 JS_SetLocaleCallbacks toLocaleLowerCase() works
 915  [08/09/2017 06:46AM]: PASS: installed-tests/js/testLocale.js 4 JS_SetLocaleCallbacks toLocaleLowerCase() works for Unicode
 916  [08/09/2017 06:46AM]: PASS: installed-tests/js/testLocale.js 5 JS_SetLocaleCallbacks toLocaleUpperCase() works
 917  [08/09/2017 06:46AM]: PASS: installed-tests/js/testLocale.js 6 JS_SetLocaleCallbacks toLocaleUpperCase() works for Unicode
 918  [08/09/2017 06:46AM]: PASS: installed-tests/js/testLocale.js 7 JS_SetLocaleCallbacks localeCompare() works
 919  [08/09/2017 06:46AM]: PASS: installed-tests/js/testMainloop.js 1 Mainloop.timeout_add() runs a timeout function
 920  [08/09/2017 06:46AM]: PASS: installed-tests/js/testMainloop.js 2 Mainloop.timeout_add() runs a timeout function until it returns false
 921  [08/09/2017 06:46AM]: PASS: installed-tests/js/testMainloop.js 3 Mainloop.timeout_add() runs a timeout function after an initial timeout
 922  [08/09/2017 06:46AM]: PASS: installed-tests/js/testMainloop.js 4 Mainloop.idle_add() runs an idle function
 923  [08/09/2017 06:46AM]: PASS: installed-tests/js/testMainloop.js 5 Mainloop.idle_add() continues to run idle functions that return true
 924  [08/09/2017 06:46AM]: PASS: installed-tests/js/testMainloop.js 6 Mainloop.idle_add() does not run idle functions if removed
 925  [08/09/2017 06:46AM]: PASS: installed-tests/js/testMainloop.js 7 Mainloop.idle_add() can remove idle functions while they are being invoked
 926  [08/09/2017 06:46AM]: PASS: installed-tests/js/testMainloop.js 8 Mainloop.idle_add() does not leak idle callbacks
 927  [08/09/2017 06:46AM]: PASS: installed-tests/js/testMetaClass.js 1 A metaclass has its constructor called each time a class is created with it
 928  [08/09/2017 06:46AM]: PASS: installed-tests/js/testMetaClass.js 2 A metaclass is an instance of Lang.Class
 929  [08/09/2017 06:46AM]: PASS: installed-tests/js/testMetaClass.js 3 A metaclass produces instances that are instances of itself and Lang.Class
 930  [08/09/2017 06:46AM]: PASS: installed-tests/js/testMetaClass.js 4 A metaclass can dynamically define properties in its constructor
 931  [08/09/2017 06:46AM]: PASS: installed-tests/js/testMetaClass.js 5 A metaclass instance gets all the properties from its class and metaclass
 932  [08/09/2017 06:46AM]: PASS: installed-tests/js/testMetaClass.js 6 A metaclass instance gets dynamically defined properties from metaclass
 933  [08/09/2017 06:46AM]: PASS: installed-tests/js/testMetaClass.js 7 A metaclass can be instantiated with Lang.Class but still get the appropriate metaclass
 934  [08/09/2017 06:46AM]: PASS: installed-tests/js/testNamespace.js 1 GI repository namespace supplies a name
 935  [08/09/2017 06:46AM]: PASS: installed-tests/js/testParamSpec.js 1 GObject.ParamSpec.string has the correct name strings
 936  [08/09/2017 06:46AM]: PASS: installed-tests/js/testParamSpec.js 2 GObject.ParamSpec.string has the correct flags
 937  [08/09/2017 06:46AM]: PASS: installed-tests/js/testParamSpec.js 3 GObject.ParamSpec.string has the correct default value
 938  [08/09/2017 06:46AM]: PASS: installed-tests/js/testParamSpec.js 4 GObject.ParamSpec.int has the correct name strings
 939  [08/09/2017 06:46AM]: PASS: installed-tests/js/testParamSpec.js 5 GObject.ParamSpec.int has the correct flags
 940  [08/09/2017 06:46AM]: PASS: installed-tests/js/testParamSpec.js 6 GObject.ParamSpec.int has the correct default value
 941  [08/09/2017 06:46AM]: PASS: installed-tests/js/testParamSpec.js 7 GObject.ParamSpec.uint has the correct name strings
 942  [08/09/2017 06:46AM]: PASS: installed-tests/js/testParamSpec.js 8 GObject.ParamSpec.uint has the correct flags
 943  [08/09/2017 06:46AM]: PASS: installed-tests/js/testParamSpec.js 9 GObject.ParamSpec.uint has the correct default value
 944  [08/09/2017 06:46AM]: PASS: installed-tests/js/testParamSpec.js 10 GObject.ParamSpec.int64 has the correct name strings
 945  [08/09/2017 06:46AM]: PASS: installed-tests/js/testParamSpec.js 11 GObject.ParamSpec.int64 has the correct flags
 946  [08/09/2017 06:46AM]: PASS: installed-tests/js/testParamSpec.js 12 GObject.ParamSpec.int64 has the correct default value
 947  [08/09/2017 06:46AM]: PASS: installed-tests/js/testParamSpec.js 13 GObject.ParamSpec.uint64 has the correct name strings
 948  [08/09/2017 06:46AM]: PASS: installed-tests/js/testParamSpec.js 14 GObject.ParamSpec.uint64 has the correct flags
 949  [08/09/2017 06:46AM]: PASS: installed-tests/js/testParamSpec.js 15 GObject.ParamSpec.uint64 has the correct default value
 950  [08/09/2017 06:46AM]: PASS: installed-tests/js/testParamSpec.js 16 GObject.ParamSpec.enum has the correct name strings
 951  [08/09/2017 06:46AM]: PASS: installed-tests/js/testParamSpec.js 17 GObject.ParamSpec.enum has the correct flags
 952  [08/09/2017 06:46AM]: PASS: installed-tests/js/testParamSpec.js 18 GObject.ParamSpec.enum has the correct default value
 953  [08/09/2017 06:46AM]: PASS: installed-tests/js/testParamSpec.js 19 GObject.ParamSpec.flags has the correct name strings
 954  [08/09/2017 06:46AM]: PASS: installed-tests/js/testParamSpec.js 20 GObject.ParamSpec.flags has the correct flags
 955  [08/09/2017 06:46AM]: PASS: installed-tests/js/testParamSpec.js 21 GObject.ParamSpec.flags has the correct default value
 956  [08/09/2017 06:46AM]: PASS: installed-tests/js/testParamSpec.js 22 GObject.ParamSpec.object has the correct name strings
 957  [08/09/2017 06:46AM]: PASS: installed-tests/js/testParamSpec.js 23 GObject.ParamSpec.object has the correct flags
 958  [08/09/2017 06:46AM]: PASS: installed-tests/js/testParamSpec.js 24 GObject.ParamSpec.object has the correct default value
 959  [08/09/2017 06:46AM]: PASS: installed-tests/js/testSignals.js 1 Object with signals calls a signal handler when a signal is emitted
 960  [08/09/2017 06:46AM]: PASS: installed-tests/js/testSignals.js 2 Object with signals does not call a signal handler after the signal is disconnected
 961  [08/09/2017 06:46AM]: PASS: installed-tests/js/testSignals.js 3 Object with signals can disconnect a signal handler during signal emission
 962  [08/09/2017 06:46AM]: PASS: installed-tests/js/testSignals.js 4 Object with signals distinguishes multiple signals
 963  [08/09/2017 06:46AM]: ERROR: installed-tests/js/testSignals.js - too few tests run (expected 12, got 4)
 964  [08/09/2017 06:46AM]: ERROR: installed-tests/js/testSignals.js - exited with status 133 (terminated by signal 5?)
 965  [08/09/2017 06:46AM]: PASS: installed-tests/js/testSystem.js 1 System.addressOf() gives different results for different objects
 966  [08/09/2017 06:46AM]: FAIL: installed-tests/js/testSystem.js 2 System.version gives a plausible number
 967  [08/09/2017 06:46AM]: PASS: installed-tests/js/testSystem.js 3 System.refcount() gives the correct number
 968  [08/09/2017 06:46AM]: PASS: installed-tests/js/testSystem.js 4 System.gc() does not crash the application
 969  [08/09/2017 06:46AM]: ERROR: installed-tests/js/testSystem.js - exited with status 1
 970  [08/09/2017 06:46AM]: PASS: installed-tests/js/testTweener.js 1 Tweener runs a simple tween
 971  [08/09/2017 06:46AM]: PASS: installed-tests/js/testTweener.js 2 Tweener calls callbacks during the tween
 972  [08/09/2017 06:46AM]: PASS: installed-tests/js/testTweener.js 3 Tweener can pause tweens
 973  [08/09/2017 06:46AM]: PASS: installed-tests/js/testTweener.js 4 Tweener can remove tweens
 974  [08/09/2017 06:46AM]: PASS: installed-tests/js/testTweener.js 5 Tweener overrides a tween with another one acting on the same object and property at the same time
 975  [08/09/2017 06:46AM]: PASS: installed-tests/js/testTweener.js 6 Tweener does not override a tween with another one acting not at the same time
 976  [08/09/2017 06:46AM]: PASS: installed-tests/js/testTweener.js 7 Tweener can pause and resume all tweens
 977  [08/09/2017 06:46AM]: PASS: installed-tests/js/testTweener.js 8 Tweener can remove all tweens
 978  [08/09/2017 06:46AM]: PASS: installed-tests/js/testTweener.js 9 Tweener runs a tween with a time of 0 immediately
 979  [08/09/2017 06:46AM]: PASS: installed-tests/js/testTweener.js 10 Tweener can call a callback a certain number of times
 980  [08/09/2017 06:46AM]: PASS: installed-tests/js/testTweener.js 11 Tweener can count the number of tweens on an object
 981  [08/09/2017 06:46AM]: PASS: installed-tests/js/testTweener.js 12 Tweener can register special properties
 982  [08/09/2017 06:46AM]: PASS: installed-tests/js/testTweener.js 13 Tweener can register special modifiers for properties
 983  [08/09/2017 06:46AM]: PASS: installed-tests/js/testTweener.js 14 Tweener can split properties into more than one special property
 984  [08/09/2017 06:46AM]: PASS: installed-tests/js/testTweener.js 15 Tweener calls an overwrite callback when a tween is replaced
 985  [08/09/2017 06:46AM]: PASS: installed-tests/js/testTweener.js 16 Tweener can still overwrite a tween after it has started
 986  [08/09/2017 06:46AM]: PASS: installed-tests/js/testGDBus.js 1 Exported DBus object can call a remote method
 987  [08/09/2017 06:46AM]: ERROR: installed-tests/js/testGDBus.js - too few tests run (expected 18, got 1)
 988  [08/09/2017 06:46AM]: ERROR: installed-tests/js/testGDBus.js - exited with status 133 (terminated by signal 5?)
 989  [08/09/2017 06:46AM]: ERROR: installed-tests/js/testCairo.js - Bail out! JS_EvaluateScript() failed
 990  [08/09/2017 06:46AM]: ============================================================================
 991  [08/09/2017 06:46AM]: Testsuite summary for cjs 3.4.4
 992  [08/09/2017 06:46AM]: Please report to https://github.com/linuxmint/cjs/issues/new
 993  [08/09/2017 06:46AM]: make[3]: *** [Makefile:2814: test-suite.log] Error 1
 994  [08/09/2017 06:46AM]: make[2]: *** [Makefile:2922: check-TESTS] Error 2
 995  [08/09/2017 06:46AM]: make[1]: *** [Makefile:3139: check-am] Error 2
 996  [08/09/2017 06:46AM]: make: *** [Makefile:3141: check] Error 2
 997  [08/09/2017 06:46AM]: ==> Entering fakeroot environment...
 998  [08/09/2017 06:46AM]:  /usr/bin/mkdir -p /pkg/pkg/cjs/usr/lib
 999  [08/09/2017 06:46AM]:  /bin/sh ./libtool   --mode=install /usr/bin/install -c   libcjs.la /pkg/pkg/cjs/usr/lib
1000  [08/09/2017 06:46AM]: libtool: install: /usr/bin/install -c .libs/libcjs.so.0.0.0 /pkg/pkg/cjs/usr/lib/libcjs.so.0.0.0
1001  [08/09/2017 06:46AM]: libtool: install: (cd /pkg/pkg/cjs/usr/lib && { ln -s -f libcjs.so.0.0.0 libcjs.so.0 || { rm -f libcjs.so.0 && ln -s libcjs.so.0.0.0 libcjs.so.0; }; })
1002  [08/09/2017 06:46AM]: libtool: install: (cd /pkg/pkg/cjs/usr/lib && { ln -s -f libcjs.so.0.0.0 libcjs.so || { rm -f libcjs.so && ln -s libcjs.so.0.0.0 libcjs.so; }; })
1003  [08/09/2017 06:46AM]: libtool: install: /usr/bin/install -c .libs/libcjs.lai /pkg/pkg/cjs/usr/lib/libcjs.la
1004  [08/09/2017 06:46AM]: libtool: warning: remember to run libtool --finish /usr/lib
1005  [08/09/2017 06:46AM]:  /usr/bin/mkdir -p /pkg/pkg/cjs/usr/bin
1006  [08/09/2017 06:46AM]:   /bin/sh ./libtool   --mode=install /usr/bin/install -c cjs-console /pkg/pkg/cjs/usr/bin
1007  [08/09/2017 06:46AM]: libtool: warning: libcjs.la has not been installed in /usr/lib
1008  [08/09/2017 06:46AM]: libtool: install: /usr/bin/install -c .libs/cjs-console /pkg/pkg/cjs/usr/bin/cjs-console
1009  [08/09/2017 06:46AM]: (cd /pkg/pkg/cjs/usr/bin && ln -s -f cjs-console cjs)
1010  [08/09/2017 06:46AM]:  /usr/bin/mkdir -p /pkg/pkg/cjs/usr/include/cjs-1.0
1011  [08/09/2017 06:46AM]:  /usr/bin/mkdir -p /pkg/pkg/cjs/usr/include/cjs-1.0/cjs
1012  [08/09/2017 06:46AM]:  /usr/bin/install -c -m 644  cjs/context.h cjs/coverage.h cjs/gjs.h cjs/macros.h /pkg/pkg/cjs/usr/include/cjs-1.0/cjs
1013  [08/09/2017 06:46AM]:  /usr/bin/mkdir -p /pkg/pkg/cjs/usr/include/cjs-1.0/util
1014  [08/09/2017 06:46AM]:  /usr/bin/install -c -m 644  util/error.h /pkg/pkg/cjs/usr/include/cjs-1.0/util
1015  [08/09/2017 06:46AM]:  /usr/bin/mkdir -p /pkg/pkg/cjs/usr/lib/pkgconfig
1016  [08/09/2017 06:46AM]:  /usr/bin/install -c -m 644 cjs-1.0.pc /pkg/pkg/cjs/usr/lib/pkgconfig
1017  [08/09/2017 06:46AM]:  /usr/bin/mkdir -p /pkg/pkg/cjs/usr/lib/cjs/girepository-1.0
1018  [08/09/2017 06:46AM]:  /usr/bin/install -c -m 644 CjsPrivate-1.0.typelib /pkg/pkg/cjs/usr/lib/cjs/girepository-1.0
1019  [08/09/2017 06:46AM]:   -> Removing libtool files...
1020  [08/09/2017 06:46AM]:   -> Removing static library files...
1021  [08/09/2017 06:46AM]:   -> Stripping unneeded symbols from binaries and libraries...
1022  [08/09/2017 06:46AM]:   -> Compressing man and info pages...
1023  [08/09/2017 06:46AM]: ==> Checking for packaging issue...
1024  [08/09/2017 06:46AM]: ==> Creating package cjs...
1025  [08/09/2017 06:46AM]:   -> Generating .PKGINFO file...
1026  [08/09/2017 06:46AM]:   -> Generating .BUILDINFO file...
1027  [08/09/2017 06:46AM]:   -> Generating .MTREE file...
1028  [08/09/2017 06:46AM]: ==> Leaving fakeroot environment.
1029  [08/09/2017 06:46AM]: ==> Finished making: cjs 3.4.4-1 (Wed Aug  9 11:46:36 UTC 2017)
1030  [08/09/2017 06:46AM]: [\^/\^/^\^/^\^/\^/\^/^\^/^\^/]  Getting packages that would be generated by PKGBUILD...  [\^/\^/^\^/^\^/\^/\^/^\^/^\^/]
1031  [08/09/2017 06:46AM]: [\^/\^/^\^/^\^/\^/\^/^\^/^\^/]  cjs-3.4.4-1-i686
1032  [08/09/2017 06:46AM]: cjs-3.4.4-1-x86_64  [\^/\^/^\^/^\^/\^/\^/^\^/^\^/]
1033  [08/09/2017 06:46AM]: [\^/\^/^\^/^\^/\^/\^/^\^/^\^/]  CREATING 32-BIT BUILD ENVIRONMENT  [\^/\^/^\^/^\^/\^/\^/^\^/^\^/]
1034  [08/09/2017 06:46AM]: ==> Creating install root at /32build/root
1035  [08/09/2017 06:46AM]: ==> Installing packages to /32build/root
1036  [08/09/2017 06:46AM]: :: There are 25 members in group base-devel:
1037  [08/09/2017 06:46AM]:    1) autoconf  2) automake  3) binutils  4) bison  5) fakeroot  6) file  7) findutils  8) flex  9) gawk  10) gcc  11) gettext  12) grep  13) groff  14) gzip  15) libtool  16) m4  17) make  18) pacman  19) patch  20) pkg-config  21) sed  22) sudo  23) texinfo  24) util-linux  25) which
1038  [08/09/2017 06:46AM]: Enter a selection (default=all): warning: skipping target: sudo
1039  [08/09/2017 06:46AM]: Packages (106) acl-2.2.52-4  archlinux-keyring-20170611-1  attr-2.4.47-3  bash-4.4.012-2  bzip2-1.0.6-6  ca-certificates-20170307-1  ca-certificates-cacert-20140824-4  ca-certificates-mozilla-3.31-3  ca-certificates-utils-20170307-1  coreutils-8.27-1  cracklib-2.9.6-1  curl-7.54.1-2  db-5.3.28-3  diffutils-3.6-1  e2fsprogs-1.43.5-1  expat-2.2.2-1  filesystem-2017.03-2  gc-7.6.0-1  gcc-libs-7.1.1-4  gdbm-1.13-1  glib2-2.52.3-1  glibc-2.25-7  gmp-6.1.2-1  gnupg-2.1.22-1  gnutls-3.5.14-1  gpgme-1.9.0-3  guile-2.2.2-1  iana-etc-20170512-1  icu-59.1-1  keyutils-1.5.10-1  krb5-1.15.1-1  less-487-1  libarchive-3.3.2-1  libassuan-2.4.3-1  libatomic_ops-7.4.6-1  libcap-2.25-1  libcap-ng-0.7.8-1  libffi-3.2.1-2  libgcrypt-1.8.0-1  libgpg-error-1.27-1  libidn-1.33-1  libksba-1.3.4-2  libldap-2.4.44-5  libmpc-1.0.3-2  libnghttp2-1.23.1-1  libpsl-0.17.0-2  libsasl-2.1.26-11  libsecret-0.18.5+14+g9980655-1  libssh2-1.8.0-2  libsystemd-234.11-6  libtasn1-4.12-1  libtirpc-1.0.2-1  libunistring-0.9.7-1  libutil-linux-2.30.1-2  linux-api-headers-4.10.1-1  lz4-1:1.7.5-1  mpfr-3.1.5.p2-1  ncurses-6.0+20170527-1  nettle-3.3-1  npth-1.5-1  openssl-1.1.0.f-2  p11-kit-0.23.7-1  pacman-mirrorlist-20170729-1  pam-1.3.0-1  pambase-20130928-1  pcre-8.41-1  pcre2-10.23-1  perl-5.26.0-1  perl-error-0.17025-1  pinentry-1.0.0-1  python-3.6.2-1  readline-7.0.003-1  shadow-4.4-3  sqlite-3.20.0-1  tar-1.29-2  tzdata-2017b-1  xz-5.2.3-1  zlib-1:1.2.11-2  autoconf-2.69-4  automake-1.15.1-1  binutils-2.28.0-4  bison-3.0.4-3  fakeroot-1.21-2  file-5.31-1  findutils-4.6.0-2  flex-2.6.4-1  gawk-4.1.4-2  gcc-7.1.1-4  gettext-0.19.8.1-2  git-2.14.0-1  grep-3.1-1  groff-1.22.3-7  gzip-1.8-2  libtool-2.4.6-8  m4-1.4.18-1  make-4.2.1-2  pacman-5.0.2-2  patch-2.7.5-1  pkg-config-0.29.2-1  reflector-2017.6-1  sed-4.4-1  sudo-1.8.20.p2-1  texinfo-6.4-1  util-linux-2.30.1-2  wget-1.19.1-2  which-2.21-2
1040  [08/09/2017 06:46AM]: Total Installed Size:  734.24 MiB
1041  [08/09/2017 06:47AM]: installing linux-api-headers...
1042  [08/09/2017 06:47AM]: Optional dependencies for glibc
1043  [08/09/2017 06:47AM]: Optional dependencies for bash
1044  [08/09/2017 06:47AM]:     bash-completion: for tab completion
1045  [08/09/2017 06:47AM]: Optional dependencies for openssl
1046  [08/09/2017 06:47AM]:     ca-certificates [pending]
1047  [08/09/2017 06:47AM]: Optional dependencies for util-linux
1048  [08/09/2017 06:47AM]:     python: python bindings to libmount [pending]
1049  [08/09/2017 06:47AM]: Optional dependencies for glib2
1050  [08/09/2017 06:47AM]:     python: for gdbus-codegen and gtester-report [pending]
1051  [08/09/2017 06:47AM]:     libelf: gresource inspection tool
1052  [08/09/2017 06:47AM]: Optional dependencies for gettext
1053  [08/09/2017 06:47AM]:     git: for autopoint infrastructure updates [pending]
1054  [08/09/2017 06:47AM]: Optional dependencies for groff
1055  [08/09/2017 06:47AM]:     netpbm: for use together with man -H command interaction in browsers
1056  [08/09/2017 06:47AM]:     psutils: for use together with man -H command interaction in browsers
1057  [08/09/2017 06:47AM]: installing ca-certificates-utils...
1058  [08/09/2017 06:47AM]: installing ca-certificates-mozilla...
1059  [08/09/2017 06:47AM]: installing ca-certificates-cacert...
1060  [08/09/2017 06:47AM]: installing ca-certificates...
1061  [08/09/2017 06:47AM]: Optional dependencies for libsecret
1062  [08/09/2017 06:47AM]:     gnome-keyring: key storage service (or use any other service implementing org.freedesktop.secrets)
1063  [08/09/2017 06:47AM]: Optional dependencies for pinentry
1064  [08/09/2017 06:47AM]: Optional dependencies for gnutls
1065  [08/09/2017 06:47AM]:     guile: for use with Guile bindings [installed]
1066  [08/09/2017 06:47AM]: Optional dependencies for gnupg
1067  [08/09/2017 06:47AM]:     libldap: gpg2keys_ldap [installed]
1068  [08/09/2017 06:47AM]:     libusb-compat: scdaemon
1069  [08/09/2017 06:47AM]: installing pacman-mirrorlist...
1070  [08/09/2017 06:47AM]: installing archlinux-keyring...
1071  [08/09/2017 06:47AM]: Optional dependencies for patch
1072  [08/09/2017 06:47AM]:     ed: for patch -e functionality
1073  [08/09/2017 06:47AM]: Optional dependencies for wget
1074  [08/09/2017 06:47AM]:     ca-certificates: HTTPS downloads [installed]
1075  [08/09/2017 06:47AM]: Optional dependencies for git
1076  [08/09/2017 06:47AM]:     perl-term-readkey: git svn
1077  [08/09/2017 06:47AM]:     perl-mime-tools: git send-email
1078  [08/09/2017 06:47AM]:     perl-net-smtp-ssl: git send-email TLS support
1079  [08/09/2017 06:47AM]:     perl-authen-sasl: git send-email TLS support
1080  [08/09/2017 06:47AM]:     perl-mediawiki-api: git mediawiki support
1081  [08/09/2017 06:47AM]:     perl-datetime-format-iso8601: git mediawiki support
1082  [08/09/2017 06:47AM]:     perl-lwp-protocol-https: git mediawiki https support
1083  [08/09/2017 06:47AM]:     perl-cgi: gitweb (web interface) support
1084  [08/09/2017 06:47AM]:     python2: various helper scripts
1085  [08/09/2017 06:47AM]:     gnome-keyring: GNOME keyring credential helper
1086  [08/09/2017 06:47AM]: Optional dependencies for python
1087  [08/09/2017 06:47AM]:     mpdecimal: for decimal
1088  [08/09/2017 06:47AM]:     xz: for lzma [installed]
1089  [08/09/2017 06:47AM]: Optional dependencies for reflector
1090  [08/09/2017 06:47AM]:     rsync: rate rsync mirrors
1091  [08/09/2017 06:47AM]: (2/2) Rebuilding certificate stores...
1092  [08/09/2017 06:47AM]: Initializing machine ID from random generator.
1093  [08/09/2017 06:47AM]: Failed to open system bus: No such file or directory
1094  [08/09/2017 06:47AM]: Attempted to remove disk file system, and we cant allow that.
1095  [08/09/2017 06:47AM]: [\^/\^/^\^/^\^/\^/\^/^\^/^\^/]  UPDATING 32BIT SOURCE CHECKSUMS  [\^/\^/^\^/^\^/\^/\^/^\^/^\^/]
1096  [08/09/2017 06:47AM]: 
1097   0     0    0     0    0     0      0      0 --:--:-- --:--:-- --:--:--     0
1098 100   120    0   120    0     0    859      0 --:--:-- --:--:-- --:--:--   863
1099  [08/09/2017 06:47AM]: 
1100 100  416k  100  416k    0     0  1141k      0 --:--:-- --:--:-- --:--:-- 1141k
1101  [08/09/2017 06:47AM]: ==> Making package: cjs 3.4.4-1 (Wed Aug  9 11:47:50 UTC 2017)
1102  [08/09/2017 06:47AM]: Packages (45) damageproto-1.2.1-3  dbus-1.10.18-1  fixesproto-5.0+9+g4292ec1-1  fontconfig-2.12.4-1  freetype2-2.8-2  graphite-1:1.3.10-1  harfbuzz-1.4.8-1  kbproto-1.0.7-1  libdrm-2.4.82-1  libedit-20170329_3.1-1  libelf-0.169-2  libglvnd-0.2.999+g4ba53457-2  libomxil-bellagio-0.9.3-1  libpciaccess-0.13.5-1  libpng-1.6.31-1  libtxc_dxtn-1.0.1-6  libunwind-1.2.1-1  libx11-1.6.5-1  libxau-1.0.8-2  libxcb-1.12-1  libxdamage-1.1.4-2  libxdmcp-1.1.2-1  libxext-1.3.3-1  libxfixes-5.0.3-1  libxml2-2.9.4+96+gfb56f80e-1  libxrender-0.9.10-1  libxshmfence-1.2-1  libxxf86vm-1.1.4-1  llvm-libs-4.0.1-5  lm_sensors-3.4.0-2  lzo-2.10-1  mesa-17.1.6-1  nspr-4.15-1  pixman-0.34.0-1  renderproto-0.11.1-3  sysfsutils-2.1.0-9  wayland-1.13.0-1  xcb-proto-1.12-3  xextproto-7.3.0-1  xf86vidmodeproto-2.3.1-3  xproto-7.0.31-1  cairo-1.14.10-1  dbus-glib-0.108-1  gobject-introspection-runtime-1.52.1-1  js38-38.8.0-3
1103  [08/09/2017 06:47AM]: Total Download Size:    40.26 MiB
1104  [08/09/2017 06:47AM]: Total Installed Size:  177.91 MiB
1105  [08/09/2017 06:47AM]: downloading libelf-0.169-2-i686.pkg.tar.xz...
1106  [08/09/2017 06:47AM]: downloading libedit-20170329_3.1-1-i686.pkg.tar.xz...
1107  [08/09/2017 06:47AM]: downloading sysfsutils-2.1.0-9-i686.pkg.tar.xz...
1108  [08/09/2017 06:47AM]: downloading lzo-2.10-1-i686.pkg.tar.xz...
1109  [08/09/2017 06:47AM]: downloading nspr-4.15-1-i686.pkg.tar.xz...
1110  [08/09/2017 06:47AM]: downloading dbus-1.10.18-1-i686.pkg.tar.xz...
1111  [08/09/2017 06:47AM]: downloading libpng-1.6.31-1-i686.pkg.tar.xz...
1112  [08/09/2017 06:47AM]: downloading xcb-proto-1.12-3-any.pkg.tar.xz...
1113  [08/09/2017 06:47AM]: downloading xproto-7.0.31-1-any.pkg.tar.xz...
1114  [08/09/2017 06:47AM]: downloading libxdmcp-1.1.2-1-i686.pkg.tar.xz...
1115  [08/09/2017 06:47AM]: downloading libxcb-1.12-1-i686.pkg.tar.xz...
1116  [08/09/2017 06:47AM]: downloading renderproto-0.11.1-3-any.pkg.tar.xz...
1117  [08/09/2017 06:47AM]: downloading libxrender-0.9.10-1-i686.pkg.tar.xz...
1118  [08/09/2017 06:47AM]: downloading xextproto-7.3.0-1-any.pkg.tar.xz...
1119  [08/09/2017 06:47AM]: downloading graphite-1:1.3.10-1-i686.pkg.tar.xz...
1120  [08/09/2017 06:47AM]: downloading harfbuzz-1.4.8-1-i686.pkg.tar.xz...
1121  [08/09/2017 06:47AM]: downloading freetype2-2.8-2-i686.pkg.tar.xz...
1122  [08/09/2017 06:47AM]: downloading fontconfig-2.12.4-1-i686.pkg.tar.xz...
1123  [08/09/2017 06:47AM]: downloading libpciaccess-0.13.5-1-i686.pkg.tar.xz...
1124  [08/09/2017 06:47AM]: downloading libxml2-2.9.4+96+gfb56f80e-1-i686.pkg.tar.xz...
1125  [08/09/2017 06:47AM]: downloading wayland-1.13.0-1-i686.pkg.tar.xz...
1126  [08/09/2017 06:47AM]: downloading xf86vidmodeproto-2.3.1-3-any.pkg.tar.xz...
1127  [08/09/2017 06:47AM]: downloading libxxf86vm-1.1.4-1-i686.pkg.tar.xz...
1128  [08/09/2017 06:47AM]: downloading fixesproto-5.0+9+g4292ec1-1-any.pkg.tar.xz...
1129  [08/09/2017 06:47AM]: downloading libxfixes-5.0.3-1-i686.pkg.tar.xz...
1130  [08/09/2017 06:47AM]: downloading damageproto-1.2.1-3-any.pkg.tar.xz...
1131  [08/09/2017 06:47AM]: downloading libxdamage-1.1.4-2-i686.pkg.tar.xz...
1132  [08/09/2017 06:47AM]: downloading libxshmfence-1.2-1-i686.pkg.tar.xz...
1133  [08/09/2017 06:47AM]: downloading libomxil-bellagio-0.9.3-1-i686.pkg.tar.xz...
1134  [08/09/2017 06:47AM]: downloading libtxc_dxtn-1.0.1-6-i686.pkg.tar.xz...
1135  [08/09/2017 06:47AM]: downloading libunwind-1.2.1-1-i686.pkg.tar.xz...
1136  [08/09/2017 06:47AM]: downloading llvm-libs-4.0.1-5-i686.pkg.tar.xz...
1137  [08/09/2017 06:47AM]: downloading lm_sensors-3.4.0-2-i686.pkg.tar.xz...
1138  [08/09/2017 06:47AM]: downloading libglvnd-0.2.999+g4ba53457-2-i686.pkg.tar.xz...
1139  [08/09/2017 06:47AM]: downloading gobject-introspection-runtime-1.52.1-1-i686.pkg.tar.xz...
1140  [08/09/2017 06:47AM]: downloading dbus-glib-0.108-1-i686.pkg.tar.xz...
1141  [08/09/2017 06:48AM]: Total Download Size:    19.17 MiB
1142  [08/09/2017 06:48AM]: Total Installed Size:  143.65 MiB
1143  [08/09/2017 06:48AM]: downloading glib2-docs-2.52.3-1-i686.pkg.tar.xz...
1144  [08/09/2017 06:48AM]: downloading perl-xml-parser-2.44-4-i686.pkg.tar.xz...
1145  [08/09/2017 06:48AM]: downloading intltool-0.51.0-3-any.pkg.tar.xz...
1146  [08/09/2017 06:48AM]: downloading yelp-xsl-3.20.1-2-any.pkg.tar.xz...
1147  [08/09/2017 06:48AM]: downloading libxslt-1.1.29+42+gac341cbd-1-i686.pkg.tar.xz...
1148  [08/09/2017 06:48AM]: downloading python2-2.7.13-4-i686.pkg.tar.xz...
1149  [08/09/2017 06:48AM]: downloading itstool-2.0.2+5+g676f3f7-2-any.pkg.tar.xz...
1150  [08/09/2017 06:48AM]: downloading yelp-tools-3.18.0+1+g193c2bd-1-any.pkg.tar.xz...
1151  [08/09/2017 06:48AM]: downloading docbook-xml-4.5-6-any.pkg.tar.xz...
1152  [08/09/2017 06:48AM]: downloading docbook-xsl-1.79.2-3-any.pkg.tar.xz...
1153  [08/09/2017 06:48AM]: downloading boost-libs-1.64.0-4-i686.pkg.tar.xz...
1154  [08/09/2017 06:48AM]: downloading source-highlight-3.1.8-12-i686.pkg.tar.xz...
1155  [08/09/2017 06:48AM]: downloading gtk-doc-1.25+33+g567353f-1-any.pkg.tar.xz...
1156  [08/09/2017 06:48AM]: downloading gnome-common-3.18.0-2-any.pkg.tar.xz...
1157  [08/09/2017 06:48AM]: downloading python-markupsafe-1.0-1-i686.pkg.tar.xz...
1158  [08/09/2017 06:48AM]: downloading python-beaker-1.8.1-2-any.pkg.tar.xz...
1159  [08/09/2017 06:48AM]: downloading python-pyparsing-2.2.0-1-any.pkg.tar.xz...
1160  [08/09/2017 06:48AM]: downloading python-six-1.10.0-3-any.pkg.tar.xz...
1161  [08/09/2017 06:48AM]: downloading python-packaging-16.8-2-any.pkg.tar.xz...
1162  [08/09/2017 06:48AM]: downloading python-appdirs-1.4.3-1-any.pkg.tar.xz...
1163  [08/09/2017 06:48AM]: downloading python-setuptools-1:36.2.7-1-any.pkg.tar.xz...
1164  [08/09/2017 06:48AM]: downloading python-mako-1.0.7-1-any.pkg.tar.xz...
1165  [08/09/2017 06:48AM]: downloading gobject-introspection-1.52.1-1-i686.pkg.tar.xz...
1166  [08/09/2017 06:48AM]: downloading autoconf-archive-1:2017.03.21-1-any.pkg.tar.xz...
1167  [08/09/2017 06:49AM]: checking whether the gcc linker (/usr/bin/ld -m elf_i386) supports shared libraries... yes
1168  [08/09/2017 06:49AM]: checking for ld used by g++... /usr/bin/ld -m elf_i386
1169  [08/09/2017 06:49AM]: checking if the linker (/usr/bin/ld -m elf_i386) is GNU ld... yes
1170  [08/09/2017 06:50AM]:                  from /usr/lib/gcc/i686-pc-linux-gnu/7.1.1/include-fixed/limits.h:194,
1171  [08/09/2017 06:50AM]:                  from /usr/lib/gcc/i686-pc-linux-gnu/7.1.1/include-fixed/syslimits.h:7,
1172  [08/09/2017 06:50AM]:                  from /usr/lib/gcc/i686-pc-linux-gnu/7.1.1/include-fixed/limits.h:34,
1173  [08/09/2017 06:50AM]:                  from /tmp/g-ir-cpp-zb3yg65i.c:4:
1174  [08/09/2017 06:50AM]: /usr/lib/gcc/i686-pc-linux-gnu/7.1.1/include/stddef.h:435: syntax error, unexpected identifier in   __float128 __max_align_f128 __attribute__((__aligned__(__alignof(__float128)))); at __float128
1175  [08/09/2017 06:50AM]:                  from /tmp/g-ir-cpp-qhcfzkma.c:4:
1176  [08/09/2017 06:50AM]:                  from /tmp/g-ir-cpp-cy1y1veu.c:4:
1177  [08/09/2017 06:50AM]:                  from /tmp/g-ir-cpp-s_mnvqwz.c:4:
1178  [08/09/2017 06:50AM]: ==> Finished making: cjs 3.4.4-1 (Wed Aug  9 11:50:53 UTC 2017)