Build Record

Build Number: 7134

Transaction: 3325
Package: zfs
Version: 1:0.7.1-1
Start: 09/07/2017 02:49PM
Finish: 09/07/2017 02:50PM
Result: failed
 zfs/PKGBUILD CHANGED

Build Log

 1 [09/07/2017 02:49PM]: [\^/\^/^\^/^\^/\^/\^/^\^/^\^/]  SETTING UP ENVIRONMENT  [\^/\^/^\^/^\^/\^/\^/^\^/^\^/]
 2  [09/07/2017 02:49PM]: [\^/\^/^\^/^\^/\^/\^/^\^/^\^/]  ADDING UPSTREAM PGP KEYS TO KEYRING  [\^/\^/^\^/^\^/\^/\^/^\^/^\^/]
 3  [09/07/2017 02:49PM]: gpg: WARNING: unsafe ownership on homedir /tmp/antbs/.gnupg
 4  [09/07/2017 02:49PM]: gpg: keybox /tmp/antbs/.gnupg/pubring.kbx created
 5  [09/07/2017 02:49PM]: key 23EFEFE93C4CFFFE:
 6  [09/07/2017 02:49PM]: 1 signature not checked due to a missing key
 7  [09/07/2017 02:49PM]: gpg: /tmp/antbs/.gnupg/trustdb.gpg: trustdb created
 8  [09/07/2017 02:49PM]: gpg: key 23EFEFE93C4CFFFE: public key Italo A. Casas <[email protected]> imported
 9  [09/07/2017 02:49PM]: 8 signatures not checked due to missing keys
10  [09/07/2017 02:49PM]: gpg: key B63B535A4C206CA9: public key Evan Lucas <[email protected]> imported
11  [09/07/2017 02:49PM]: 14 signatures not checked due to missing keys
12  [09/07/2017 02:49PM]: gpg: key E73BC641CC11F4C8: public key Myles Borins <[email protected]> imported
13  [09/07/2017 02:49PM]: gpg: key C273792F7D83545D: public key Rod Vagg <[email protected]> imported
14  [09/07/2017 02:49PM]: gpg: key C97EC7A07EDE3FC1: public key keybase.io/jasnell <[email protected]> imported
15  [09/07/2017 02:49PM]: gpg: key 09FE44734EB7990E: public key Jeremiah Senkpiel <[email protected]> imported
16  [09/07/2017 02:49PM]: gpg: key 7434390BDBE9B9C5: public key Colin Ihrig <[email protected]> imported
17  [09/07/2017 02:49PM]: gpg: key 61B7B526D98F0353: public key Mozilla Software Releases <[email protected]> imported
18  [09/07/2017 02:49PM]: gpg: key 61B7B526D98F0353: Mozilla Software Releases <[email protected]> not changed
19  [09/07/2017 02:49PM]: gpg: no ultimately trusted keys found
20  [09/07/2017 02:49PM]: gpg: Total number processed: 9
21  [09/07/2017 02:49PM]: gpg:               imported: 8
22  [09/07/2017 02:49PM]: gpg:              unchanged: 1
23  [09/07/2017 02:49PM]: [\^/\^/^\^/^\^/\^/\^/^\^/^\^/]  SYNCING REPO DATABASES  [\^/\^/^\^/^\^/\^/\^/^\^/^\^/]
24  [09/07/2017 02:49PM]: :: Synchronizing package databases...
25  [09/07/2017 02:49PM]: downloading antergos-staging.db...
26  [09/07/2017 02:49PM]: downloading antergos.db...
27  [09/07/2017 02:49PM]: downloading community.db...
28  [09/07/2017 02:49PM]: :: Starting full system upgrade...
29  [09/07/2017 02:49PM]: looking for conflicting packages...
30  [09/07/2017 02:49PM]: Packages (2) pacman-mirrorlist-20170907-1  sudo-1.8.21.p2-1
31  [09/07/2017 02:49PM]: Total Installed Size:  4.06 MiB
32  [09/07/2017 02:49PM]: Net Upgrade Size:      0.00 MiB
33  [09/07/2017 02:49PM]: :: Proceed with installation? [Y/n]
34  [09/07/2017 02:49PM]: checking package integrity...
35  [09/07/2017 02:49PM]: checking for file conflicts...
36  [09/07/2017 02:49PM]: :: Processing package changes...
37  [09/07/2017 02:49PM]: upgrading pacman-mirrorlist...
38  [09/07/2017 02:49PM]: warning: /etc/pacman.d/mirrorlist installed as /etc/pacman.d/mirrorlist.pacnew
39  [09/07/2017 02:49PM]: :: Running post-transaction hooks...
40  [09/07/2017 02:49PM]: (1/2) Creating temporary files...
41  [09/07/2017 02:49PM]: (2/2) Arming ConditionNeedsUpdate...
42  [09/07/2017 02:49PM]: [\^/\^/^\^/^\^/\^/\^/^\^/^\^/]  TRYING BUILD  [\^/\^/^\^/^\^/\^/\^/^\^/^\^/]
43  [09/07/2017 02:49PM]: [\^/\^/^\^/^\^/\^/\^/^\^/^\^/]  UPDATING SOURCE CHECKSUMS  [\^/\^/^\^/^\^/\^/\^/^\^/^\^/]
44  [09/07/2017 02:50PM]:   -> Downloading zfs-0.7.1.zip...
45  [09/07/2017 02:50PM]:   % Total    % Received % Xferd  Average Speed   Time    Time     Time  Current
46  [09/07/2017 02:50PM]:                                  Dload  Upload   Total   Spent    Left  Speed
47  [09/07/2017 02:50PM]: 
48   0     0    0     0    0     0      0      0 --:--:-- --:--:-- --:--:--     0
49   0     0    0     0    0     0      0      0 --:--:-- --:--:-- --:--:--     0
50 100   122    0   122    0     0    122      0 --:--:-- --:--:-- --:--:--   787
51  [09/07/2017 02:50PM]: 
52 100 6541k  100 6541k    0     0  6541k      0  0:00:01 --:--:--  0:00:01 6541k
53  [09/07/2017 02:50PM]: ==> Generating checksums for source files...
54  [09/07/2017 02:50PM]: ==> Making package: zfs 0.7.1.41210-1 (Thu Sep  7 19:50:00 UTC 2017)
55  [09/07/2017 02:50PM]: ==> Checking runtime dependencies...
56  [09/07/2017 02:50PM]: ==> Installing missing dependencies...
57  [09/07/2017 02:50PM]: error: target not found: spl=0.7.1.41210
58  [09/07/2017 02:50PM]: error: target not found: zfs-utils=0.7.1.41210
59  [09/07/2017 02:50PM]: ==> ERROR: pacman failed to install missing dependencies.
60  [09/07/2017 02:50PM]: rm: cannot remove **.pkg.**: No such file or directory
61  [09/07/2017 02:50PM]: [\^/\^/^\^/^\^/\^/\^/^\^/^\^/]  BUILD FAILED  [\^/\^/^\^/^\^/\^/\^/^\^/^\^/]