Build Record

Build Number: 7148

Transaction: 3339
Package: zfs
Version: 1:0.7.1-1
Start: 09/09/2017 10:31AM
Finish: 09/09/2017 10:32AM
Result: failed
 zfs/PKGBUILD CHANGED

Build Log

 1 [09/09/2017 10:31AM]: [\^/\^/^\^/^\^/\^/\^/^\^/^\^/]  SETTING UP ENVIRONMENT  [\^/\^/^\^/^\^/\^/\^/^\^/^\^/]
 2  [09/09/2017 10:31AM]: [\^/\^/^\^/^\^/\^/\^/^\^/^\^/]  ADDING UPSTREAM PGP KEYS TO KEYRING  [\^/\^/^\^/^\^/\^/\^/^\^/^\^/]
 3  [09/09/2017 10:31AM]: gpg: WARNING: unsafe ownership on homedir /tmp/antbs/.gnupg
 4  [09/09/2017 10:31AM]: gpg: keybox /tmp/antbs/.gnupg/pubring.kbx created
 5  [09/09/2017 10:31AM]: key 23EFEFE93C4CFFFE:
 6  [09/09/2017 10:31AM]: 1 signature not checked due to a missing key
 7  [09/09/2017 10:31AM]: gpg: /tmp/antbs/.gnupg/trustdb.gpg: trustdb created
 8  [09/09/2017 10:31AM]: gpg: key 23EFEFE93C4CFFFE: public key Italo A. Casas <[email protected]> imported
 9  [09/09/2017 10:31AM]: 8 signatures not checked due to missing keys
10  [09/09/2017 10:31AM]: gpg: key B63B535A4C206CA9: public key Evan Lucas <[email protected]> imported
11  [09/09/2017 10:31AM]: 14 signatures not checked due to missing keys
12  [09/09/2017 10:31AM]: gpg: key E73BC641CC11F4C8: public key Myles Borins <[email protected]> imported
13  [09/09/2017 10:31AM]: gpg: key C273792F7D83545D: public key Rod Vagg <[email protected]> imported
14  [09/09/2017 10:31AM]: gpg: key C97EC7A07EDE3FC1: public key keybase.io/jasnell <[email protected]> imported
15  [09/09/2017 10:31AM]: gpg: key 09FE44734EB7990E: public key Jeremiah Senkpiel <[email protected]> imported
16  [09/09/2017 10:31AM]: gpg: key 7434390BDBE9B9C5: public key Colin Ihrig <[email protected]> imported
17  [09/09/2017 10:31AM]: gpg: key 61B7B526D98F0353: public key Mozilla Software Releases <[email protected]> imported
18  [09/09/2017 10:31AM]: gpg: key 61B7B526D98F0353: Mozilla Software Releases <[email protected]> not changed
19  [09/09/2017 10:31AM]: gpg: no ultimately trusted keys found
20  [09/09/2017 10:31AM]: gpg: Total number processed: 9
21  [09/09/2017 10:31AM]: gpg:               imported: 8
22  [09/09/2017 10:31AM]: gpg:              unchanged: 1
23  [09/09/2017 10:31AM]: [\^/\^/^\^/^\^/\^/\^/^\^/^\^/]  SYNCING REPO DATABASES  [\^/\^/^\^/^\^/\^/\^/^\^/^\^/]
24  [09/09/2017 10:31AM]: :: Synchronizing package databases...
25  [09/09/2017 10:31AM]: downloading antergos-staging.db...
26  [09/09/2017 10:31AM]: downloading antergos.db...
27  [09/09/2017 10:31AM]: downloading community.db...
28  [09/09/2017 10:31AM]: :: Starting full system upgrade...
29  [09/09/2017 10:31AM]: looking for conflicting packages...
30  [09/09/2017 10:31AM]: Packages (9) binutils-2.29.0-1  expat-2.2.4-1  fakeroot-1.22-1  gcc-7.2.0-2  gcc-libs-7.2.0-2  glibc-2.26-3  libtool-2.4.6+40+g6ca5e224-1  linux-api-headers-4.12.7-1  ncurses-6.0+20170902-1
31  [09/09/2017 10:31AM]: Total Download Size:    29.20 MiB
32  [09/09/2017 10:31AM]: Total Installed Size:  286.18 MiB
33  [09/09/2017 10:31AM]: Net Upgrade Size:        1.46 MiB
34  [09/09/2017 10:31AM]: :: Proceed with installation? [Y/n]
35  [09/09/2017 10:31AM]: downloading gcc-7.2.0-2-x86_64.pkg.tar.xz...
36  [09/09/2017 10:31AM]: checking package integrity...
37  [09/09/2017 10:31AM]: checking for file conflicts...
38  [09/09/2017 10:31AM]: :: Processing package changes...
39  [09/09/2017 10:31AM]: upgrading linux-api-headers...
40  [09/09/2017 10:31AM]: warning: /etc/locale.gen installed as /etc/locale.gen.pacnew
41  [09/09/2017 10:32AM]: :: Running post-transaction hooks...
42  [09/09/2017 10:32AM]: (1/3) Creating temporary files...
43  [09/09/2017 10:32AM]: (2/3) Arming ConditionNeedsUpdate...
44  [09/09/2017 10:32AM]: (3/3) Updating the info directory file...
45  [09/09/2017 10:32AM]: [\^/\^/^\^/^\^/\^/\^/^\^/^\^/]  TRYING BUILD  [\^/\^/^\^/^\^/\^/\^/^\^/^\^/]
46  [09/09/2017 10:32AM]: [\^/\^/^\^/^\^/\^/\^/^\^/^\^/]  UPDATING SOURCE CHECKSUMS  [\^/\^/^\^/^\^/\^/\^/^\^/^\^/]
47  [09/09/2017 10:32AM]:   -> Downloading zfs-0.7.1.zip...
48  [09/09/2017 10:32AM]:   % Total    % Received % Xferd  Average Speed   Time    Time     Time  Current
49  [09/09/2017 10:32AM]:                                  Dload  Upload   Total   Spent    Left  Speed
50  [09/09/2017 10:32AM]: 
51   0     0    0     0    0     0      0      0 --:--:-- --:--:-- --:--:--     0
52 100   122    0   122    0     0    122      0 --:--:-- --:--:-- --:--:--  1008
53  [09/09/2017 10:32AM]: 
54   0     0    0     0    0     0      0      0 --:--:-- --:--:-- --:--:--     0
55 100 6541k    0 6541k    0     0  6541k      0 --:--:-- --:--:-- --:--:-- 12.9M
56  [09/09/2017 10:32AM]: ==> Generating checksums for source files...
57  [09/09/2017 10:32AM]: ==> Making package: zfs 0.7.1-1 (Sat Sep  9 15:32:08 UTC 2017)
58  [09/09/2017 10:32AM]: ==> Checking runtime dependencies...
59  [09/09/2017 10:32AM]: ==> Installing missing dependencies...
60  [09/09/2017 10:32AM]: error: target not found: spl=0.7.1
61  [09/09/2017 10:32AM]: error: target not found: zfs-utils=0.7.1
62  [09/09/2017 10:32AM]: ==> ERROR: pacman failed to install missing dependencies.
63  [09/09/2017 10:32AM]: rm: cannot remove **.pkg.**: No such file or directory
64  [09/09/2017 10:32AM]: [\^/\^/^\^/^\^/\^/\^/^\^/^\^/]  BUILD FAILED  [\^/\^/^\^/^\^/\^/\^/^\^/^\^/]