Build Record

Build Number: 7348

Transaction: 3499
Package: brave
Version: 0.17.19dev-1
Start: 10/10/2017 09:14AM
Finish: 10/10/2017 09:18AM
Result: failed
 brave/PKGBUILD CHANGED

Build Log

  1 [10/10/2017 09:14AM]: [\^/\^/^\^/^\^/\^/\^/^\^/^\^/]  SETTING UP ENVIRONMENT  [\^/\^/^\^/^\^/\^/\^/^\^/^\^/]
  2  [10/10/2017 09:14AM]: [\^/\^/^\^/^\^/\^/\^/^\^/^\^/]  ADDING UPSTREAM PGP KEYS TO KEYRING  [\^/\^/^\^/^\^/\^/\^/^\^/^\^/]
  3  [10/10/2017 09:14AM]: gpg: WARNING: unsafe ownership on homedir /tmp/antbs/.gnupg
  4  [10/10/2017 09:14AM]: gpg: keybox /tmp/antbs/.gnupg/pubring.kbx created
  5  [10/10/2017 09:14AM]: key 23EFEFE93C4CFFFE:
  6  [10/10/2017 09:14AM]: 1 signature not checked due to a missing key
  7  [10/10/2017 09:14AM]: gpg: /tmp/antbs/.gnupg/trustdb.gpg: trustdb created
  8  [10/10/2017 09:14AM]: gpg: key 23EFEFE93C4CFFFE: public key Italo A. Casas <[email protected]> imported
  9  [10/10/2017 09:15AM]: 8 signatures not checked due to missing keys
 10  [10/10/2017 09:15AM]: gpg: key B63B535A4C206CA9: public key Evan Lucas <[email protected]> imported
 11  [10/10/2017 09:15AM]: 14 signatures not checked due to missing keys
 12  [10/10/2017 09:15AM]: gpg: key E73BC641CC11F4C8: public key Myles Borins <[email protected]> imported
 13  [10/10/2017 09:15AM]: gpg: key C273792F7D83545D: public key Rod Vagg <[email protected]> imported
 14  [10/10/2017 09:15AM]: gpg: key C97EC7A07EDE3FC1: public key keybase.io/jasnell <[email protected]> imported
 15  [10/10/2017 09:15AM]: gpg: key 09FE44734EB7990E: public key Jeremiah Senkpiel <[email protected]> imported
 16  [10/10/2017 09:15AM]: gpg: key 7434390BDBE9B9C5: public key Colin Ihrig <[email protected]> imported
 17  [10/10/2017 09:15AM]: gpg: key 61B7B526D98F0353: public key Mozilla Software Releases <[email protected]> imported
 18  [10/10/2017 09:15AM]: gpg: key 61B7B526D98F0353: Mozilla Software Releases <[email protected]> not changed
 19  [10/10/2017 09:15AM]: gpg: no ultimately trusted keys found
 20  [10/10/2017 09:15AM]: gpg: Total number processed: 9
 21  [10/10/2017 09:15AM]: gpg:               imported: 8
 22  [10/10/2017 09:15AM]: gpg:              unchanged: 1
 23  [10/10/2017 09:15AM]: [\^/\^/^\^/^\^/\^/\^/^\^/^\^/]  SYNCING REPO DATABASES  [\^/\^/^\^/^\^/\^/\^/^\^/^\^/]
 24  [10/10/2017 09:15AM]: :: Synchronizing package databases...
 25  [10/10/2017 09:15AM]: downloading antergos-staging.db...
 26  [10/10/2017 09:15AM]: downloading antergos.db...
 27  [10/10/2017 09:15AM]: downloading community.db...
 28  [10/10/2017 09:15AM]: :: Starting full system upgrade...
 29  [10/10/2017 09:15AM]: looking for conflicting packages...
 30  [10/10/2017 09:15AM]: Packages (5) device-mapper-2.02.175-1  libsystemd-235.0-1  pambase-20171006-1  systemd-235.0-1  systemd-sysvcompat-235.0-1
 31  [10/10/2017 09:15AM]: Total Download Size:    4.88 MiB
 32  [10/10/2017 09:15AM]: Total Installed Size:  20.64 MiB
 33  [10/10/2017 09:15AM]: Net Upgrade Size:       0.16 MiB
 34  [10/10/2017 09:15AM]: :: Proceed with installation? [Y/n]
 35  [10/10/2017 09:15AM]: downloading libsystemd-235.0-1-x86_64.pkg.tar.xz...
 36  [10/10/2017 09:15AM]: downloading device-mapper-2.02.175-1-x86_64.pkg.tar.xz...
 37  [10/10/2017 09:15AM]: downloading pambase-20171006-1-any.pkg.tar.xz...
 38  [10/10/2017 09:15AM]: downloading systemd-235.0-1-x86_64.pkg.tar.xz...
 39  [10/10/2017 09:15AM]: downloading systemd-sysvcompat-235.0-1-x86_64.pkg.tar.xz...
 40  [10/10/2017 09:15AM]: checking package integrity...
 41  [10/10/2017 09:15AM]: checking for file conflicts...
 42  [10/10/2017 09:15AM]: :: Processing package changes...
 43  [10/10/2017 09:15AM]: upgrading systemd-sysvcompat...
 44  [10/10/2017 09:15AM]: :: Running post-transaction hooks...
 45  [10/10/2017 09:15AM]: (1/4) Updating udev hardware database...
 46  [10/10/2017 09:15AM]: (2/4) Updating system user accounts...
 47  [10/10/2017 09:15AM]: (3/4) Creating temporary files...
 48  [10/10/2017 09:15AM]: (4/4) Arming ConditionNeedsUpdate...
 49  [10/10/2017 09:15AM]: [\^/\^/^\^/^\^/\^/\^/^\^/^\^/]  TRYING BUILD  [\^/\^/^\^/^\^/\^/\^/^\^/^\^/]
 50  [10/10/2017 09:15AM]: [\^/\^/^\^/^\^/\^/\^/^\^/^\^/]  UPDATING SOURCE CHECKSUMS  [\^/\^/^\^/^\^/\^/\^/^\^/^\^/]
 51  [10/10/2017 09:15AM]: ==> Generating checksums for source files...
 52  [10/10/2017 09:15AM]: ==> Making package: brave 0.17.19dev-1 (Tue Oct 10 14:15:27 UTC 2017)
 53  [10/10/2017 09:15AM]: ==> Checking runtime dependencies...
 54  [10/10/2017 09:15AM]: ==> Installing missing dependencies...
 55  [10/10/2017 09:15AM]: :: There are 11 providers available for ttf-font:
 56  [10/10/2017 09:15AM]:    1) ttf-google-fonts-typewolf
 57  [10/10/2017 09:15AM]:    2) noto-fonts  3) noto-fonts-extra  4) ttf-bitstream-vera  5) ttf-croscore  6) ttf-dejavu  7) ttf-freefont  8) ttf-linux-libertine
 58  [10/10/2017 09:15AM]:    9) ttf-droid  10) ttf-liberation  11) ttf-ubuntu-font-family
 59  [10/10/2017 09:15AM]: Enter a number (default=1):
 60  [10/10/2017 09:15AM]: warning: dependency cycle detected:
 61  [10/10/2017 09:15AM]: warning: harfbuzz will be installed before its freetype2 dependency
 62  [10/10/2017 09:15AM]: Packages (70) atk-2.26.0-1  avahi-0.7-1  cairo-1.15.8-2  compositeproto-0.4.2-3  damageproto-1.2.1-3  dbus-glib-0.108-1  fixesproto-5.0+9+g4292ec1-1  fontconfig-2.12.6-1  freetype2-2.8.1-1  gdk-pixbuf2-2.36.11-1  graphite-1:1.3.10-1  gtk-update-icon-cache-3.22.24-1  harfbuzz-1.5.1-1  hicolor-icon-theme-0.15-1  inputproto-2.3.2-1  jasper-2.0.14-1  js-24.2.0-4  kbproto-1.0.7-1  libcroco-0.6.12+4+g9ad7287-1  libcups-2.2.4-2  libdaemon-0.14-3  libdatrie-0.2.10-2  libfontenc-1.1.3-1  libjpeg-turbo-1.5.2-1  libpng-1.6.34-2  librsvg-2:2.40.19-1  libthai-0.1.26-1  libtiff-4.0.8-2  libx11-1.6.5-1  libxau-1.0.8-2  libxcb-1.12-1  libxcomposite-0.4.4-2  libxcursor-1.1.14-2  libxdamage-1.1.4-2  libxdmcp-1.1.2-1  libxext-1.3.3-1  libxfixes-5.0.3-1  libxft-2.3.2-1  libxi-1.7.9-1  libxinerama-1.1.3-2  libxml2-2.9.5+6+g07e227ed-1  libxrandr-1.5.1-1  libxrender-0.9.10-1  lzo-2.10-1  nspr-4.17-1  pango-1.40.12-1  pixman-0.34.0-1  polkit-0.113+29+g3272a98-1  randrproto-1.5.0-1  recordproto-1.14.2-2  renderproto-0.11.1-3  scrnsaverproto-1.2.2-2  shared-mime-info-1.9-1  xcb-proto-1.12-3  xextproto-7.3.0-1  xineramaproto-1.2.1-3  xorg-fonts-encodings-1.0.4-4  xorg-mkfontdir-1.0.7-8  xorg-mkfontscale-1.1.2-1  xproto-7.0.31-1  alsa-lib-1.1.4.1-2  desktop-file-utils-0.23-1  gconf-3.2.6-5  gtk2-2.24.31-1  libgnome-keyring-3.12.0-2  libnotify-0.7.7-1  libxss-1.2.2-2  libxtst-1.2.3-1  nss-3.33-2  ttf-google-fonts-typewolf-17.2.r35eb2d7-1
 63  [10/10/2017 09:15AM]: Total Download Size:     3.87 MiB
 64  [10/10/2017 09:15AM]: Total Installed Size:  248.63 MiB
 65  [10/10/2017 09:15AM]: downloading atk-2.26.0-1-x86_64.pkg.tar.xz...
 66  [10/10/2017 09:15AM]: downloading cairo-1.15.8-2-x86_64.pkg.tar.xz...
 67  [10/10/2017 09:15AM]: downloading libxi-1.7.9-1-x86_64.pkg.tar.xz...
 68  [10/10/2017 09:15AM]: downloading js-24.2.0-4-x86_64.pkg.tar.xz...
 69  [10/10/2017 09:15AM]: Optional dependencies for harfbuzz
 70  [10/10/2017 09:15AM]:     cairo: hb-view program [pending]
 71  [10/10/2017 09:15AM]: warning: directory permissions differ on /var/
 72  [10/10/2017 09:15AM]: filesystem: 777  package: 755
 73  [10/10/2017 09:15AM]:   Fontconfig configuration is done via /etc/fonts/conf.avail and conf.d.
 74  [10/10/2017 09:15AM]:   Read /etc/fonts/conf.d/README for more information.
 75  [10/10/2017 09:15AM]:   Configuration via /etc/fonts/local.conf is still possible,
 76  [10/10/2017 09:15AM]:   but is no longer recommended for options available in conf.avail.
 77  [10/10/2017 09:15AM]:   Main systemwide configuration should be done by symlinks
 78  [10/10/2017 09:15AM]:   (especially for autohinting, sub-pixel and lcdfilter):
 79  [10/10/2017 09:15AM]:   ln -s ../conf.avail/XX-foo.conf
 80  [10/10/2017 09:15AM]:   Check also https://wiki.archlinux.org/index.php/Font_Configuration
 81  [10/10/2017 09:15AM]:   and https://wiki.archlinux.org/index.php/Fonts.
 82  [10/10/2017 09:15AM]: Rebuilding fontconfig cache... done.
 83  [10/10/2017 09:15AM]: Optional dependencies for libxcursor
 84  [10/10/2017 09:15AM]:     gnome-themes-standard: fallback icon theme
 85  [10/10/2017 09:15AM]: installing compositeproto...
 86  [10/10/2017 09:15AM]: installing shared-mime-info...
 87  [10/10/2017 09:16AM]: Optional dependencies for libtiff
 88  [10/10/2017 09:16AM]:     freeglut: for using tiffgt
 89  [10/10/2017 09:16AM]: Optional dependencies for avahi
 90  [10/10/2017 09:16AM]:     gtk3: avahi-discover, avahi-discover-standalone, bshell, bssh, bvnc
 91  [10/10/2017 09:16AM]:     gtk2: gtk2 bindings [pending]
 92  [10/10/2017 09:16AM]:     pygtk: avahi-bookmarks
 93  [10/10/2017 09:16AM]:     python2-twisted: avahi-bookmarks
 94  [10/10/2017 09:16AM]:     nss-mdns: NSS support for mDNS
 95  [10/10/2017 09:16AM]:     python-gobject: avahi-discover
 96  [10/10/2017 09:16AM]:     python-dbus: avahi-discover
 97  [10/10/2017 09:16AM]: Optional dependencies for jasper
 98  [10/10/2017 09:16AM]:     jasper-doc: documentation
 99  [10/10/2017 09:16AM]: installing hicolor-icon-theme...
100  [10/10/2017 09:16AM]: installing gtk-update-icon-cache...
101  [10/10/2017 09:16AM]: installing desktop-file-utils...
102  [10/10/2017 09:16AM]: Optional dependencies for gtk2
103  [10/10/2017 09:16AM]:     gnome-themes-standard: Default widget theme
104  [10/10/2017 09:16AM]:     adwaita-icon-theme: Default icon theme
105  [10/10/2017 09:16AM]: Optional dependencies for alsa-lib
106  [10/10/2017 09:16AM]:     python2: for python smixer plugin [installed]
107  [10/10/2017 09:16AM]: installing xorg-fonts-encodings...
108  [10/10/2017 09:16AM]: installing xorg-mkfontscale...
109  [10/10/2017 09:16AM]: Creating X fontdir indices... done.
110  [10/10/2017 09:16AM]: installing ttf-google-fonts-typewolf...
111  [10/10/2017 09:16AM]: installing libgnome-keyring...
112  [10/10/2017 09:16AM]: Optional dependencies for libgnome-keyring
113  [10/10/2017 09:16AM]:     gnome-keyring: key storage service (or use any other service implementing org.freedesktop.secrets)
114  [10/10/2017 09:16AM]: (1/9) Updating fontconfig cache...
115  [10/10/2017 09:16AM]: (2/9) Probing GDK-Pixbuf loader modules...
116  [10/10/2017 09:16AM]: (4/9) Probing GTK2 input method modules...
117  [10/10/2017 09:16AM]: (5/9) Updating icon theme caches...
118  [10/10/2017 09:16AM]: (7/9) Updating the desktop file MIME type cache...
119  [10/10/2017 09:16AM]: (8/9) Updating the MIME type database...
120  [10/10/2017 09:16AM]: (9/9) Updating X fontdir indices...
121  [10/10/2017 09:16AM]: Packages (7) c-ares-1.13.0-1  http-parser-2.7.1-1  libuv-1.15.0-1  nodejs-8.6.0-1  openssl-1.0-1.0.2.l-1  semver-5.4.1-1  npm-5.4.2-1
122  [10/10/2017 09:16AM]: Total Installed Size:  43.48 MiB
123  [10/10/2017 09:16AM]: Optional dependencies for openssl-1.0
124  [10/10/2017 09:16AM]:     ca-certificates [installed]
125  [10/10/2017 09:16AM]: Optional dependencies for nodejs
126  [10/10/2017 09:16AM]:     npm: nodejs package manager [pending]
127  [10/10/2017 09:16AM]: Optional dependencies for npm
128  [10/10/2017 09:16AM]:     python2: for node-gyp [installed]
129  [10/10/2017 09:16AM]:   -> Cloning browser-laptop git repo...
130  [10/10/2017 09:16AM]: Cloning into bare repository /pkg/browser-laptop...
131  [10/10/2017 09:16AM]: ==> Validating source files with md5sums...
132  [10/10/2017 09:16AM]:     brave.desktop ... Passed
133  [10/10/2017 09:16AM]:     browser-laptop ... Skipped
134  [10/10/2017 09:16AM]:   -> Creating working copy of browser-laptop git repo...
135  [10/10/2017 09:16AM]: Cloning into browser-laptop...
136  [10/10/2017 09:16AM]: Switched to a new branch makepkg
137  [10/10/2017 09:16AM]: npm WARN deprecated [email protected]: In 6.x, the babel package has been deprecated in favor of babel-cli. Check https://opencollective.com/babel to support the Babel maintainers
138  [10/10/2017 09:16AM]: npm WARN deprecated [email protected]: deprecated in favour of uglify-es
139  [10/10/2017 09:16AM]: npm WARN deprecated [email protected]: Jade has been renamed to pug, please install the latest version of pug instead of jade
140  [10/10/2017 09:16AM]: npm WARN deprecated [email protected]: to-iso-string has been deprecated, use @segment/to-iso-string instead.
141  [10/10/2017 09:16AM]: npm WARN deprecated [email protected]: Please update to minimatch 3.0.2 or higher to avoid a RegExp DoS issue
142  [10/10/2017 09:16AM]: npm WARN deprecated [email protected]: Use uuid module instead
143  [10/10/2017 09:16AM]: npm WARN deprecated [email protected]: Please update to minimatch 3.0.2 or higher to avoid a RegExp DoS issue
144  [10/10/2017 09:16AM]: npm WARN deprecated [email protected]: Deprecated.
145  [10/10/2017 09:16AM]: npm WARN deprecated [email protected]: Please update to minimatch 3.0.2 or higher to avoid a RegExp DoS issue
146  [10/10/2017 09:16AM]: npm WARN deprecated [email protected]: graceful-fs v3.0.0 and before will fail on node releases >= v7.0. Please update to [email protected]^4.0.0 as soon as possible. Use npm ls graceful-fs to find it in the tree.
147  [10/10/2017 09:17AM]: > [email protected] preinstall /pkg/src/browser-laptop/node_modules/tracking-protection
148  [10/10/2017 09:17AM]: > npm install hashset-cpp && npm install cppunitlite
149  [10/10/2017 09:17AM]: > [email protected] install /pkg/src/browser-laptop/node_modules/tracking-protection/node_modules/hashset-cpp
150  [10/10/2017 09:18AM]: make: Entering directory /pkg/src/browser-laptop/node_modules/tracking-protection/node_modules/hashset-cpp/build
151  [10/10/2017 09:18AM]:   CXX(target) Release/obj.target/hashset-cpp/addon.o
152  [10/10/2017 09:18AM]:   CXX(target) Release/obj.target/hashset-cpp/HashSetWrap.o
153  [10/10/2017 09:18AM]: ../HashSetWrap.cpp: In static member function static void HashSetWrap::HashSetWrap::New(const v8::FunctionCallbackInfo<v8::Value>&):
154  [10/10/2017 09:18AM]: ../HashSetWrap.cpp:61:59: warning: v8::Local<v8::Object> v8::Function::NewInstance(int, v8::Local<v8::Value>*) const is deprecated: Use maybe version [-Wdeprecated-declarations]
155  [10/10/2017 09:18AM]:      args.GetReturnValue().Set(cons->NewInstance(argc, argv));
156  [10/10/2017 09:18AM]:                                                            ^
157  [10/10/2017 09:18AM]: In file included from /pkg/src/.node-gyp/4.1.9/deps/v8/include/v8.h:26:0,
158  [10/10/2017 09:18AM]:                  from /pkg/src/.node-gyp/4.1.9/src/node.h:42,
159  [10/10/2017 09:18AM]:                  from ../HashSetWrap.h:9,
160  [10/10/2017 09:18AM]:                  from ../HashSetWrap.cpp:6:
161  [10/10/2017 09:18AM]: /pkg/src/.node-gyp/4.1.9/deps/v8/include/v8.h:3750:31: note: declared here
162  [10/10/2017 09:18AM]:                  Local<Object> NewInstance(int argc, Local<Value> argv[]) const);
163  [10/10/2017 09:18AM]:                                ^
164  [10/10/2017 09:18AM]: /pkg/src/.node-gyp/4.1.9/deps/v8/include/v8config.h:329:3: note: in definition of macro V8_DEPRECATED
165  [10/10/2017 09:18AM]:    declarator __attribute__((deprecated(message)))
166  [10/10/2017 09:18AM]:   CXX(target) Release/obj.target/hashset-cpp/HashSet.o
167  [10/10/2017 09:18AM]:   SOLINK_MODULE(target) Release/obj.target/hashset-cpp.node
168  [10/10/2017 09:18AM]:   COPY Release/hashset-cpp.node
169  [10/10/2017 09:18AM]: make: Leaving directory /pkg/src/browser-laptop/node_modules/tracking-protection/node_modules/hashset-cpp/build
170  [10/10/2017 09:18AM]: npm notice created a lockfile as package-lock.json. You should commit this file.
171  [10/10/2017 09:18AM]: > [email protected] install /pkg/src/browser-laptop/node_modules/tracking-protection/node_modules/cppunitlite
172  [10/10/2017 09:18AM]: make: Entering directory /pkg/src/browser-laptop/node_modules/tracking-protection/node_modules/cppunitlite/build
173  [10/10/2017 09:18AM]:   CXX(target) Release/obj.target/CppUnitLite/src/Failure.o
174  [10/10/2017 09:18AM]:   CXX(target) Release/obj.target/CppUnitLite/src/SimpleString.o
175  [10/10/2017 09:18AM]:   CXX(target) Release/obj.target/CppUnitLite/src/Test.o
176  [10/10/2017 09:18AM]:   CXX(target) Release/obj.target/CppUnitLite/src/TestResult.o
177  [10/10/2017 09:18AM]:   CXX(target) Release/obj.target/CppUnitLite/src/TestRegistry.o
178  [10/10/2017 09:18AM]:   AR(target) Release/obj.target/CppUnitLite.a
179  [10/10/2017 09:18AM]:   COPY Release/CppUnitLite.a
180  [10/10/2017 09:18AM]:   CXX(target) Release/obj.target/test/test/StackMain.o
181  [10/10/2017 09:18AM]:   CXX(target) Release/obj.target/test/test/StackTest.o
182  [10/10/2017 09:18AM]:   LINK(target) Release/test
183  [10/10/2017 09:18AM]: make: Leaving directory /pkg/src/browser-laptop/node_modules/tracking-protection/node_modules/cppunitlite/build
184  [10/10/2017 09:18AM]: npm ERR! Cannot read property pause of undefined
185  [10/10/2017 09:18AM]: npm ERR! A complete log of this run can be found in:
186  [10/10/2017 09:18AM]: npm ERR!     /pkg/src/.npm/_logs/2017-10-10T14_18_25_211Z-debug.log
187  [10/10/2017 09:18AM]: ==> ERROR: A failure occurred in build().
188  [10/10/2017 09:18AM]: rm: cannot remove **.pkg.**: No such file or directory
189  [10/10/2017 09:18AM]: [\^/\^/^\^/^\^/\^/\^/^\^/^\^/]  BUILD FAILED  [\^/\^/^\^/^\^/\^/\^/^\^/^\^/]