Build Record

Build Number: 7539

Transaction: 3655
Package: cjs
Version: 3.6.1-1
Start: 11/09/2017 08:08AM
Finish: 11/09/2017 08:15AM
Result: completed
 cjs/PKGBUILD CHANGED

Build Log

   1 [11/09/2017 08:08AM]: [\^/\^/^\^/^\^/\^/\^/^\^/^\^/]  SETTING UP ENVIRONMENT  [\^/\^/^\^/^\^/\^/\^/^\^/^\^/]
   2  [11/09/2017 08:08AM]: [\^/\^/^\^/^\^/\^/\^/^\^/^\^/]  ADDING UPSTREAM PGP KEYS TO KEYRING  [\^/\^/^\^/^\^/\^/\^/^\^/^\^/]
   3  [11/09/2017 08:08AM]: gpg: WARNING: unsafe ownership on homedir /tmp/antbs/.gnupg
   4  [11/09/2017 08:08AM]: gpg: keybox /tmp/antbs/.gnupg/pubring.kbx created
   5  [11/09/2017 08:08AM]: key 23EFEFE93C4CFFFE:
   6  [11/09/2017 08:08AM]: 1 signature not checked due to a missing key
   7  [11/09/2017 08:08AM]: gpg: /tmp/antbs/.gnupg/trustdb.gpg: trustdb created
   8  [11/09/2017 08:08AM]: gpg: key 23EFEFE93C4CFFFE: public key Italo A. Casas <[email protected]> imported
   9  [11/09/2017 08:08AM]: 8 signatures not checked due to missing keys
  10  [11/09/2017 08:08AM]: gpg: key B63B535A4C206CA9: public key Evan Lucas <[email protected]> imported
  11  [11/09/2017 08:08AM]: 14 signatures not checked due to missing keys
  12  [11/09/2017 08:08AM]: gpg: key E73BC641CC11F4C8: public key Myles Borins <[email protected]> imported
  13  [11/09/2017 08:08AM]: gpg: key C273792F7D83545D: public key Rod Vagg <[email protected]> imported
  14  [11/09/2017 08:08AM]: gpg: key C97EC7A07EDE3FC1: public key keybase.io/jasnell <[email protected]> imported
  15  [11/09/2017 08:08AM]: gpg: key 09FE44734EB7990E: public key Jeremiah Senkpiel <[email protected]> imported
  16  [11/09/2017 08:08AM]: gpg: key 7434390BDBE9B9C5: public key Colin Ihrig <[email protected]> imported
  17  [11/09/2017 08:08AM]: gpg: key 61B7B526D98F0353: public key Mozilla Software Releases <[email protected]> imported
  18  [11/09/2017 08:08AM]: gpg: key 61B7B526D98F0353: Mozilla Software Releases <[email protected]> not changed
  19  [11/09/2017 08:08AM]: gpg: no ultimately trusted keys found
  20  [11/09/2017 08:08AM]: gpg: Total number processed: 9
  21  [11/09/2017 08:08AM]: gpg:               imported: 8
  22  [11/09/2017 08:08AM]: gpg:              unchanged: 1
  23  [11/09/2017 08:08AM]: [\^/\^/^\^/^\^/\^/\^/^\^/^\^/]  SYNCING REPO DATABASES  [\^/\^/^\^/^\^/\^/\^/^\^/^\^/]
  24  [11/09/2017 08:08AM]: :: Synchronizing package databases...
  25  [11/09/2017 08:08AM]: downloading antergos-staging.db...
  26  [11/09/2017 08:08AM]: downloading antergos.db...
  27  [11/09/2017 08:08AM]: downloading community.db...
  28  [11/09/2017 08:08AM]: :: Starting full system upgrade...
  29  [11/09/2017 08:08AM]: looking for conflicting packages...
  30  [11/09/2017 08:08AM]: Total Installed Size:  37.67 MiB
  31  [11/09/2017 08:08AM]: Net Upgrade Size:       0.00 MiB
  32  [11/09/2017 08:08AM]: :: Proceed with installation? [Y/n]
  33  [11/09/2017 08:08AM]: checking package integrity...
  34  [11/09/2017 08:08AM]: checking for file conflicts...
  35  [11/09/2017 08:08AM]: :: Processing package changes...
  36  [11/09/2017 08:08AM]: :: Running post-transaction hooks...
  37  [11/09/2017 08:08AM]: (1/3) Creating temporary files...
  38  [11/09/2017 08:08AM]: (2/3) Arming ConditionNeedsUpdate...
  39  [11/09/2017 08:08AM]: (3/3) Updating the info directory file...
  40  [11/09/2017 08:08AM]: [\^/\^/^\^/^\^/\^/\^/^\^/^\^/]  i686 DETECTED  [\^/\^/^\^/^\^/\^/\^/^\^/^\^/]
  41  [11/09/2017 08:08AM]: cp: -r not specified; omitting directory /pkg/32bit
  42  [11/09/2017 08:08AM]: cp: -r not specified; omitting directory /pkg/32build
  43  [11/09/2017 08:08AM]: [\^/\^/^\^/^\^/\^/\^/^\^/^\^/]  TRYING BUILD  [\^/\^/^\^/^\^/\^/\^/^\^/^\^/]
  44  [11/09/2017 08:08AM]: [\^/\^/^\^/^\^/\^/\^/^\^/^\^/]  UPDATING SOURCE CHECKSUMS  [\^/\^/^\^/^\^/\^/\^/^\^/^\^/]
  45  [11/09/2017 08:08AM]:   -> Downloading cjs-3.6.1.tar.gz...
  46  [11/09/2017 08:08AM]:   % Total    % Received % Xferd  Average Speed   Time    Time     Time  Current
  47  [11/09/2017 08:08AM]:                                  Dload  Upload   Total   Spent    Left  Speed
  48  [11/09/2017 08:08AM]: 
  49   0     0    0     0    0     0      0      0 --:--:-- --:--:-- --:--:--     0
  50 100   120    0   120    0     0    120      0 --:--:-- --:--:-- --:--:--   851
  51  [11/09/2017 08:08AM]: 
  52   0     0    0     0    0     0      0      0 --:--:-- --:--:-- --:--:--     0
  53 100  416k    0  416k    0     0   416k      0 --:--:-- --:--:-- --:--:-- 1476k
  54  [11/09/2017 08:08AM]: ==> Generating checksums for source files...
  55  [11/09/2017 08:08AM]: ==> Making package: cjs 3.6.1-1 (Thu Nov  9 14:08:33 UTC 2017)
  56  [11/09/2017 08:08AM]: ==> Checking runtime dependencies...
  57  [11/09/2017 08:08AM]: ==> Installing missing dependencies...
  58  [11/09/2017 08:08AM]: warning: dependency cycle detected:
  59  [11/09/2017 08:08AM]: warning: harfbuzz will be installed before its freetype2 dependency
  60  [11/09/2017 08:08AM]: Packages (23) fontconfig-2.12.6-1  freetype2-2.8.1-1  graphite-1:1.3.10-1  harfbuzz-1.6.3-1  kbproto-1.0.7-1  libpng-1.6.34-2  libx11-1.6.5-1  libxau-1.0.8-2  libxcb-1.12-1  libxdmcp-1.1.2-1  libxext-1.3.3-1  libxrender-0.9.10-1  lzo-2.10-1  nspr-4.17-1  pixman-0.34.0-1  renderproto-0.11.1-3  xcb-proto-1.12-3  xextproto-7.3.0-1  xproto-7.0.31-1  cairo-1.15.8-2  dbus-glib-0.108-1  gobject-introspection-runtime-1.54.1-1  js38-38.8.0-3
  61  [11/09/2017 08:08AM]: Total Download Size:    2.63 MiB
  62  [11/09/2017 08:08AM]: Total Installed Size:  41.55 MiB
  63  [11/09/2017 08:08AM]: downloading harfbuzz-1.6.3-1-x86_64.pkg.tar.xz...
  64  [11/09/2017 08:08AM]: downloading js38-38.8.0-3-x86_64.pkg.tar.xz...
  65  [11/09/2017 08:08AM]: Optional dependencies for harfbuzz
  66  [11/09/2017 08:08AM]:     cairo: hb-view program [pending]
  67  [11/09/2017 08:08AM]: warning: directory permissions differ on /var/
  68  [11/09/2017 08:08AM]: filesystem: 777  package: 755
  69  [11/09/2017 08:08AM]:   Fontconfig configuration is done via /etc/fonts/conf.avail and conf.d.
  70  [11/09/2017 08:08AM]:   Read /etc/fonts/conf.d/README for more information.
  71  [11/09/2017 08:08AM]:   Configuration via /etc/fonts/local.conf is still possible,
  72  [11/09/2017 08:08AM]:   but is no longer recommended for options available in conf.avail.
  73  [11/09/2017 08:08AM]:   Main systemwide configuration should be done by symlinks
  74  [11/09/2017 08:08AM]:   (especially for autohinting, sub-pixel and lcdfilter):
  75  [11/09/2017 08:08AM]:   ln -s ../conf.avail/XX-foo.conf
  76  [11/09/2017 08:08AM]:   Check also https://wiki.archlinux.org/index.php/Font_Configuration
  77  [11/09/2017 08:08AM]:   and https://wiki.archlinux.org/index.php/Fonts.
  78  [11/09/2017 08:08AM]: Rebuilding fontconfig cache... done.
  79  [11/09/2017 08:08AM]: installing gobject-introspection-runtime...
  80  [11/09/2017 08:08AM]: Packages (24) autoconf-archive-1:2017.09.28-1  boost-libs-1.65.1-1  docbook-xml-4.5-6  docbook-xsl-1.79.2-3  glib2-docs-2.54.2-2  gtk-doc-1.26+10+g01844e7-1  intltool-0.51.0-3  itstool-2.0.4+1+g9b84c00-2  libxml2-2.9.5+6+g07e227ed-1  libxslt-1.1.30-2  perl-xml-parser-2.44-6  python-appdirs-1.4.3-1  python-beaker-1.8.1-2  python-mako-1.0.7-1  python-markupsafe-1.0-1  python-packaging-16.8-2  python-pyparsing-2.2.0-1  python-setuptools-1:36.6.0-1  python-six-1.11.0-1  source-highlight-3.1.8-13  yelp-tools-3.18.0+1+g193c2bd-2  yelp-xsl-3.20.1-2  gnome-common-3.18.0-2  gobject-introspection-1.54.1-1
  81  [11/09/2017 08:08AM]: Total Download Size:    1.06 MiB
  82  [11/09/2017 08:08AM]: Total Installed Size:  81.23 MiB
  83  [11/09/2017 08:08AM]: downloading gobject-introspection-1.54.1-1-x86_64.pkg.tar.xz...
  84  [11/09/2017 08:08AM]: installing autoconf-archive...
  85  [11/09/2017 08:08AM]: Optional dependencies for autoconf-archive
  86  [11/09/2017 08:08AM]:     automake: macros for use with it [installed]
  87  [11/09/2017 08:08AM]: installing perl-xml-parser...
  88  [11/09/2017 08:08AM]: Optional dependencies for boost-libs
  89  [11/09/2017 08:08AM]:     openmpi: for mpi support
  90  [11/09/2017 08:08AM]: installing source-highlight...
  91  [11/09/2017 08:08AM]: Optional dependencies for gtk-doc
  92  [11/09/2017 08:08AM]: installing python-markupsafe...
  93  [11/09/2017 08:08AM]: installing python-pyparsing...
  94  [11/09/2017 08:08AM]: installing python-appdirs...
  95  [11/09/2017 08:08AM]: installing python-setuptools...
  96  [11/09/2017 08:08AM]: installing gobject-introspection...
  97  [11/09/2017 08:09AM]: (1/3) Warn about old perl modules
  98  [11/09/2017 08:09AM]:   -> Found cjs-3.6.1.tar.gz
  99  [11/09/2017 08:09AM]: ==> Validating source files with md5sums...
 100  [11/09/2017 08:09AM]:     cjs-3.6.1.tar.gz ... Passed
 101  [11/09/2017 08:09AM]:   -> Extracting cjs-3.6.1.tar.gz with bsdtar
 102  [11/09/2017 08:09AM]: autoreconf: Entering directory `.
 103  [11/09/2017 08:09AM]: autoreconf: configure.ac: not using Gettext
 104  [11/09/2017 08:09AM]: autoreconf: running: aclocal --force -I m4
 105  [11/09/2017 08:09AM]: autoreconf: configure.ac: tracing
 106  [11/09/2017 08:09AM]: autoreconf: running: libtoolize --copy --force
 107  [11/09/2017 08:09AM]: libtoolize: putting auxiliary files in ..
 108  [11/09/2017 08:09AM]: libtoolize: copying file ./ltmain.sh
 109  [11/09/2017 08:09AM]: libtoolize: putting macros in AC_CONFIG_MACRO_DIRS, m4.
 110  [11/09/2017 08:09AM]: libtoolize: copying file m4/libtool.m4
 111  [11/09/2017 08:09AM]: libtoolize: copying file m4/ltoptions.m4
 112  [11/09/2017 08:09AM]: libtoolize: copying file m4/ltsugar.m4
 113  [11/09/2017 08:09AM]: libtoolize: copying file m4/ltversion.m4
 114  [11/09/2017 08:09AM]: libtoolize: copying file m4/lt~obsolete.m4
 115  [11/09/2017 08:09AM]: autoreconf: running: /usr/bin/autoconf --force
 116  [11/09/2017 08:09AM]: autoreconf: running: /usr/bin/autoheader --force
 117  [11/09/2017 08:09AM]: autoreconf: running: automake --add-missing --copy --force-missing
 118  [11/09/2017 08:09AM]: configure.ac:39: installing ./compile
 119  [11/09/2017 08:09AM]: configure.ac:39: installing ./config.guess
 120  [11/09/2017 08:09AM]: configure.ac:39: installing ./config.sub
 121  [11/09/2017 08:09AM]: configure.ac:12: installing ./install-sh
 122  [11/09/2017 08:09AM]: configure.ac:12: installing ./missing
 123  [11/09/2017 08:09AM]: configure.ac:18: installing ./tap-driver.sh
 124  [11/09/2017 08:09AM]: Makefile.am: installing ./INSTALL
 125  [11/09/2017 08:09AM]: Makefile.am: installing ./depcomp
 126  [11/09/2017 08:09AM]: autoreconf: Leaving directory `.
 127  [11/09/2017 08:09AM]: checking for a BSD-compatible install... /usr/bin/install -c
 128  [11/09/2017 08:09AM]: checking whether build environment is sane... yes
 129  [11/09/2017 08:09AM]: checking for a thread-safe mkdir -p... /usr/bin/mkdir -p
 130  [11/09/2017 08:09AM]: checking whether make sets $(MAKE)... yes
 131  [11/09/2017 08:09AM]: checking whether make supports nested variables... yes
 132  [11/09/2017 08:09AM]: checking whether UID 1001 is supported by ustar format... yes
 133  [11/09/2017 08:09AM]: checking whether GID 100 is supported by ustar format... yes
 134  [11/09/2017 08:09AM]: checking how to create a ustar tar archive... gnutar
 135  [11/09/2017 08:09AM]: checking whether to enable maintainer-specific portions of Makefiles... yes
 136  [11/09/2017 08:09AM]: checking whether make supports nested variables... (cached) yes
 137  [11/09/2017 08:09AM]: checking for pkg-config... /usr/bin/pkg-config
 138  [11/09/2017 08:09AM]: checking pkg-config is at least version 0.9.0... yes
 139  [11/09/2017 08:09AM]: checking whether the C++ compiler works... yes
 140  [11/09/2017 08:09AM]: checking for C++ compiler default output file name... a.out
 141  [11/09/2017 08:09AM]: checking for suffix of executables...
 142  [11/09/2017 08:09AM]: checking whether we are cross compiling... no
 143  [11/09/2017 08:09AM]: checking for suffix of object files... o
 144  [11/09/2017 08:09AM]: checking whether we are using the GNU C++ compiler... yes
 145  [11/09/2017 08:09AM]: checking whether g++ accepts -g... yes
 146  [11/09/2017 08:09AM]: checking for style of include used by make... GNU
 147  [11/09/2017 08:09AM]: checking dependency style of g++... gcc3
 148  [11/09/2017 08:09AM]: checking whether g++ supports C++11 features by default... yes
 149  [11/09/2017 08:09AM]: checking build system type... x86_64-pc-linux-gnu
 150  [11/09/2017 08:09AM]: checking host system type... x86_64-pc-linux-gnu
 151  [11/09/2017 08:09AM]: checking how to print strings... printf
 152  [11/09/2017 08:09AM]: checking whether we are using the GNU C compiler... yes
 153  [11/09/2017 08:09AM]: checking for gcc option to accept ISO C89... none needed
 154  [11/09/2017 08:09AM]: checking whether gcc understands -c and -o together... yes
 155  [11/09/2017 08:09AM]: checking dependency style of gcc... gcc3
 156  [11/09/2017 08:09AM]: checking for a sed that does not truncate output... /usr/bin/sed
 157  [11/09/2017 08:09AM]: checking for grep that handles long lines and -e... /usr/bin/grep
 158  [11/09/2017 08:09AM]: checking for egrep... /usr/bin/grep -E
 159  [11/09/2017 08:09AM]: checking for fgrep... /usr/bin/grep -F
 160  [11/09/2017 08:09AM]: checking for ld used by gcc... /usr/bin/ld
 161  [11/09/2017 08:09AM]: checking if the linker (/usr/bin/ld) is GNU ld... yes
 162  [11/09/2017 08:09AM]: checking for BSD- or MS-compatible name lister (nm)... /usr/bin/nm -B
 163  [11/09/2017 08:09AM]: checking the name lister (/usr/bin/nm -B) interface... BSD nm
 164  [11/09/2017 08:09AM]: checking whether ln -s works... yes
 165  [11/09/2017 08:09AM]: checking the maximum length of command line arguments... 1572864
 166  [11/09/2017 08:09AM]: checking how to convert x86_64-pc-linux-gnu file names to x86_64-pc-linux-gnu format... func_convert_file_noop
 167  [11/09/2017 08:09AM]: checking how to convert x86_64-pc-linux-gnu file names to toolchain format... func_convert_file_noop
 168  [11/09/2017 08:09AM]: checking for /usr/bin/ld option to reload object files... -r
 169  [11/09/2017 08:09AM]: checking for objdump... objdump
 170  [11/09/2017 08:09AM]: checking how to recognize dependent libraries... pass_all
 171  [11/09/2017 08:09AM]: checking for dlltool... no
 172  [11/09/2017 08:09AM]: checking how to associate runtime and link libraries... printf %s\n
 173  [11/09/2017 08:09AM]: checking for archiver @FILE support... @
 174  [11/09/2017 08:09AM]: checking for strip... strip
 175  [11/09/2017 08:09AM]: checking for ranlib... ranlib
 176  [11/09/2017 08:09AM]: checking command to parse /usr/bin/nm -B output from gcc object... ok
 177  [11/09/2017 08:09AM]: checking for a working dd... /usr/bin/dd
 178  [11/09/2017 08:09AM]: checking how to truncate binary pipes... /usr/bin/dd bs=4096 count=1
 179  [11/09/2017 08:09AM]: checking if : is a manifest tool... no
 180  [11/09/2017 08:09AM]: checking how to run the C preprocessor... gcc -E
 181  [11/09/2017 08:09AM]: checking for ANSI C header files... yes
 182  [11/09/2017 08:09AM]: checking for sys/types.h... yes
 183  [11/09/2017 08:09AM]: checking for sys/stat.h... yes
 184  [11/09/2017 08:09AM]: checking for stdlib.h... yes
 185  [11/09/2017 08:09AM]: checking for strings.h... yes
 186  [11/09/2017 08:09AM]: checking for dlfcn.h... yes
 187  [11/09/2017 08:09AM]: checking for objdir... .libs
 188  [11/09/2017 08:09AM]: checking if gcc supports -fno-rtti -fno-exceptions... no
 189  [11/09/2017 08:09AM]: checking for gcc option to produce PIC... -fPIC -DPIC
 190  [11/09/2017 08:09AM]: checking if gcc PIC flag -fPIC -DPIC works... yes
 191  [11/09/2017 08:09AM]: checking if gcc static flag -static works... yes
 192  [11/09/2017 08:09AM]: checking if gcc supports -c -o file.o... yes
 193  [11/09/2017 08:09AM]: checking if gcc supports -c -o file.o... (cached) yes
 194  [11/09/2017 08:09AM]: checking whether the gcc linker (/usr/bin/ld -m elf_x86_64) supports shared libraries... yes
 195  [11/09/2017 08:09AM]: checking whether -lc should be explicitly linked in... no
 196  [11/09/2017 08:09AM]: checking dynamic linker characteristics... GNU/Linux ld.so
 197  [11/09/2017 08:09AM]: checking how to hardcode library paths into programs... immediate
 198  [11/09/2017 08:09AM]: checking whether stripping libraries is possible... yes
 199  [11/09/2017 08:09AM]: checking if libtool supports shared libraries... yes
 200  [11/09/2017 08:09AM]: checking whether to build shared libraries... yes
 201  [11/09/2017 08:09AM]: checking whether to build static libraries... no
 202  [11/09/2017 08:09AM]: checking how to run the C++ preprocessor... g++ -E
 203  [11/09/2017 08:09AM]: checking for ld used by g++... /usr/bin/ld -m elf_x86_64
 204  [11/09/2017 08:09AM]: checking if the linker (/usr/bin/ld -m elf_x86_64) is GNU ld... yes
 205  [11/09/2017 08:09AM]: checking dynamic linker characteristics... (cached) GNU/Linux ld.so
 206  [11/09/2017 08:09AM]: checking for a sed that does not truncate output... (cached) /usr/bin/sed
 207  [11/09/2017 08:09AM]: checking for gawk... (cached) gawk
 208  [11/09/2017 08:09AM]: checking whether C compiler accepts -Werror=unknown-warning-option... no
 209  [11/09/2017 08:09AM]: checking whether C compiler accepts -Wno-suggest-attribute=format... yes
 210  [11/09/2017 08:09AM]: checking whether C compiler accepts -fno-strict-aliasing... yes
 211  [11/09/2017 08:09AM]: checking whether C compiler accepts -Wall... yes
 212  [11/09/2017 08:09AM]: checking whether C compiler accepts -Wextra... yes
 213  [11/09/2017 08:09AM]: checking whether C compiler accepts -Wundef... yes
 214  [11/09/2017 08:09AM]: checking whether C compiler accepts -Wnested-externs... yes
 215  [11/09/2017 08:09AM]: checking whether C compiler accepts -Wwrite-strings... yes
 216  [11/09/2017 08:09AM]: checking whether C compiler accepts -Wpointer-arith... yes
 217  [11/09/2017 08:09AM]: checking whether C compiler accepts -Wmissing-declarations... yes
 218  [11/09/2017 08:09AM]: checking whether C compiler accepts -Wmissing-prototypes... yes
 219  [11/09/2017 08:09AM]: checking whether C compiler accepts -Wstrict-prototypes... yes
 220  [11/09/2017 08:09AM]: checking whether C compiler accepts -Wredundant-decls... yes
 221  [11/09/2017 08:09AM]: checking whether C compiler accepts -Wno-unused-parameter... yes
 222  [11/09/2017 08:09AM]: checking whether C compiler accepts -Wno-missing-field-initializers... yes
 223  [11/09/2017 08:09AM]: checking whether C compiler accepts -Wdeclaration-after-statement... yes
 224  [11/09/2017 08:09AM]: checking whether C compiler accepts -Wformat=2... yes
 225  [11/09/2017 08:09AM]: checking whether C compiler accepts -Wold-style-definition... yes
 226  [11/09/2017 08:09AM]: checking whether C compiler accepts -Wcast-align... yes
 227  [11/09/2017 08:09AM]: checking whether C compiler accepts -Wformat-nonliteral... yes
 228  [11/09/2017 08:09AM]: checking whether C compiler accepts -Wformat-security... yes
 229  [11/09/2017 08:09AM]: checking whether C compiler accepts -Wsign-compare... yes
 230  [11/09/2017 08:09AM]: checking whether C compiler accepts -Wstrict-aliasing... yes
 231  [11/09/2017 08:09AM]: checking whether C compiler accepts -Wshadow... yes
 232  [11/09/2017 08:09AM]: checking whether C compiler accepts -Winline... yes
 233  [11/09/2017 08:09AM]: checking whether C compiler accepts -Wpacked... yes
 234  [11/09/2017 08:09AM]: checking whether C compiler accepts -Wmissing-format-attribute... yes
 235  [11/09/2017 08:09AM]: checking whether C compiler accepts -Wmissing-noreturn... yes
 236  [11/09/2017 08:09AM]: checking whether C compiler accepts -Winit-self... yes
 237  [11/09/2017 08:09AM]: checking whether C compiler accepts -Wredundant-decls... (cached) yes
 238  [11/09/2017 08:09AM]: checking whether C compiler accepts -Wmissing-include-dirs... yes
 239  [11/09/2017 08:09AM]: checking whether C compiler accepts -Wunused-but-set-variable... yes
 240  [11/09/2017 08:09AM]: checking whether C compiler accepts -Warray-bounds... yes
 241  [11/09/2017 08:09AM]: checking whether C compiler accepts -Wimplicit-function-declaration... yes
 242  [11/09/2017 08:09AM]: checking whether C compiler accepts -Wreturn-type... yes
 243  [11/09/2017 08:09AM]: checking whether C compiler accepts -Wswitch-enum... yes
 244  [11/09/2017 08:09AM]: checking whether C compiler accepts -Wswitch-default... yes
 245  [11/09/2017 08:09AM]: checking whether C compiler accepts -Wno-error=unused-parameter... yes
 246  [11/09/2017 08:09AM]: checking whether C compiler accepts -Wno-error=missing-field-initializers... yes
 247  [11/09/2017 08:09AM]: checking whether C++ compiler accepts -Werror=unknown-warning-option... no
 248  [11/09/2017 08:09AM]: checking whether C++ compiler accepts -Wno-suggest-attribute=format... yes
 249  [11/09/2017 08:09AM]: checking whether C++ compiler accepts -fno-strict-aliasing... yes
 250  [11/09/2017 08:09AM]: checking whether C++ compiler accepts -Wall... yes
 251  [11/09/2017 08:09AM]: checking whether C++ compiler accepts -Wextra... yes
 252  [11/09/2017 08:09AM]: checking whether C++ compiler accepts -Wundef... yes
 253  [11/09/2017 08:09AM]: checking whether C++ compiler accepts -Wwrite-strings... yes
 254  [11/09/2017 08:09AM]: checking whether C++ compiler accepts -Wpointer-arith... yes
 255  [11/09/2017 08:09AM]: checking whether C++ compiler accepts -Wmissing-declarations... yes
 256  [11/09/2017 08:09AM]: checking whether C++ compiler accepts -Wredundant-decls... yes
 257  [11/09/2017 08:09AM]: checking whether C++ compiler accepts -Wno-unused-parameter... yes
 258  [11/09/2017 08:09AM]: checking whether C++ compiler accepts -Wno-missing-field-initializers... yes
 259  [11/09/2017 08:09AM]: checking whether C++ compiler accepts -Wformat=2... yes
 260  [11/09/2017 08:09AM]: checking whether C++ compiler accepts -Wcast-align... yes
 261  [11/09/2017 08:09AM]: checking whether C++ compiler accepts -Wformat-nonliteral... yes
 262  [11/09/2017 08:09AM]: checking whether C++ compiler accepts -Wformat-security... yes
 263  [11/09/2017 08:09AM]: checking whether C++ compiler accepts -Wsign-compare... yes
 264  [11/09/2017 08:09AM]: checking whether C++ compiler accepts -Wstrict-aliasing... yes
 265  [11/09/2017 08:09AM]: checking whether C++ compiler accepts -Wshadow... yes
 266  [11/09/2017 08:09AM]: checking whether C++ compiler accepts -Winline... yes
 267  [11/09/2017 08:09AM]: checking whether C++ compiler accepts -Wpacked... yes
 268  [11/09/2017 08:09AM]: checking whether C++ compiler accepts -Wmissing-format-attribute... yes
 269  [11/09/2017 08:09AM]: checking whether C++ compiler accepts -Wmissing-noreturn... yes
 270  [11/09/2017 08:09AM]: checking whether C++ compiler accepts -Winit-self... yes
 271  [11/09/2017 08:09AM]: checking whether C++ compiler accepts -Wredundant-decls... (cached) yes
 272  [11/09/2017 08:09AM]: checking whether C++ compiler accepts -Wmissing-include-dirs... yes
 273  [11/09/2017 08:09AM]: checking whether C++ compiler accepts -Wunused-but-set-variable... yes
 274  [11/09/2017 08:09AM]: checking whether C++ compiler accepts -Warray-bounds... yes
 275  [11/09/2017 08:09AM]: checking whether C++ compiler accepts -Wreturn-type... yes
 276  [11/09/2017 08:09AM]: checking whether C++ compiler accepts -Wno-overloaded-virtual... yes
 277  [11/09/2017 08:09AM]: checking whether C++ compiler accepts -Wswitch-enum... yes
 278  [11/09/2017 08:09AM]: checking whether C++ compiler accepts -Wswitch-default... yes
 279  [11/09/2017 08:09AM]: checking whether C++ compiler accepts -Wno-error=unused-parameter... yes
 280  [11/09/2017 08:09AM]: checking whether C++ compiler accepts -Wno-error=missing-field-initializers... yes
 281  [11/09/2017 08:09AM]: checking whether C++ compiler accepts -Wno-error=overloaded-virtual... yes
 282  [11/09/2017 08:09AM]: checking whether C++ compiler accepts -Werror=unknown-warning-option... (cached) no
 283  [11/09/2017 08:09AM]: checking whether the linker accepts -Wl,--no-as-needed... yes
 284  [11/09/2017 08:09AM]: checking whether the linker accepts -Wl,--fatal-warnings... yes
 285  [11/09/2017 08:09AM]: checking whether the linker accepts -Wl,-fatal_warnings... no
 286  [11/09/2017 08:09AM]: checking whether to build with code coverage support... no
 287  [11/09/2017 08:09AM]: checking whether the linker accepts -lgcov... yes
 288  [11/09/2017 08:09AM]: checking for gobject-introspection... yes
 289  [11/09/2017 08:09AM]: checking for gobject-2.0 >= 2.42.0... yes
 290  [11/09/2017 08:09AM]: checking for gobject-introspection-1.0 libffi gthread-2.0 gio-2.0 >= 2.42.0 mozjs-38... yes
 291  [11/09/2017 08:09AM]: checking for gobject-2.0 >= 2.42.0 gio-2.0... yes
 292  [11/09/2017 08:09AM]: checking for gio-unix-2.0 gobject-introspection-1.0 libffi gthread-2.0 gio-2.0 >= 2.42.0 mozjs-38... yes
 293  [11/09/2017 08:09AM]: checking for cairo cairo-gobject gthread-2.0 gio-2.0 >= 2.42.0 mozjs-38... yes
 294  [11/09/2017 08:09AM]: checking for gtk+-3.0 >= 3.14.0... no
 295  [11/09/2017 08:09AM]: checking how to link readline libs... -lreadline
 296  [11/09/2017 08:09AM]: checking readline/readline.h usability... yes
 297  [11/09/2017 08:09AM]: checking readline/readline.h presence... yes
 298  [11/09/2017 08:09AM]: checking for readline/readline.h... yes
 299  [11/09/2017 08:09AM]: checking whether printf() accepts %Id for alternative integer output... no
 300  [11/09/2017 08:09AM]: checking whether the linker accepts -Bsymbolic-functions... yes
 301  [11/09/2017 08:09AM]: checking whether C++ compiler accepts -fno-rtti... yes
 302  [11/09/2017 08:09AM]: checking for dbus-run-session... /usr/bin/dbus-run-session
 303  [11/09/2017 08:09AM]: checking whether C++ compiler accepts --param inline-unit-growth=50... yes
 304  [11/09/2017 08:09AM]: checking that generated files are newer than configure... done
 305  [11/09/2017 08:09AM]: configure: creating ./config.status
 306  [11/09/2017 08:09AM]: config.status: creating Makefile
 307  [11/09/2017 08:09AM]: config.status: creating cjs-1.0.pc
 308  [11/09/2017 08:09AM]: config.status: creating win32/config.h.win32
 309  [11/09/2017 08:09AM]: config.status: creating config.h
 310  [11/09/2017 08:09AM]: config.status: linking /usr/share/gobject-introspection-1.0/tests/gitestmacros.h to installed-tests/gitestmacros.h
 311  [11/09/2017 08:09AM]: config.status: linking /usr/share/gobject-introspection-1.0/tests/regress.c to installed-tests/regress.c
 312  [11/09/2017 08:09AM]: config.status: linking /usr/share/gobject-introspection-1.0/tests/regress.h to installed-tests/regress.h
 313  [11/09/2017 08:09AM]: config.status: linking /usr/share/gobject-introspection-1.0/tests/warnlib.c to installed-tests/warnlib.c
 314  [11/09/2017 08:09AM]: config.status: linking /usr/share/gobject-introspection-1.0/tests/warnlib.h to installed-tests/warnlib.h
 315  [11/09/2017 08:09AM]: config.status: linking /usr/share/gobject-introspection-1.0/tests/gimarshallingtests.c to installed-tests/gimarshallingtests.c
 316  [11/09/2017 08:09AM]: config.status: linking /usr/share/gobject-introspection-1.0/tests/gimarshallingtests.h to installed-tests/gimarshallingtests.h
 317  [11/09/2017 08:09AM]: config.status: executing depfiles commands
 318  [11/09/2017 08:09AM]: config.status: executing libtool commands
 319  [11/09/2017 08:09AM]: 	GJS_CFLAGS:		-I/usr/include/glib-2.0 -I/usr/lib/glib-2.0/include
 320  [11/09/2017 08:09AM]: 	GJS_LIBS:		-lgobject-2.0 -lglib-2.0
 321  [11/09/2017 08:09AM]:   GEN      mock-js-resources.c
 322  [11/09/2017 08:09AM]:   GEN      jsunit-resources.h
 323  [11/09/2017 08:09AM]:   GEN      jsunit-resources.c
 324  [11/09/2017 08:09AM]: git.mk: Generating .gitignore
 325  [11/09/2017 08:09AM]: make[1]: Entering directory /pkg/src/cjs-3.6.1
 326  [11/09/2017 08:09AM]:   CXX      gi/libcjs_la-arg.lo
 327  [11/09/2017 08:09AM]:   CXX      gi/libcjs_la-boxed.lo
 328  [11/09/2017 08:09AM]:   CXX      gi/libcjs_la-closure.lo
 329  [11/09/2017 08:09AM]:   CXX      gi/libcjs_la-enumeration.lo
 330  [11/09/2017 08:09AM]:   CXX      gi/libcjs_la-foreign.lo
 331  [11/09/2017 08:09AM]:   CXX      gi/libcjs_la-fundamental.lo
 332  [11/09/2017 08:09AM]:   CXX      gi/libcjs_la-function.lo
 333  [11/09/2017 08:09AM]:   CXX      gi/libcjs_la-gerror.lo
 334  [11/09/2017 08:09AM]:   CXX      gi/libcjs_la-gtype.lo
 335  [11/09/2017 08:09AM]:   CXX      gi/libcjs_la-interface.lo
 336  [11/09/2017 08:09AM]:   CXX      gi/libcjs_la-ns.lo
 337  [11/09/2017 08:09AM]:   CXX      gi/libcjs_la-object.lo
 338  [11/09/2017 08:09AM]:   CXX      gi/libcjs_la-param.lo
 339  [11/09/2017 08:09AM]:   CXX      gi/libcjs_la-proxyutils.lo
 340  [11/09/2017 08:09AM]:   CXX      gi/libcjs_la-repo.lo
 341  [11/09/2017 08:09AM]:   CXX      gi/libcjs_la-toggle.lo
 342  [11/09/2017 08:09AM]:   CXX      gi/libcjs_la-union.lo
 343  [11/09/2017 08:09AM]:   CXX      gi/libcjs_la-value.lo
 344  [11/09/2017 08:09AM]:   CXX      cjs/libcjs_la-byteArray.lo
 345  [11/09/2017 08:09AM]:   CXX      cjs/libcjs_la-context.lo
 346  [11/09/2017 08:09AM]:   CXX      cjs/libcjs_la-coverage.lo
 347  [11/09/2017 08:09AM]:   CXX      cjs/libcjs_la-importer.lo
 348  [11/09/2017 08:09AM]:   CXX      cjs/libcjs_la-jsapi-constructor-proxy.lo
 349  [11/09/2017 08:09AM]:   CXX      cjs/libcjs_la-jsapi-dynamic-class.lo
 350  [11/09/2017 08:09AM]:   CXX      cjs/libcjs_la-jsapi-private.lo
 351  [11/09/2017 08:09AM]:   CXX      cjs/libcjs_la-jsapi-util.lo
 352  [11/09/2017 08:09AM]:   CXX      cjs/libcjs_la-jsapi-util-error.lo
 353  [11/09/2017 08:09AM]:   CXX      cjs/libcjs_la-jsapi-util-string.lo
 354  [11/09/2017 08:09AM]:   CXX      cjs/libcjs_la-mem.lo
 355  [11/09/2017 08:10AM]:   CXX      cjs/libcjs_la-native.lo
 356  [11/09/2017 08:10AM]:   CXX      cjs/libcjs_la-runtime.lo
 357  [11/09/2017 08:10AM]:   CXX      cjs/libcjs_la-stack.lo
 358  [11/09/2017 08:10AM]:   CXX      modules/libcjs_la-modules.lo
 359  [11/09/2017 08:10AM]:   CXX      util/libcjs_la-error.lo
 360  [11/09/2017 08:10AM]:   CXX      util/libcjs_la-glib.lo
 361  [11/09/2017 08:10AM]:   CXX      util/libcjs_la-hash-x32.lo
 362  [11/09/2017 08:10AM]:   CXX      util/libcjs_la-log.lo
 363  [11/09/2017 08:10AM]:   CXX      util/libcjs_la-misc.lo
 364  [11/09/2017 08:10AM]:   CXX      libgjs-private/libcjs_la-gjs-gdbus-wrapper.lo
 365  [11/09/2017 08:10AM]:   CXX      libgjs-private/libcjs_la-gjs-util.lo
 366  [11/09/2017 08:10AM]:   CXX      modules/libconsole_la-console.lo
 367  [11/09/2017 08:10AM]:   CXX      modules/libsystem_la-system.lo
 368  [11/09/2017 08:10AM]:   CC       libmodules_resources_la-modules-resources.lo
 369  [11/09/2017 08:10AM]:   CCLD     libmodules_resources.la
 370  [11/09/2017 08:10AM]:   CXX      modules/libcairoNative_la-cairo-region.lo
 371  [11/09/2017 08:10AM]:   CXX      modules/libcairoNative_la-cairo-context.lo
 372  [11/09/2017 08:10AM]:   CXX      modules/libcairoNative_la-cairo-path.lo
 373  [11/09/2017 08:10AM]:   CXX      modules/libcairoNative_la-cairo-surface.lo
 374  [11/09/2017 08:10AM]:   CXX      modules/libcairoNative_la-cairo-image-surface.lo
 375  [11/09/2017 08:10AM]:   CXX      modules/libcairoNative_la-cairo-ps-surface.lo
 376  [11/09/2017 08:10AM]:   CXX      modules/libcairoNative_la-cairo-pdf-surface.lo
 377  [11/09/2017 08:10AM]:   CXX      modules/libcairoNative_la-cairo-svg-surface.lo
 378  [11/09/2017 08:10AM]:   CXX      modules/libcairoNative_la-cairo-pattern.lo
 379  [11/09/2017 08:10AM]:   CXX      modules/libcairoNative_la-cairo-gradient.lo
 380  [11/09/2017 08:10AM]:   CXX      modules/libcairoNative_la-cairo-linear-gradient.lo
 381  [11/09/2017 08:10AM]:   CXX      modules/libcairoNative_la-cairo-radial-gradient.lo
 382  [11/09/2017 08:10AM]:   CXX      modules/libcairoNative_la-cairo-surface-pattern.lo
 383  [11/09/2017 08:10AM]:   CXX      modules/libcairoNative_la-cairo-solid-pattern.lo
 384  [11/09/2017 08:10AM]:   CXX      modules/libcairoNative_la-cairo.lo
 385  [11/09/2017 08:10AM]:   CXXLD    libcairoNative.la
 386  [11/09/2017 08:10AM]:   CXX      cjs/cjs_console-console.o
 387  [11/09/2017 08:10AM]:   CC       installed-tests/libregress_la-regress.lo
 388  [11/09/2017 08:10AM]:   GISCAN   Regress-1.0.gir
 389  [11/09/2017 08:10AM]: In file included from /usr/include/bits/libc-header-start.h:33:0,
 390  [11/09/2017 08:10AM]:                  from /usr/include/limits.h:26,
 391  [11/09/2017 08:10AM]:                  from /usr/lib/gcc/x86_64-pc-linux-gnu/7.2.0/include-fixed/limits.h:194,
 392  [11/09/2017 08:10AM]:                  from /usr/lib/gcc/x86_64-pc-linux-gnu/7.2.0/include-fixed/syslimits.h:7,
 393  [11/09/2017 08:10AM]:                  from /usr/lib/gcc/x86_64-pc-linux-gnu/7.2.0/include-fixed/limits.h:34,
 394  [11/09/2017 08:10AM]:                  from /usr/lib/glib-2.0/include/glibconfig.h:11,
 395  [11/09/2017 08:10AM]:                  from /usr/include/glib-2.0/glib/gtypes.h:32,
 396  [11/09/2017 08:10AM]:                  from /usr/include/glib-2.0/glib/galloca.h:32,
 397  [11/09/2017 08:10AM]:                  from /usr/include/glib-2.0/glib.h:30,
 398  [11/09/2017 08:10AM]:                  from /usr/include/glib-2.0/gobject/gbinding.h:28,
 399  [11/09/2017 08:10AM]:                  from /usr/include/glib-2.0/glib-object.h:23,
 400  [11/09/2017 08:10AM]:                  from /usr/include/cairo/cairo-gobject.h:44,
 401  [11/09/2017 08:10AM]:                  from /usr/share/gobject-introspection-1.0/tests/regress.h:5,
 402  [11/09/2017 08:10AM]:                  from /pkg/src/cjs-3.6.1/g-ir-cpp-d7tdf7l_.c:4:
 403  [11/09/2017 08:10AM]: /usr/include/features.h:376:4: warning: #warning _FORTIFY_SOURCE requires compiling with optimization (-O) [-Wcpp]
 404  [11/09/2017 08:10AM]:  #  warning _FORTIFY_SOURCE requires compiling with optimization (-O)
 405  [11/09/2017 08:10AM]:   CC       installed-tests/libwarnlib_la-warnlib.lo
 406  [11/09/2017 08:10AM]:                  from /usr/include/glib-2.0/gio/gioenums.h:28,
 407  [11/09/2017 08:10AM]:                  from /usr/include/glib-2.0/gio/giotypes.h:28,
 408  [11/09/2017 08:10AM]:                  from /usr/include/glib-2.0/gio/gio.h:26,
 409  [11/09/2017 08:10AM]:                  from /usr/share/gobject-introspection-1.0/tests/warnlib.h:6,
 410  [11/09/2017 08:10AM]:                  from /pkg/src/cjs-3.6.1/g-ir-cpp-4f3dbv7f.c:4:
 411  [11/09/2017 08:10AM]: g-ir-scanner: WarnLib: warning: 9 warnings suppressed (use --warn-all to see them)
 412  [11/09/2017 08:10AM]:   CC       installed-tests/libgimarshallingtests_la-gimarshallingtests.lo
 413  [11/09/2017 08:10AM]:   CCLD     libgimarshallingtests.la
 414  [11/09/2017 08:10AM]:   GISCAN   GIMarshallingTests-1.0.gir
 415  [11/09/2017 08:10AM]:                  from /usr/share/gobject-introspection-1.0/tests/gimarshallingtests.h:5,
 416  [11/09/2017 08:10AM]:                  from /pkg/src/cjs-3.6.1/g-ir-cpp-sn3njpgm.c:4:
 417  [11/09/2017 08:10AM]:   GISCAN   CjsPrivate-1.0.gir
 418  [11/09/2017 08:10AM]:                  from /pkg/src/cjs-3.6.1/libgjs-private/gjs-gdbus-wrapper.h:26,
 419  [11/09/2017 08:10AM]:                  from /pkg/src/cjs-3.6.1/g-ir-cpp-xvhee_qx.c:4:
 420  [11/09/2017 08:10AM]: make[1]: Leaving directory /pkg/src/cjs-3.6.1
 421  [11/09/2017 08:10AM]: make  libregress.la libwarnlib.la libgimarshallingtests.la gjs-tests minijasmine
 422  [11/09/2017 08:10AM]: make[2]: libwarnlib.la is up to date.
 423  [11/09/2017 08:10AM]: make[2]: libgimarshallingtests.la is up to date.
 424  [11/09/2017 08:10AM]:   CXX      test/gjs_tests-gjs-tests.o
 425  [11/09/2017 08:10AM]:   CXX      test/gjs_tests-gjs-test-utils.o
 426  [11/09/2017 08:10AM]:   CXX      test/gjs_tests-gjs-test-call-args.o
 427  [11/09/2017 08:10AM]:   CXX      test/gjs_tests-gjs-test-coverage.o
 428  [11/09/2017 08:10AM]:   CXX      test/gjs_tests-gjs-test-rooting.o
 429  [11/09/2017 08:10AM]:   CC       gjs_tests-mock-js-resources.o
 430  [11/09/2017 08:10AM]:   GEN      mock-cache-invalidation-before.gresource
 431  [11/09/2017 08:10AM]:   GEN      mock-cache-invalidation-after.gresource
 432  [11/09/2017 08:10AM]:   CXX      installed-tests/minijasmine-minijasmine.o
 433  [11/09/2017 08:10AM]:   CC       minijasmine-jsunit-resources.o
 434  [11/09/2017 08:10AM]: PASS: gjs-tests 1 /gjs/context/exit
 435  [11/09/2017 08:10AM]: PASS: gjs-tests 2 /gjs/context/construct/destroy
 436  [11/09/2017 08:10AM]: PASS: gjs-tests 3 /gjs/context/construct/eval
 437  [11/09/2017 08:10AM]: PASS: gjs-tests 4 /gjs/gobject/js_defined_type
 438  [11/09/2017 08:10AM]: PASS: gjs-tests 5 /gjs/jsutil/strip_shebang/no_shebang
 439  [11/09/2017 08:10AM]: PASS: gjs-tests 6 /gjs/jsutil/strip_shebang/have_shebang
 440  [11/09/2017 08:10AM]: PASS: gjs-tests 7 /gjs/jsutil/strip_shebang/only_shebang
 441  [11/09/2017 08:10AM]: PASS: gjs-tests 8 /gjs/jsapi/util/error/throw
 442  [11/09/2017 08:10AM]: PASS: gjs-tests 9 /gjs/jsapi/util/string/char16_data
 443  [11/09/2017 08:10AM]: PASS: gjs-tests 10 /gjs/jsapi/util/string/to_ucs4
 444  [11/09/2017 08:10AM]: PASS: gjs-tests 11 /gjs/jsapi/util/string/js/string/utf8
 445  [11/09/2017 08:10AM]: PASS: gjs-tests 12 /gjs/jsapi/util/debug_string/valid-utf8
 446  [11/09/2017 08:10AM]: SKIP: gjs-tests 13 /gjs/jsapi/util/debug_string/invalid-utf8 # SKIP SpiderMonkey doesnt validate UTF-8 after encoding it
 447  [11/09/2017 08:10AM]: PASS: gjs-tests 14 /gjs/jsapi/util/debug_string/object-with-complicated-to-string
 448  [11/09/2017 08:10AM]: PASS: gjs-tests 15 /gjs/coverage/file_duplicated_into_output_path
 449  [11/09/2017 08:10AM]: ERROR: gjs-tests - too few tests run (expected 99, got 15)
 450  [11/09/2017 08:10AM]: ERROR: gjs-tests - exited with status 134 (terminated by signal 6?)
 451  [11/09/2017 08:10AM]: FAIL: installed-tests/scripts/testCommandLine.sh 1 - System.exit(0) should exit successfully
 452  [11/09/2017 08:10AM]: FAIL: installed-tests/scripts/testCommandLine.sh 2 - System.exit(42) should exit with the correct exit code
 453  [11/09/2017 08:10AM]: PASS: installed-tests/scripts/testCommandLine.sh 3 - System.exit() should still exit across an FFI boundary
 454  [11/09/2017 08:10AM]: FAIL: installed-tests/scripts/testCommandLine.sh 4 - --help should succeed
 455  [11/09/2017 08:10AM]: FAIL: installed-tests/scripts/testCommandLine.sh 5 - --help should print something
 456  [11/09/2017 08:10AM]: FAIL: installed-tests/scripts/testCommandLine.sh 6 - should succeed when --help is not first arg
 457  [11/09/2017 08:10AM]: FAIL: installed-tests/scripts/testCommandLine.sh 7 - should print something when --help is not first arg
 458  [11/09/2017 08:10AM]: FAIL: installed-tests/scripts/testCommandLine.sh 8 - --help should succeed before a script file
 459  [11/09/2017 08:10AM]: FAIL: installed-tests/scripts/testCommandLine.sh 9 - --help should print something before a script file
 460  [11/09/2017 08:10AM]: FAIL: installed-tests/scripts/testCommandLine.sh 10 - --help should succeed before -c
 461  [11/09/2017 08:10AM]: FAIL: installed-tests/scripts/testCommandLine.sh 11 - --help should print something before -c
 462  [11/09/2017 08:10AM]: FAIL: installed-tests/scripts/testCommandLine.sh 12 - --help after script file should be passed to script
 463  [11/09/2017 08:10AM]: PASS: installed-tests/scripts/testCommandLine.sh 13 - --help after script file should not print anything
 464  [11/09/2017 08:10AM]: FAIL: installed-tests/scripts/testCommandLine.sh 14 - --help after -c should be passed to script
 465  [11/09/2017 08:10AM]: PASS: installed-tests/scripts/testCommandLine.sh 15 - --help after -c should not print anything
 466  [11/09/2017 08:10AM]: FAIL: installed-tests/scripts/testCommandLine.sh 16 - -I after script should succeed but give a warning
 467  [11/09/2017 08:10AM]: FAIL: installed-tests/scripts/testCommandLine.sh 17 - --coverage-prefix after script should succeed but give a warning
 468  [11/09/2017 08:10AM]: FAIL: installed-tests/scripts/testCommandLine.sh 18 - --coverage-output after script should succeed but give a warning
 469  [11/09/2017 08:10AM]: FAIL: installed-tests/scripts/testCommandLine.sh 19 - --version should work
 470  [11/09/2017 08:10AM]: FAIL: installed-tests/scripts/testCommandLine.sh 20 - --version should print something
 471  [11/09/2017 08:10AM]: FAIL: installed-tests/scripts/testCommandLine.sh 21 - --version after -c should be passed to script
 472  [11/09/2017 08:10AM]: PASS: installed-tests/scripts/testCommandLine.sh 22 - --version after -c should not print anything
 473  [11/09/2017 08:10AM]: FAIL: installed-tests/scripts/testWarnings.sh 1 - overwriting method with Signals.addSignalMethods() should warn
 474  [11/09/2017 08:10AM]: FAIL: installed-tests/scripts/testWarnings.sh 2 - passing too many arguments to a GI function should warn
 475  [11/09/2017 08:10AM]: PASS: installed-tests/js/testself.js 1 Test harness internal consistency
 476  [11/09/2017 08:10AM]: PASS: installed-tests/js/testByteArray.js 1 Byte array has length 0 for empty array
 477  [11/09/2017 08:10AM]: PASS: installed-tests/js/testByteArray.js 2 Byte array initially sized to 10 has length 10
 478  [11/09/2017 08:10AM]: PASS: installed-tests/js/testByteArray.js 3 Byte array initially sized to 10 is initialized to zeroes
 479  [11/09/2017 08:10AM]: PASS: installed-tests/js/testByteArray.js 4 Byte array assigns values correctly
 480  [11/09/2017 08:10AM]: PASS: installed-tests/js/testByteArray.js 5 Byte array assignment past end implicitly lengthens the array
 481  [11/09/2017 08:10AM]: PASS: installed-tests/js/testByteArray.js 6 Byte array assignment past end implicitly creates zero bytes
 482  [11/09/2017 08:10AM]: PASS: installed-tests/js/testByteArray.js 7 Byte array changes the length when assigning to length property
 483  [11/09/2017 08:10AM]: PASS: installed-tests/js/testByteArray.js 8 Byte array conversions gives a byte 5 when assigning 5
 484  [11/09/2017 08:10AM]: PASS: installed-tests/js/testByteArray.js 9 Byte array conversions gives a byte 0 when assigning null
 485  [11/09/2017 08:10AM]: PASS: installed-tests/js/testByteArray.js 10 Byte array conversions gives a byte 0 when assigning undefined
 486  [11/09/2017 08:10AM]: PASS: installed-tests/js/testByteArray.js 11 Byte array conversions rounds off when assigning a double
 487  [11/09/2017 08:10AM]: PASS: installed-tests/js/testByteArray.js 12 Byte array can be created from a string
 488  [11/09/2017 08:10AM]: PASS: installed-tests/js/testByteArray.js 13 Byte array can be encoded from a string
 489  [11/09/2017 08:10AM]: PASS: installed-tests/js/testByteArray.js 14 Byte array encodes as UTF-8 by default
 490  [11/09/2017 08:10AM]: PASS: installed-tests/js/testByteArray.js 15 Byte array can be created from an array
 491  [11/09/2017 08:10AM]: PASS: installed-tests/js/testByteArray.js 16 Byte array can be converted to a string of ASCII characters
 492  [11/09/2017 08:10AM]: PASS: installed-tests/js/testClass.js 1 Class framework calls _init constructors
 493  [11/09/2017 08:10AM]: PASS: installed-tests/js/testClass.js 2 Class framework calls parent constructors
 494  [11/09/2017 08:10AM]: PASS: installed-tests/js/testClass.js 3 Class framework sets the right constructor properties
 495  [11/09/2017 08:10AM]: PASS: installed-tests/js/testClass.js 4 Class framework sets up instanceof correctly
 496  [11/09/2017 08:10AM]: PASS: installed-tests/js/testClass.js 5 Class framework reports a sensible value for toString()
 497  [11/09/2017 08:10AM]: PASS: installed-tests/js/testClass.js 6 Class framework allows overriding toString()
 498  [11/09/2017 08:10AM]: PASS: installed-tests/js/testClass.js 7 Class framework is not configurable
 499  [11/09/2017 08:10AM]: PASS: installed-tests/js/testClass.js 8 Class framework allows accessors for properties
 500  [11/09/2017 08:10AM]: PASS: installed-tests/js/testClass.js 9 Class framework raises an exception when creating an abstract class
 501  [11/09/2017 08:10AM]: PASS: installed-tests/js/testClass.js 10 Class framework inherits properties from abstract base classes
 502  [11/09/2017 08:10AM]: PASS: installed-tests/js/testClass.js 11 Class framework inherits constructors from abstract base classes
 503  [11/09/2017 08:10AM]: PASS: installed-tests/js/testClass.js 12 Class framework lets methods call other methods without clobbering __caller__
 504  [11/09/2017 08:10AM]: PASS: installed-tests/js/testClass.js 13 Class framework allows custom return values from constructors
 505  [11/09/2017 08:10AM]: PASS: installed-tests/js/testClass.js 14 Class framework allows symbol-named methods
 506  [11/09/2017 08:10AM]: PASS: installed-tests/js/testCoverage.js 1 Coverage.expressionLinesForAST works with no trailing newline
 507  [11/09/2017 08:10AM]: PASS: installed-tests/js/testCoverage.js 2 Coverage.expressionLinesForAST finds lines on both sides of an assignment expression
 508  [11/09/2017 08:10AM]: PASS: installed-tests/js/testCoverage.js 3 Coverage.expressionLinesForAST finds lines inside functions
 509  [11/09/2017 08:10AM]: PASS: installed-tests/js/testCoverage.js 4 Coverage.expressionLinesForAST finds lines inside anonymous functions
 510  [11/09/2017 08:10AM]: PASS: installed-tests/js/testCoverage.js 5 Coverage.expressionLinesForAST finds lines inside body of function property
 511  [11/09/2017 08:10AM]: PASS: installed-tests/js/testCoverage.js 6 Coverage.expressionLinesForAST finds lines inside arguments of function property
 512  [11/09/2017 08:10AM]: PASS: installed-tests/js/testCoverage.js 7 Coverage.expressionLinesForAST finds lines inside multiline function arguments
 513  [11/09/2017 08:10AM]: PASS: installed-tests/js/testCoverage.js 8 Coverage.expressionLinesForAST finds lines inside function argument that is an object
 514  [11/09/2017 08:10AM]: PASS: installed-tests/js/testCoverage.js 9 Coverage.expressionLinesForAST finds lines inside a while loop
 515  [11/09/2017 08:10AM]: PASS: installed-tests/js/testCoverage.js 10 Coverage.expressionLinesForAST finds lines inside try, catch, and finally
 516  [11/09/2017 08:10AM]: PASS: installed-tests/js/testCoverage.js 11 Coverage.expressionLinesForAST finds lines inside case statements
 517  [11/09/2017 08:10AM]: PASS: installed-tests/js/testCoverage.js 12 Coverage.expressionLinesForAST finds lines inside case statements with character cases
 518  [11/09/2017 08:10AM]: PASS: installed-tests/js/testCoverage.js 13 Coverage.expressionLinesForAST finds lines inside a for loop
 519  [11/09/2017 08:10AM]: PASS: installed-tests/js/testCoverage.js 14 Coverage.expressionLinesForAST finds lines inside if-statement branches
 520  [11/09/2017 08:10AM]: PASS: installed-tests/js/testCoverage.js 15 Coverage.expressionLinesForAST finds all lines of multiline if-conditions
 521  [11/09/2017 08:10AM]: PASS: installed-tests/js/testCoverage.js 16 Coverage.expressionLinesForAST finds lines for object property literals
 522  [11/09/2017 08:10AM]: PASS: installed-tests/js/testCoverage.js 17 Coverage.expressionLinesForAST finds lines for function-valued object properties
 523  [11/09/2017 08:10AM]: PASS: installed-tests/js/testCoverage.js 18 Coverage.expressionLinesForAST finds lines inside object-valued object properties
 524  [11/09/2017 08:10AM]: PASS: installed-tests/js/testCoverage.js 19 Coverage.expressionLinesForAST finds lines inside array-valued object properties
 525  [11/09/2017 08:10AM]: PASS: installed-tests/js/testCoverage.js 20 Coverage.expressionLinesForAST finds lines inside object-valued argument to return statement
 526  [11/09/2017 08:10AM]: PASS: installed-tests/js/testCoverage.js 21 Coverage.expressionLinesForAST finds lines inside object-valued argument to throw statement
 527  [11/09/2017 08:10AM]: PASS: installed-tests/js/testCoverage.js 22 Coverage.functionsForAST works with no trailing newline
 528  [11/09/2017 08:10AM]: PASS: installed-tests/js/testCoverage.js 23 Coverage.functionsForAST finds functions
 529  [11/09/2017 08:10AM]: PASS: installed-tests/js/testCoverage.js 24 Coverage.functionsForAST finds nested functions
 530  [11/09/2017 08:10AM]: PASS: installed-tests/js/testCoverage.js 25 Coverage.functionsForAST finds functions on the same line but with different arguments
 531  [11/09/2017 08:10AM]: PASS: installed-tests/js/testCoverage.js 26 Coverage.functionsForAST finds functions inside an array expression
 532  [11/09/2017 08:10AM]: PASS: installed-tests/js/testCoverage.js 27 Coverage.functionsForAST finds functions inside an arrow expression
 533  [11/09/2017 08:10AM]: PASS: installed-tests/js/testCoverage.js 28 Coverage.functionsForAST finds functions inside a sequence
 534  [11/09/2017 08:10AM]: PASS: installed-tests/js/testCoverage.js 29 Coverage.functionsForAST finds functions inside a unary expression
 535  [11/09/2017 08:10AM]: PASS: installed-tests/js/testCoverage.js 30 Coverage.functionsForAST finds functions inside a binary expression
 536  [11/09/2017 08:10AM]: PASS: installed-tests/js/testCoverage.js 31 Coverage.functionsForAST finds functions inside an assignment expression
 537  [11/09/2017 08:10AM]: PASS: installed-tests/js/testCoverage.js 32 Coverage.functionsForAST finds functions inside a reflexive assignment expression
 538  [11/09/2017 08:10AM]: PASS: installed-tests/js/testCoverage.js 33 Coverage.functionsForAST finds functions inside if-statement conditions
 539  [11/09/2017 08:10AM]: PASS: installed-tests/js/testCoverage.js 34 Coverage.functionsForAST finds functions inside while-statement conditions
 540  [11/09/2017 08:10AM]: PASS: installed-tests/js/testCoverage.js 35 Coverage.functionsForAST finds functions inside for-statement initializer
 541  [11/09/2017 08:10AM]: PASS: installed-tests/js/testCoverage.js 36 Coverage.functionsForAST finds functions inside let-statement in for-statement initializer
 542  [11/09/2017 08:10AM]: PASS: installed-tests/js/testCoverage.js 37 Coverage.functionsForAST finds functions inside var-statement inside for-statement initializer
 543  [11/09/2017 08:10AM]: PASS: installed-tests/js/testCoverage.js 38 Coverage.functionsForAST finds functions inside for-statement condition
 544  [11/09/2017 08:10AM]: PASS: installed-tests/js/testCoverage.js 39 Coverage.functionsForAST finds functions inside for-statement increment
 545  [11/09/2017 08:10AM]: PASS: installed-tests/js/testCoverage.js 40 Coverage.functionsForAST finds functions inside for-in-statement
 546  [11/09/2017 08:10AM]: PASS: installed-tests/js/testCoverage.js 41 Coverage.functionsForAST finds functions inside for-each statement
 547  [11/09/2017 08:10AM]: PASS: installed-tests/js/testCoverage.js 42 Coverage.functionsForAST finds functions inside for-of statement
 548  [11/09/2017 08:10AM]: PASS: installed-tests/js/testCoverage.js 43 Coverage.functionsForAST finds function literals used as an object
 549  [11/09/2017 08:10AM]: PASS: installed-tests/js/testCoverage.js 44 Coverage.functionsForAST finds function literals used as an object in a dynamic property expression
 550  [11/09/2017 08:10AM]: PASS: installed-tests/js/testCoverage.js 45 Coverage.functionsForAST finds functions on either side of a logical expression
 551  [11/09/2017 08:10AM]: PASS: installed-tests/js/testCoverage.js 46 Coverage.functionsForAST finds functions on either side of a conditional expression
 552  [11/09/2017 08:10AM]: PASS: installed-tests/js/testCoverage.js 47 Coverage.functionsForAST finds functions as the argument of a yield statement
 553  [11/09/2017 08:10AM]: PASS: installed-tests/js/testCoverage.js 48 Coverage.functionsForAST finds functions in an array comprehension body
 554  [11/09/2017 08:10AM]: PASS: installed-tests/js/testCoverage.js 49 Coverage.functionsForAST finds functions in an array comprehension block
 555  [11/09/2017 08:10AM]: PASS: installed-tests/js/testCoverage.js 50 Coverage.functionsForAST finds functions in an array comprehension filter
 556  [11/09/2017 08:10AM]: PASS: installed-tests/js/testCoverage.js 51 Coverage.branchesForAST works with no trailing newline
 557  [11/09/2017 08:10AM]: PASS: installed-tests/js/testCoverage.js 52 Coverage.branchesForAST finds both branch exits for a simple branch
 558  [11/09/2017 08:10AM]: PASS: installed-tests/js/testCoverage.js 53 Coverage.branchesForAST finds a single exit for a branch with one consequent
 559  [11/09/2017 08:10AM]: PASS: installed-tests/js/testCoverage.js 54 Coverage.branchesForAST finds multiple exits for nested if-else branches
 560  [11/09/2017 08:10AM]: PASS: installed-tests/js/testCoverage.js 55 Coverage.branchesForAST finds a simple two-exit branch without blocks
 561  [11/09/2017 08:10AM]: PASS: installed-tests/js/testCoverage.js 56 Coverage.branchesForAST does not find a branch if the consequent was empty
 562  [11/09/2017 08:10AM]: PASS: installed-tests/js/testCoverage.js 57 Coverage.branchesForAST finds a single exit if only the alternate exit was defined
 563  [11/09/2017 08:10AM]: PASS: installed-tests/js/testCoverage.js 58 Coverage.branchesForAST finds an implicit branch for while statement
 564  [11/09/2017 08:10AM]: PASS: installed-tests/js/testCoverage.js 59 Coverage.branchesForAST finds an implicit branch for a do-while statement
 565  [11/09/2017 08:10AM]: PASS: installed-tests/js/testCoverage.js 60 Coverage.branchesForAST finds all exits for case statements
 566  [11/09/2017 08:10AM]: PASS: installed-tests/js/testCoverage.js 61 Coverage.branchesForAST finds all exits for case statements with fallthrough
 567  [11/09/2017 08:10AM]: PASS: installed-tests/js/testCoverage.js 62 Coverage.branchesForAST finds no exits for case statements with only no-ops
 568  [11/09/2017 08:10AM]: PASS: installed-tests/js/testCoverage.js 63 Coverage gets the number of lines in the script
 569  [11/09/2017 08:10AM]: PASS: installed-tests/js/testCoverage.js 64 Coverage turns zero expression lines into counters
 570  [11/09/2017 08:10AM]: PASS: installed-tests/js/testCoverage.js 65 Coverage turns a single expression line into counters
 571  [11/09/2017 08:10AM]: PASS: installed-tests/js/testCoverage.js 66 Coverage returns empty array for no branches
 572  [11/09/2017 08:10AM]: PASS: installed-tests/js/testCoverage.js 67 Coverage branch counters gets same number of counters as number of lines plus one
 573  [11/09/2017 08:10AM]: PASS: installed-tests/js/testCoverage.js 68 Coverage branch counters branches on lines for array indices
 574  [11/09/2017 08:10AM]: PASS: installed-tests/js/testCoverage.js 69 Coverage branch counters sets exits for branch
 575  [11/09/2017 08:10AM]: PASS: installed-tests/js/testCoverage.js 70 Coverage branch counters sets last exit to highest exit start line
 576  [11/09/2017 08:10AM]: PASS: installed-tests/js/testCoverage.js 71 Coverage branch counters always has hit initially false
 577  [11/09/2017 08:10AM]: PASS: installed-tests/js/testCoverage.js 72 Coverage branch counters branch tracker sets branch to hit on point execution
 578  [11/09/2017 08:10AM]: PASS: installed-tests/js/testCoverage.js 73 Coverage branch counters branch tracker sets exit to hit on execution
 579  [11/09/2017 08:10AM]: PASS: installed-tests/js/testCoverage.js 74 Coverage branch counters branch tracker finds next branch
 580  [11/09/2017 08:10AM]: PASS: installed-tests/js/testCoverage.js 75 Coverage function key from function with name matches schema
 581  [11/09/2017 08:10AM]: PASS: installed-tests/js/testCoverage.js 76 Coverage function key from function without name is anonymous
 582  [11/09/2017 08:10AM]: PASS: installed-tests/js/testCoverage.js 77 Coverage returns a function counter map for function keys
 583  [11/09/2017 08:10AM]: PASS: installed-tests/js/testCoverage.js 78 Coverage reports an error when two indistinguishable functions are present
 584  [11/09/2017 08:10AM]: PASS: installed-tests/js/testCoverage.js 79 Coverage populates a known functions array
 585  [11/09/2017 08:10AM]: PASS: installed-tests/js/testCoverage.js 80 Coverage converts function counters to an array
 586  [11/09/2017 08:10AM]: PASS: installed-tests/js/testCoverage.js 81 Coverage.incrementFunctionCounters increments for function on same execution start line
 587  [11/09/2017 08:10AM]: PASS: installed-tests/js/testCoverage.js 82 Coverage.incrementFunctionCounters can disambiguate two functions with the same name
 588  [11/09/2017 08:10AM]: PASS: installed-tests/js/testCoverage.js 83 Coverage.incrementFunctionCounters can disambiguate two functions on same line with different params
 589  [11/09/2017 08:10AM]: PASS: installed-tests/js/testCoverage.js 84 Coverage.incrementFunctionCounters can disambiguate two functions on same line by guessing closest params
 590  [11/09/2017 08:10AM]: PASS: installed-tests/js/testCoverage.js 85 Coverage.incrementFunctionCounters increments for function on earlier start line
 591  [11/09/2017 08:10AM]: PASS: installed-tests/js/testCoverage.js 86 Coverage.incrementFunctionCounters throws an error on unexpected function
 592  [11/09/2017 08:10AM]: PASS: installed-tests/js/testCoverage.js 87 Coverage.incrementFunctionCounters throws if line out of range
 593  [11/09/2017 08:10AM]: PASS: installed-tests/js/testCoverage.js 88 Coverage.incrementFunctionCounters increments if in range
 594  [11/09/2017 08:10AM]: PASS: installed-tests/js/testCoverage.js 89 Coverage.incrementFunctionCounters warns if we hit a non-executable line
 595  [11/09/2017 08:10AM]: PASS: installed-tests/js/testCoverage.js 90 Coverage statistics container fetches valid statistics for file
 596  [11/09/2017 08:10AM]: PASS: installed-tests/js/testCoverage.js 91 Coverage statistics container throws for nonexisting file
 597  [11/09/2017 08:10AM]: PASS: installed-tests/js/testCoverage.js 92 Coverage statistics container with cache fetches counters from cache
 598  [11/09/2017 08:10AM]: PASS: installed-tests/js/testCoverage.js 93 Coverage statistics container with cache fetches counters from reflection if missed
 599  [11/09/2017 08:10AM]: PASS: installed-tests/js/testCoverage.js 94 Coverage statistics container with cache cache is not stale if all hit
 600  [11/09/2017 08:10AM]: PASS: installed-tests/js/testCoverage.js 95 Coverage statistics container with cache cache is stale if missed
 601  [11/09/2017 08:10AM]: PASS: installed-tests/js/testCoverage.js 96 Coverage statistics container coverage counters from cache have same executable lines as reflection
 602  [11/09/2017 08:10AM]: PASS: installed-tests/js/testCoverage.js 97 Coverage statistics container coverage counters from cache have same branch exits as reflection
 603  [11/09/2017 08:10AM]: PASS: installed-tests/js/testCoverage.js 98 Coverage statistics container coverage counters from cache have same branch points as reflection
 604  [11/09/2017 08:10AM]: PASS: installed-tests/js/testCoverage.js 99 Coverage statistics container coverage counters from cache have same function keys as reflection
 605  [11/09/2017 08:10AM]: PASS: installed-tests/js/testExceptions.js 1 Exceptions are thrown from property setter
 606  [11/09/2017 08:10AM]: PASS: installed-tests/js/testExceptions.js 2 Exceptions are thrown from property getter
 607  [11/09/2017 08:10AM]: ERROR: installed-tests/js/testExceptions.js - too few tests run (expected 17, got 2)
 608  [11/09/2017 08:10AM]: ERROR: installed-tests/js/testExceptions.js - exited with status 133 (terminated by signal 5?)
 609  [11/09/2017 08:10AM]: PASS: installed-tests/js/testEverythingBasic.js 1 Life, the Universe and Everything includes booleans
 610  [11/09/2017 08:10AM]: PASS: installed-tests/js/testEverythingBasic.js 2 Life, the Universe and Everything includes 8-bit integers
 611  [11/09/2017 08:10AM]: PASS: installed-tests/js/testEverythingBasic.js 3 Life, the Universe and Everything includes unsigned 8-bit integers
 612  [11/09/2017 08:10AM]: PASS: installed-tests/js/testEverythingBasic.js 4 Life, the Universe and Everything includes 16-bit integers
 613  [11/09/2017 08:10AM]: PASS: installed-tests/js/testEverythingBasic.js 5 Life, the Universe and Everything includes unsigned 16-bit integers
 614  [11/09/2017 08:10AM]: PASS: installed-tests/js/testEverythingBasic.js 6 Life, the Universe and Everything includes 32-bit integers
 615  [11/09/2017 08:10AM]: PASS: installed-tests/js/testEverythingBasic.js 7 Life, the Universe and Everything includes unsigned 32-bit integers
 616  [11/09/2017 08:10AM]: PASS: installed-tests/js/testEverythingBasic.js 8 Life, the Universe and Everything includes 64-bit integers
 617  [11/09/2017 08:10AM]: PASS: installed-tests/js/testEverythingBasic.js 9 Life, the Universe and Everything includes unsigned 64-bit integers
 618  [11/09/2017 08:10AM]: PASS: installed-tests/js/testEverythingBasic.js 10 Life, the Universe and Everything includes shorts
 619  [11/09/2017 08:10AM]: PASS: installed-tests/js/testEverythingBasic.js 11 Life, the Universe and Everything includes ints
 620  [11/09/2017 08:10AM]: PASS: installed-tests/js/testEverythingBasic.js 12 Life, the Universe and Everything includes longs
 621  [11/09/2017 08:10AM]: PASS: installed-tests/js/testEverythingBasic.js 13 Life, the Universe and Everything includes ssizes
 622  [11/09/2017 08:10AM]: PASS: installed-tests/js/testEverythingBasic.js 14 Life, the Universe and Everything includes floats
 623  [11/09/2017 08:10AM]: PASS: installed-tests/js/testEverythingBasic.js 15 Life, the Universe and Everything includes doubles
 624  [11/09/2017 08:10AM]: PASS: installed-tests/js/testEverythingBasic.js 16 Life, the Universe and Everything includes ushorts
 625  [11/09/2017 08:10AM]: PASS: installed-tests/js/testEverythingBasic.js 17 Life, the Universe and Everything includes uints
 626  [11/09/2017 08:10AM]: PASS: installed-tests/js/testEverythingBasic.js 18 Life, the Universe and Everything includes ulongs
 627  [11/09/2017 08:10AM]: PASS: installed-tests/js/testEverythingBasic.js 19 Life, the Universe and Everything includes sizes
 628  [11/09/2017 08:10AM]: PASS: installed-tests/js/testEverythingBasic.js 20 Life, the Universe and Everything includes wide characters
 629  [11/09/2017 08:10AM]: PASS: installed-tests/js/testEverythingBasic.js 21 Life, the Universe and Everything includes time_t
 630  [11/09/2017 08:10AM]: PASS: installed-tests/js/testEverythingBasic.js 22 Life, the Universe and Everything Limits marshals max value of unsigned 8-bit integers
 631  [11/09/2017 08:10AM]: PASS: installed-tests/js/testEverythingBasic.js 23 Life, the Universe and Everything Limits marshals min value of signed 8-bit integers
 632  [11/09/2017 08:10AM]: PASS: installed-tests/js/testEverythingBasic.js 24 Life, the Universe and Everything Limits marshals max value of signed 8-bit integers
 633  [11/09/2017 08:10AM]: PASS: installed-tests/js/testEverythingBasic.js 25 Life, the Universe and Everything Limits marshals max value of unsigned 16-bit integers
 634  [11/09/2017 08:10AM]: PASS: installed-tests/js/testEverythingBasic.js 26 Life, the Universe and Everything Limits marshals min value of signed 16-bit integers
 635  [11/09/2017 08:10AM]: PASS: installed-tests/js/testEverythingBasic.js 27 Life, the Universe and Everything Limits marshals max value of signed 16-bit integers
 636  [11/09/2017 08:10AM]: PASS: installed-tests/js/testEverythingBasic.js 28 Life, the Universe and Everything Limits marshals max value of unsigned 32-bit integers
 637  [11/09/2017 08:10AM]: PASS: installed-tests/js/testEverythingBasic.js 29 Life, the Universe and Everything Limits marshals min value of signed 32-bit integers
 638  [11/09/2017 08:10AM]: PASS: installed-tests/js/testEverythingBasic.js 30 Life, the Universe and Everything Limits marshals max value of signed 32-bit integers
 639  [11/09/2017 08:10AM]: SKIP: installed-tests/js/testEverythingBasic.js 31 Life, the Universe and Everything Limits marshals max value of unsigned 64-bit integers # SKIP This test doesnt work
 640  [11/09/2017 08:10AM]: PASS: installed-tests/js/testEverythingBasic.js 32 Life, the Universe and Everything Limits marshals min value of signed 64-bit integers
 641  [11/09/2017 08:10AM]: SKIP: installed-tests/js/testEverythingBasic.js 33 Life, the Universe and Everything Limits marshals max value of signed 64-bit integers # SKIP This test doesnt work
 642  [11/09/2017 08:10AM]: ERROR: installed-tests/js/testEverythingBasic.js - too few tests run (expected 132, got 33)
 643  [11/09/2017 08:10AM]: ERROR: installed-tests/js/testEverythingBasic.js - exited with status 133 (terminated by signal 5?)
 644  [11/09/2017 08:10AM]: PASS: installed-tests/js/testEverythingEncapsulated.js 1 Introspected structs simple sets fields correctly
 645  [11/09/2017 08:10AM]: PASS: installed-tests/js/testEverythingEncapsulated.js 2 Introspected structs simple can clone
 646  [11/09/2017 08:10AM]: PASS: installed-tests/js/testEverythingEncapsulated.js 3 Introspected structs nested sets fields correctly
 647  [11/09/2017 08:10AM]: PASS: installed-tests/js/testEverythingEncapsulated.js 4 Introspected structs nested can clone
 648  [11/09/2017 08:10AM]: PASS: installed-tests/js/testEverythingEncapsulated.js 5 Introspected structs constructors copies an object from a hash of field values
 649  [11/09/2017 08:10AM]: PASS: installed-tests/js/testEverythingEncapsulated.js 6 Introspected structs constructors catches bad field names
 650  [11/09/2017 08:10AM]: PASS: installed-tests/js/testEverythingEncapsulated.js 7 Introspected structs constructors copies an object from another object of the same type
 651  [11/09/2017 08:10AM]: PASS: installed-tests/js/testEverythingEncapsulated.js 8 Introspected structs containing fixed array
 652  [11/09/2017 08:10AM]: PASS: installed-tests/js/testEverythingEncapsulated.js 9 Introspected boxed types sets fields correctly
 653  [11/09/2017 08:10AM]: PASS: installed-tests/js/testEverythingEncapsulated.js 10 Introspected boxed types copy constructors copies an object from a hash of field values
 654  [11/09/2017 08:10AM]: PASS: installed-tests/js/testEverythingEncapsulated.js 11 Introspected boxed types copy constructors catches bad field names
 655  [11/09/2017 08:10AM]: PASS: installed-tests/js/testEverythingEncapsulated.js 12 Introspected boxed types copy constructors copies an object from another object of the same type
 656  [11/09/2017 08:10AM]: PASS: installed-tests/js/testEverythingEncapsulated.js 13 Introspected boxed types nested reads fields and nested fields
 657  [11/09/2017 08:10AM]: PASS: installed-tests/js/testEverythingEncapsulated.js 14 Introspected boxed types nested assigns nested struct field from an instance
 658  [11/09/2017 08:10AM]: PASS: installed-tests/js/testEverythingEncapsulated.js 15 Introspected boxed types nested assigns nested struct field directly from a hash of field values
 659  [11/09/2017 08:10AM]: PASS: installed-tests/js/testEverythingEncapsulated.js 16 Introspected boxed types constructs with a nested hash of field values
 660  [11/09/2017 08:10AM]: PASS: installed-tests/js/testEverythingEncapsulated.js 17 Introspected boxed types constructs using a custom constructor
 661  [11/09/2017 08:10AM]: PASS: installed-tests/js/testEverythingEncapsulated.js 18 Introspected boxed types constructs using a custom constructor in backwards compatibility mode
 662  [11/09/2017 08:10AM]: PASS: installed-tests/js/testEverythingEncapsulated.js 19 Introspected GObject can access fields with simple types
 663  [11/09/2017 08:10AM]: PASS: installed-tests/js/testEverythingEncapsulated.js 20 Introspected GObject cannot access fields with complex types (GI limitation)
 664  [11/09/2017 08:10AM]: PASS: installed-tests/js/testEverythingEncapsulated.js 21 Introspected GObject silently does not set read-only fields
 665  [11/09/2017 08:10AM]: PASS: installed-tests/js/testEverythingEncapsulated.js 22 Introspected GObject throws an error in strict mode when setting a read-only field
 666  [11/09/2017 08:10AM]: PASS: installed-tests/js/testEverythingEncapsulated.js 23 Introspected GObject has normal Object methods
 667  [11/09/2017 08:10AM]: PASS: installed-tests/js/testEverythingEncapsulated.js 24 Introspected function length skips over instance parameters of methods
 668  [11/09/2017 08:10AM]: PASS: installed-tests/js/testEverythingEncapsulated.js 25 Introspected function length skips over out and GError parameters
 669  [11/09/2017 08:10AM]: PASS: installed-tests/js/testEverythingEncapsulated.js 26 Introspected function length does not skip over inout parameters
 670  [11/09/2017 08:10AM]: SKIP: installed-tests/js/testEverythingEncapsulated.js 27 Introspected function length skips over parameters annotated with skip # SKIP Not implemented yet
 671  [11/09/2017 08:10AM]: PASS: installed-tests/js/testEverythingEncapsulated.js 28 Introspected function length gives number of arguments for static methods
 672  [11/09/2017 08:10AM]: PASS: installed-tests/js/testEverythingEncapsulated.js 29 Introspected function length skips over destroy-notify and user-data parameters
 673  [11/09/2017 08:10AM]: PASS: installed-tests/js/testEverythingEncapsulated.js 30 Garbage collection of introspected objects collects objects properly with signals connected
 674  [11/09/2017 08:10AM]: PASS: installed-tests/js/testFormat.js 1 imports.format escapes % with another % character
 675  [11/09/2017 08:10AM]: PASS: installed-tests/js/testFormat.js 2 imports.format formats a single string argument
 676  [11/09/2017 08:10AM]: PASS: installed-tests/js/testFormat.js 3 imports.format formats two string arguments
 677  [11/09/2017 08:10AM]: PASS: installed-tests/js/testFormat.js 4 imports.format formats two swapped string arguments
 678  [11/09/2017 08:10AM]: PASS: installed-tests/js/testFormat.js 5 imports.format formats a number in base 10
 679  [11/09/2017 08:10AM]: PASS: installed-tests/js/testFormat.js 6 imports.format formats a number in base 16
 680  [11/09/2017 08:10AM]: PASS: installed-tests/js/testFormat.js 7 imports.format formats a floating point number with no precision
 681  [11/09/2017 08:10AM]: PASS: installed-tests/js/testFormat.js 8 imports.format formats a floating point number with precision 2
 682  [11/09/2017 08:10AM]: PASS: installed-tests/js/testFormat.js 9 imports.format pads with zeroes
 683  [11/09/2017 08:10AM]: PASS: installed-tests/js/testFormat.js 10 imports.format pads with spaces
 684  [11/09/2017 08:10AM]: PASS: installed-tests/js/testFormat.js 11 imports.format throws an error when given incorrect modifiers for the conversion type
 685  [11/09/2017 08:10AM]: PASS: installed-tests/js/testFormat.js 12 imports.format throws an error when incorrectly instructed to swap arguments
 686  [11/09/2017 08:10AM]: PASS: installed-tests/js/testFundamental.js 1 Fundamental type support constructs a subtype of a fundamental type
 687  [11/09/2017 08:10AM]: PASS: installed-tests/js/testFundamental.js 2 Fundamental type support constructs a subtype of a hidden (no introspection data) fundamental type
 688  [11/09/2017 08:10AM]: PASS: installed-tests/js/testGettext.js 1 Gettext module setlocale returns a locale
 689  [11/09/2017 08:10AM]: PASS: installed-tests/js/testGIMarshalling.js 1 C array can be passed to a function
 690  [11/09/2017 08:10AM]: PASS: installed-tests/js/testGIMarshalling.js 2 C array can be passed to a function with its length parameter before it
 691  [11/09/2017 08:10AM]: PASS: installed-tests/js/testGIMarshalling.js 3 C array can be passed to a function with zero terminator
 692  [11/09/2017 08:10AM]: PASS: installed-tests/js/testGIMarshalling.js 4 C array can be passed to a function in the style of gtk_init()
 693  [11/09/2017 08:10AM]: PASS: installed-tests/js/testGIMarshalling.js 5 C array can be returned with zero terminator
 694  [11/09/2017 08:10AM]: PASS: installed-tests/js/testGIMarshalling.js 6 C array can be returned
 695  [11/09/2017 08:10AM]: PASS: installed-tests/js/testGIMarshalling.js 7 C array can be returned along with other arguments
 696  [11/09/2017 08:10AM]: PASS: installed-tests/js/testGIMarshalling.js 8 C array can be an out argument
 697  [11/09/2017 08:10AM]: PASS: installed-tests/js/testGIMarshalling.js 9 C array can be an out argument along with other arguments
 698  [11/09/2017 08:10AM]: PASS: installed-tests/js/testGIMarshalling.js 10 C array can be an in-out argument
 699  [11/09/2017 08:10AM]: PASS: installed-tests/js/testGIMarshalling.js 11 C array can be an in-out argument along with other arguments
 700  [11/09/2017 08:10AM]: PASS: installed-tests/js/testGIMarshalling.js 12 C array copies correctly on transfer full
 701  [11/09/2017 08:10AM]: PASS: installed-tests/js/testGIMarshalling.js 13 C array of structs can be passed to a function
 702  [11/09/2017 08:10AM]: PASS: installed-tests/js/testGIMarshalling.js 14 C array of structs can be returned with zero terminator
 703  [11/09/2017 08:10AM]: PASS: installed-tests/js/testGIMarshalling.js 15 C array of booleans is coerced to true/false when passed to a function
 704  [11/09/2017 08:10AM]: PASS: installed-tests/js/testGIMarshalling.js 16 C array of booleans can be an out argument
 705  [11/09/2017 08:10AM]: PASS: installed-tests/js/testGIMarshalling.js 17 C array of unichars can be passed to a function
 706  [11/09/2017 08:10AM]: PASS: installed-tests/js/testGIMarshalling.js 18 C array of unichars can be an out argument
 707  [11/09/2017 08:10AM]: PASS: installed-tests/js/testGIMarshalling.js 19 C array of unichars can be returned with zero terminator
 708  [11/09/2017 08:10AM]: PASS: installed-tests/js/testGIMarshalling.js 20 C array of unichars can be implicitly converted from a number array
 709  [11/09/2017 08:10AM]: PASS: installed-tests/js/testGIMarshalling.js 21 C array of strings can be passed to a function
 710  [11/09/2017 08:10AM]: PASS: installed-tests/js/testGIMarshalling.js 22 C array of enums can be passed to a function
 711  [11/09/2017 08:10AM]: PASS: installed-tests/js/testGIMarshalling.js 23 C array of bytes can be an in argument with length
 712  [11/09/2017 08:10AM]: PASS: installed-tests/js/testGIMarshalling.js 24 C array of bytes can be implicitly converted from a string
 713  [11/09/2017 08:10AM]: PASS: installed-tests/js/testGIMarshalling.js 25 C array of 64-bit ints can be passed to a function
 714  [11/09/2017 08:10AM]: PASS: installed-tests/js/testGIMarshalling.js 26 C array of 64-bit ints can be an in argument with length
 715  [11/09/2017 08:10AM]: PASS: installed-tests/js/testGIMarshalling.js 27 GArray of integers can be passed in with transfer none
 716  [11/09/2017 08:10AM]: PASS: installed-tests/js/testGIMarshalling.js 28 GArray of integers can be returned with transfer none
 717  [11/09/2017 08:10AM]: PASS: installed-tests/js/testGIMarshalling.js 29 GArray of strings can be passed in with transfer none
 718  [11/09/2017 08:10AM]: PASS: installed-tests/js/testGIMarshalling.js 30 GArray of strings can be passed as return with transfer none
 719  [11/09/2017 08:10AM]: PASS: installed-tests/js/testGIMarshalling.js 31 GArray of strings can be passed as return with transfer container
 720  [11/09/2017 08:10AM]: PASS: installed-tests/js/testGIMarshalling.js 32 GArray of strings can be passed as return with transfer full
 721  [11/09/2017 08:10AM]: PASS: installed-tests/js/testGIMarshalling.js 33 GArray of strings can be passed as out with transfer none
 722  [11/09/2017 08:10AM]: PASS: installed-tests/js/testGIMarshalling.js 34 GArray of strings can be passed as out with transfer container
 723  [11/09/2017 08:10AM]: PASS: installed-tests/js/testGIMarshalling.js 35 GArray of strings can be passed as out with transfer full
 724  [11/09/2017 08:10AM]: PASS: installed-tests/js/testGIMarshalling.js 36 GArray of booleans can be passed in with transfer none
 725  [11/09/2017 08:10AM]: PASS: installed-tests/js/testGIMarshalling.js 37 GArray of unichars can be passed in with transfer none
 726  [11/09/2017 08:10AM]: PASS: installed-tests/js/testGIMarshalling.js 38 GArray of unichars can be implicitly converted from a number array
 727  [11/09/2017 08:10AM]: PASS: installed-tests/js/testGIMarshalling.js 39 GByteArray can be passed in with transfer none
 728  [11/09/2017 08:10AM]: PASS: installed-tests/js/testGIMarshalling.js 40 GByteArray can be returned with transfer full
 729  [11/09/2017 08:10AM]: PASS: installed-tests/js/testGIMarshalling.js 41 GByteArray can be implicitly converted from a normal array
 730  [11/09/2017 08:10AM]: PASS: installed-tests/js/testGIMarshalling.js 42 GBytes can be created from an array and passed in
 731  [11/09/2017 08:10AM]: PASS: installed-tests/js/testGIMarshalling.js 43 GBytes can be created by returning from a function and passed in
 732  [11/09/2017 08:10AM]: PASS: installed-tests/js/testGIMarshalling.js 44 GBytes can be implicitly converted from a ByteArray
 733  [11/09/2017 08:10AM]: PASS: installed-tests/js/testGIMarshalling.js 45 GBytes can be created from a string and is encoded in UTF-8
 734  [11/09/2017 08:10AM]: PASS: installed-tests/js/testGIMarshalling.js 46 GBytes turns into a GByteArray on assignment
 735  [11/09/2017 08:10AM]: PASS: installed-tests/js/testGIMarshalling.js 47 GBytes cannot be passed to a function expecting a byte array
 736  [11/09/2017 08:10AM]: PASS: installed-tests/js/testGIMarshalling.js 48 GPtrArray can be passed to a function with transfer none
 737  [11/09/2017 08:10AM]: PASS: installed-tests/js/testGIMarshalling.js 49 GPtrArray can be passed as return with transfer none
 738  [11/09/2017 08:10AM]: PASS: installed-tests/js/testGIMarshalling.js 50 GPtrArray can be passed as return with transfer container
 739  [11/09/2017 08:10AM]: PASS: installed-tests/js/testGIMarshalling.js 51 GPtrArray can be passed as return with transfer full
 740  [11/09/2017 08:10AM]: PASS: installed-tests/js/testGIMarshalling.js 52 GPtrArray can be passed as out with transfer none
 741  [11/09/2017 08:10AM]: PASS: installed-tests/js/testGIMarshalling.js 53 GPtrArray can be passed as out with transfer container
 742  [11/09/2017 08:10AM]: PASS: installed-tests/js/testGIMarshalling.js 54 GPtrArray can be passed as out with transfer full
 743  [11/09/2017 08:10AM]: PASS: installed-tests/js/testGIMarshalling.js 55 GHashTable can be passed in with integer value type
 744  [11/09/2017 08:10AM]: PASS: installed-tests/js/testGIMarshalling.js 56 GHashTable can be passed in with string value type
 745  [11/09/2017 08:10AM]: PASS: installed-tests/js/testGIMarshalling.js 57 GHashTable can be passed in with float value type
 746  [11/09/2017 08:10AM]: PASS: installed-tests/js/testGIMarshalling.js 58 GHashTable can be passed in with double value type
 747  [11/09/2017 08:10AM]: PASS: installed-tests/js/testGIMarshalling.js 59 GHashTable can be passed in with int64 value type
 748  [11/09/2017 08:10AM]: PASS: installed-tests/js/testGIMarshalling.js 60 GHashTable can be passed in with uint64 value type
 749  [11/09/2017 08:10AM]: PASS: installed-tests/js/testGIMarshalling.js 61 GHashTable can be returned with integer value type
 750  [11/09/2017 08:10AM]: PASS: installed-tests/js/testGIMarshalling.js 62 GHashTable can be passed as return with transfer none
 751  [11/09/2017 08:10AM]: PASS: installed-tests/js/testGIMarshalling.js 63 GHashTable can be passed as return with transfer container
 752  [11/09/2017 08:10AM]: PASS: installed-tests/js/testGIMarshalling.js 64 GHashTable can be passed as return with transfer full
 753  [11/09/2017 08:10AM]: PASS: installed-tests/js/testGIMarshalling.js 65 GHashTable can be passed as out with transfer none
 754  [11/09/2017 08:10AM]: PASS: installed-tests/js/testGIMarshalling.js 66 GHashTable can be passed as out with transfer container
 755  [11/09/2017 08:10AM]: PASS: installed-tests/js/testGIMarshalling.js 67 GHashTable can be passed as out with transfer full
 756  [11/09/2017 08:10AM]: PASS: installed-tests/js/testGIMarshalling.js 68 GHashTable can be passed as inout with transfer none
 757  [11/09/2017 08:10AM]: SKIP: installed-tests/js/testGIMarshalling.js 69 GHashTable can be passed as inout with transfer container # SKIP Container transfer for in parameters not supported
 758  [11/09/2017 08:10AM]: SKIP: installed-tests/js/testGIMarshalling.js 70 GHashTable can be passed as inout with transfer full # SKIP https://bugzilla.gnome.org/show_bug.cgi?id=773763
 759  [11/09/2017 08:10AM]: PASS: installed-tests/js/testGIMarshalling.js 71 GValue can be passed into a function and packed
 760  [11/09/2017 08:10AM]: PASS: installed-tests/js/testGIMarshalling.js 72 GValue array can be passed into a function and packed
 761  [11/09/2017 08:10AM]: SKIP: installed-tests/js/testGIMarshalling.js 73 GValue enum can be passed into a function and packed # SKIP GJS doesnt support native enum types
 762  [11/09/2017 08:10AM]: PASS: installed-tests/js/testGIMarshalling.js 74 GValue can be returned and unpacked
 763  [11/09/2017 08:10AM]: PASS: installed-tests/js/testGIMarshalling.js 75 GValue can be passed as an out argument and unpacked
 764  [11/09/2017 08:10AM]: PASS: installed-tests/js/testGIMarshalling.js 76 GValue array can be passed as an out argument and unpacked
 765  [11/09/2017 08:10AM]: PASS: installed-tests/js/testGIMarshalling.js 77 GValue can have its type inferred from primitive values
 766  [11/09/2017 08:10AM]: PASS: installed-tests/js/testGIMarshalling.js 78 GValue type objects can be converted from primitive-like types
 767  [11/09/2017 08:10AM]: PASS: installed-tests/js/testGIMarshalling.js 79 GValue can have its type inferred as a GObject type
 768  [11/09/2017 08:10AM]: PASS: installed-tests/js/testGIMarshalling.js 80 GValue can have its type inferred as a superclass
 769  [11/09/2017 08:10AM]: PASS: installed-tests/js/testGIMarshalling.js 81 GValue can have its type inferred as an interface that it implements
 770  [11/09/2017 08:10AM]: PASS: installed-tests/js/testGIMarshalling.js 82 GValue can have its type inferred as a boxed type
 771  [11/09/2017 08:10AM]: PASS: installed-tests/js/testGIMarshalling.js 83 GValue can have its type inferred as GVariant
 772  [11/09/2017 08:10AM]: PASS: installed-tests/js/testGIMarshalling.js 84 GValue can have its type inferred as a union type
 773  [11/09/2017 08:10AM]: PASS: installed-tests/js/testGIMarshalling.js 85 GValue can have its type inferred as a GParamSpec
 774  [11/09/2017 08:10AM]: SKIP: installed-tests/js/testGIMarshalling.js 86 GValue can have its type inferred as a foreign struct # SKIP Errors out with not a subclass of GObject_Boxed
 775  [11/09/2017 08:10AM]: PASS: installed-tests/js/testGIMarshalling.js 87 GType can be passed into a function
 776  [11/09/2017 08:10AM]: PASS: installed-tests/js/testGIMarshalling.js 88 GType can be returned
 777  [11/09/2017 08:10AM]: PASS: installed-tests/js/testGIMarshalling.js 89 GType can be passed as an out argument
 778  [11/09/2017 08:10AM]: PASS: installed-tests/js/testGIMarshalling.js 90 GType can be passed as an inout argument
 779  [11/09/2017 08:10AM]: PASS: installed-tests/js/testGIMarshalling.js 91 GType can be implicitly converted from a JS type
 780  [11/09/2017 08:10AM]: PASS: installed-tests/js/testGIMarshalling.js 92 Callback marshals a return value
 781  [11/09/2017 08:10AM]: PASS: installed-tests/js/testGIMarshalling.js 93 Callback marshals one out parameter
 782  [11/09/2017 08:10AM]: PASS: installed-tests/js/testGIMarshalling.js 94 Callback marshals multiple out parameters
 783  [11/09/2017 08:10AM]: PASS: installed-tests/js/testGIMarshalling.js 95 Callback marshals a return value and one out parameter
 784  [11/09/2017 08:10AM]: PASS: installed-tests/js/testGIMarshalling.js 96 Callback marshals a return value and multiple out parameters
 785  [11/09/2017 08:10AM]: SKIP: installed-tests/js/testGIMarshalling.js 97 Callback marshals an array out parameter # SKIP Function not added to gobject-introspection test suite yet
 786  [11/09/2017 08:10AM]: PASS: installed-tests/js/testGIMarshalling.js 98 Virtual function marshals a return value
 787  [11/09/2017 08:10AM]: PASS: installed-tests/js/testGIMarshalling.js 99 Virtual function marshals one out parameter
 788  [11/09/2017 08:10AM]: PASS: installed-tests/js/testGIMarshalling.js 100 Virtual function marshals multiple out parameters
 789  [11/09/2017 08:10AM]: PASS: installed-tests/js/testGIMarshalling.js 101 Virtual function marshals a return value and one out parameter
 790  [11/09/2017 08:10AM]: PASS: installed-tests/js/testGIMarshalling.js 102 Virtual function marshals a return value and multiple out parameters
 791  [11/09/2017 08:10AM]: PASS: installed-tests/js/testGIMarshalling.js 103 Virtual function marshals an array out parameter
 792  [11/09/2017 08:10AM]: PASS: installed-tests/js/testGIMarshalling.js 104 Interface can be returned
 793  [11/09/2017 08:10AM]: PASS: installed-tests/js/testGIMarshalling.js 105 GObject properties can handle GValues
 794  [11/09/2017 08:10AM]: PASS: installed-tests/js/testGLib.js 1 GVariant constructor constructs a string variant
 795  [11/09/2017 08:10AM]: PASS: installed-tests/js/testGLib.js 2 GVariant constructor constructs a string variant (backwards compatible API)
 796  [11/09/2017 08:10AM]: PASS: installed-tests/js/testGLib.js 3 GVariant constructor constructs a struct variant
 797  [11/09/2017 08:10AM]: PASS: installed-tests/js/testGLib.js 4 GVariant constructor constructs a maybe variant
 798  [11/09/2017 08:10AM]: ERROR: installed-tests/js/testGObjectClass.js - Bail out! JS_EvaluateScript() failed
 799  [11/09/2017 08:10AM]: PASS: installed-tests/js/testGObjectInterface.js 1 GObject interface class can implement a Lang.Interface
 800  [11/09/2017 08:10AM]: PASS: installed-tests/js/testGObjectInterface.js 2 GObject interface throws when an interface requires a GObject interface but not GObject.Object
 801  [11/09/2017 08:10AM]: PASS: installed-tests/js/testGObjectInterface.js 3 GObject interface can be implemented by a GObject class along with a JS interface
 802  [11/09/2017 08:10AM]: PASS: installed-tests/js/testGObjectInterface.js 4 GObject interface is an instance of the interface classes
 803  [11/09/2017 08:10AM]: PASS: installed-tests/js/testGObjectInterface.js 5 GObject interface cannot be instantiated
 804  [11/09/2017 08:10AM]: PASS: installed-tests/js/testGObjectInterface.js 6 GObject interface reports its type name
 805  [11/09/2017 08:10AM]: PASS: installed-tests/js/testGObjectInterface.js 7 GObject interface can be implemented by a GObject class
 806  [11/09/2017 08:10AM]: PASS: installed-tests/js/testGObjectInterface.js 8 GObject interface is implemented by a GObject class with the correct class object
 807  [11/09/2017 08:10AM]: PASS: installed-tests/js/testGObjectInterface.js 9 GObject interface can be implemented by a class also implementing a Lang.Interface
 808  [11/09/2017 08:10AM]: PASS: installed-tests/js/testGObjectInterface.js 10 GObject interface can have its required function implemented
 809  [11/09/2017 08:10AM]: PASS: installed-tests/js/testGObjectInterface.js 11 GObject interface must have its required function implemented
 810  [11/09/2017 08:10AM]: PASS: installed-tests/js/testGObjectInterface.js 12 GObject interface doesnt have to have its optional function implemented
 811  [11/09/2017 08:10AM]: PASS: installed-tests/js/testGObjectInterface.js 13 GObject interface can have its optional function deferred to by the implementation
 812  [11/09/2017 08:10AM]: PASS: installed-tests/js/testGObjectInterface.js 14 GObject interface can have its function chained up to
 813  [11/09/2017 08:10AM]: PASS: installed-tests/js/testGObjectInterface.js 15 GObject interface can require another interface
 814  [11/09/2017 08:10AM]: PASS: installed-tests/js/testGObjectInterface.js 16 GObject interface can chain up to another interface
 815  [11/09/2017 08:10AM]: PASS: installed-tests/js/testGObjectInterface.js 17 GObject interface defers to the last interfaces optional function
 816  [11/09/2017 08:10AM]: PASS: installed-tests/js/testGObjectInterface.js 18 GObject interface must be implemented by a class that implements all required interfaces
 817  [11/09/2017 08:10AM]: PASS: installed-tests/js/testGObjectInterface.js 19 GObject interface must be implemented by a class that implements required interfaces in correct order
 818  [11/09/2017 08:10AM]: PASS: installed-tests/js/testGObjectInterface.js 20 GObject interface can require an interface from C
 819  [11/09/2017 08:10AM]: PASS: installed-tests/js/testGObjectInterface.js 21 GObject interface can define signals on the implementing class
 820  [11/09/2017 08:10AM]: PASS: installed-tests/js/testGObjectInterface.js 22 GObject interface can define properties on the implementing class
 821  [11/09/2017 08:10AM]: PASS: installed-tests/js/testGObjectInterface.js 23 GObject interface must have its properties overridden
 822  [11/09/2017 08:10AM]: PASS: installed-tests/js/testGObjectInterface.js 24 GObject interface gets the correct type for its metaclass
 823  [11/09/2017 08:10AM]: PASS: installed-tests/js/testGObjectInterface.js 25 GObject interface can be implemented by a class as well as its parent class
 824  [11/09/2017 08:10AM]: PASS: installed-tests/js/testGObjectInterface.js 26 GObject interface can be reimplemented by a subclass of a class that already implements it
 825  [11/09/2017 08:10AM]: PASS: installed-tests/js/testGTypeClass.js 1 Looking up param specs works
 826  [11/09/2017 08:10AM]: PASS: installed-tests/js/testGTypeClass.js 2 Looking up param specs gives the correct name
 827  [11/09/2017 08:10AM]: PASS: installed-tests/js/testGTypeClass.js 3 Looking up param specs gives the default value if present
 828  [11/09/2017 08:10AM]: PASS: installed-tests/js/testGTypeClass.js 4 GType object has a name
 829  [11/09/2017 08:10AM]: PASS: installed-tests/js/testGTypeClass.js 5 GType object has a read-only name
 830  [11/09/2017 08:10AM]: PASS: installed-tests/js/testGTypeClass.js 6 GType object has an undeletable name
 831  [11/09/2017 08:10AM]: PASS: installed-tests/js/testGTypeClass.js 7 GType object has a string representation
 832  [11/09/2017 08:10AM]: PASS: installed-tests/js/testGTypeClass.js 8 GType prototype object has no name
 833  [11/09/2017 08:10AM]: PASS: installed-tests/js/testGTypeClass.js 9 GType prototype object has a string representation
 834  [11/09/2017 08:10AM]: PASS: installed-tests/js/testImporter.js 1 GI importer can import GI modules
 835  [11/09/2017 08:10AM]: PASS: installed-tests/js/testImporter.js 2 GI importer on failure throws an exception when the overrides file cant be imported
 836  [11/09/2017 08:10AM]: PASS: installed-tests/js/testImporter.js 3 GI importer on failure throws an exception when the overrides import throws one
 837  [11/09/2017 08:10AM]: PASS: installed-tests/js/testImporter.js 4 GI importer on failure throws an exception when the overrides _init throws one
 838  [11/09/2017 08:10AM]: PASS: installed-tests/js/testImporter.js 5 GI importer on failure throws an exception when the overrides _init isnt a function
 839  [11/09/2017 08:10AM]: PASS: installed-tests/js/testImporter.js 6 Importer exists
 840  [11/09/2017 08:10AM]: PASS: installed-tests/js/testImporter.js 7 Importer has a toString representation
 841  [11/09/2017 08:10AM]: PASS: installed-tests/js/testImporter.js 8 Importer throws an import error when trying to import a nonexistent module
 842  [11/09/2017 08:10AM]: PASS: installed-tests/js/testImporter.js 9 Importer throws an error when evaluating the module file throws an error
 843  [11/09/2017 08:10AM]: PASS: installed-tests/js/testImporter.js 10 Importer can import a module
 844  [11/09/2017 08:10AM]: PASS: installed-tests/js/testImporter.js 11 Importer makes deleting the import a no-op
 845  [11/09/2017 08:10AM]: PASS: installed-tests/js/testImporter.js 12 Importer gives the same object when importing a second time
 846  [11/09/2017 08:10AM]: PASS: installed-tests/js/testImporter.js 13 Importer can import a submodule
 847  [11/09/2017 08:10AM]: PASS: installed-tests/js/testImporter.js 14 Importer imports modules with a toString representation
 848  [11/09/2017 08:10AM]: PASS: installed-tests/js/testImporter.js 15 Importer does not share the same object for a module on a different path
 849  [11/09/2017 08:10AM]: PASS: installed-tests/js/testImporter.js 16 Importer gives the same object when importing a submodule a second time
 850  [11/09/2017 08:10AM]: PASS: installed-tests/js/testImporter.js 17 Importer has no meta properties on the toplevel importer
 851  [11/09/2017 08:10AM]: PASS: installed-tests/js/testImporter.js 18 Importer sets the names of imported modules
 852  [11/09/2017 08:10AM]: PASS: installed-tests/js/testImporter.js 19 Importer gives a module the importer object as parent module
 853  [11/09/2017 08:10AM]: PASS: installed-tests/js/testImporter.js 20 Importer gives a submodule the module as parent module
 854  [11/09/2017 08:10AM]: PASS: installed-tests/js/testImporter.js 21 Importer does not make a separate copy of a module imported in two places
 855  [11/09/2017 08:10AM]: PASS: installed-tests/js/testImporter.js 22 Importer evaluates an __init__.js file in an imported directory
 856  [11/09/2017 08:10AM]: PASS: installed-tests/js/testImporter.js 23 Importer accesses a class defined in an __init__.js file
 857  [11/09/2017 08:10AM]: PASS: installed-tests/js/testImporter.js 24 Importer can import a file encoded in UTF-8
 858  [11/09/2017 08:10AM]: PASS: installed-tests/js/testImporter.js 25 Importer enumerating modules gets all of them
 859  [11/09/2017 08:10AM]: PASS: installed-tests/js/testImporter.js 26 Importer enumerating modules includes modules that throw on import
 860  [11/09/2017 08:10AM]: PASS: installed-tests/js/testImporter.js 27 Importer enumerating modules does not include meta properties
 861  [11/09/2017 08:10AM]: PASS: installed-tests/js/testInterface.js 1 An interface is an instance of Lang.Interface
 862  [11/09/2017 08:10AM]: PASS: installed-tests/js/testInterface.js 2 An interface cannot be instantiated
 863  [11/09/2017 08:10AM]: PASS: installed-tests/js/testInterface.js 3 An interface can be implemented by a class
 864  [11/09/2017 08:10AM]: PASS: installed-tests/js/testInterface.js 4 An interface can be implemented by a classs superclass
 865  [11/09/2017 08:10AM]: PASS: installed-tests/js/testInterface.js 5 An interface doesnt disturb a classs constructor
 866  [11/09/2017 08:10AM]: PASS: installed-tests/js/testInterface.js 6 An interface can have its required method implemented
 867  [11/09/2017 08:10AM]: PASS: installed-tests/js/testInterface.js 7 An interface must have a name
 868  [11/09/2017 08:10AM]: PASS: installed-tests/js/testInterface.js 8 An interface must have its required methods implemented
 869  [11/09/2017 08:10AM]: PASS: installed-tests/js/testInterface.js 9 An interface does not have to have its optional methods implemented
 870  [11/09/2017 08:10AM]: PASS: installed-tests/js/testInterface.js 10 An interface can have its optional method deferred to by the implementation
 871  [11/09/2017 08:10AM]: PASS: installed-tests/js/testInterface.js 11 An interface can be chained up to by a class
 872  [11/09/2017 08:10AM]: PASS: installed-tests/js/testInterface.js 12 An interface can include arguments when being chained up to by a class
 873  [11/09/2017 08:10AM]: PASS: installed-tests/js/testInterface.js 13 An interface can have its property getter deferred to
 874  [11/09/2017 08:10AM]: PASS: installed-tests/js/testInterface.js 14 An interface can have its property setter deferred to
 875  [11/09/2017 08:10AM]: PASS: installed-tests/js/testInterface.js 15 An interface can have its property getter overridden
 876  [11/09/2017 08:10AM]: PASS: installed-tests/js/testInterface.js 16 An interface can have its property setter overridden
 877  [11/09/2017 08:10AM]: PASS: installed-tests/js/testInterface.js 17 An interface can require another interface
 878  [11/09/2017 08:10AM]: PASS: installed-tests/js/testInterface.js 18 An interface can have empty requires
 879  [11/09/2017 08:10AM]: PASS: installed-tests/js/testInterface.js 19 An interface can chain up to another interface
 880  [11/09/2017 08:10AM]: PASS: installed-tests/js/testInterface.js 20 An interface can be chained up to with a generic
 881  [11/09/2017 08:10AM]: PASS: installed-tests/js/testInterface.js 21 An interface can chain up to another interface with a generic
 882  [11/09/2017 08:10AM]: PASS: installed-tests/js/testInterface.js 22 An interface has its optional function defer to that of the last interface
 883  [11/09/2017 08:10AM]: PASS: installed-tests/js/testInterface.js 23 An interface must have all its required interfaces implemented
 884  [11/09/2017 08:10AM]: PASS: installed-tests/js/testInterface.js 24 An interface must have all its required interfaces implemented in the correct order
 885  [11/09/2017 08:10AM]: PASS: installed-tests/js/testInterface.js 25 An interface can have its implementation on a parent class
 886  [11/09/2017 08:10AM]: PASS: installed-tests/js/testInterface.js 26 An interface can require its implementor to be a subclass of some class
 887  [11/09/2017 08:10AM]: PASS: installed-tests/js/testInterface.js 27 An interface must be implemented by an object which subclasses the required class
 888  [11/09/2017 08:10AM]: PASS: installed-tests/js/testInterface.js 28 An interface can have methods that call others of its methods
 889  [11/09/2017 08:10AM]: PASS: installed-tests/js/testInterface.js 29 An interface is implemented by a subclass of a class that implements it
 890  [11/09/2017 08:10AM]: PASS: installed-tests/js/testInterface.js 30 An interface can be reimplemented by a subclass of a class that implements it
 891  [11/09/2017 08:10AM]: PASS: installed-tests/js/testInterface.js 31 An interface tells what it is with toString()
 892  [11/09/2017 08:10AM]: PASS: installed-tests/js/testLang.js 1 Lang module counts properties with Lang.countProperties()
 893  [11/09/2017 08:10AM]: PASS: installed-tests/js/testLang.js 2 Lang module copies properties from one object to another with Lang.copyProperties()
 894  [11/09/2017 08:10AM]: PASS: installed-tests/js/testLang.js 3 Lang module copies properties without an underscore with Lang.copyPublicProperties()
 895  [11/09/2017 08:10AM]: PASS: installed-tests/js/testLang.js 4 Lang module copies property getters and setters
 896  [11/09/2017 08:10AM]: PASS: installed-tests/js/testLang.js 5 Lang module bind() calls the bound function with the supplied this-object
 897  [11/09/2017 08:10AM]: PASS: installed-tests/js/testLang.js 6 Lang module bind() throws an error when no function supplied
 898  [11/09/2017 08:10AM]: PASS: installed-tests/js/testLang.js 7 Lang module bind() throws an error when this-object undefined
 899  [11/09/2017 08:10AM]: PASS: installed-tests/js/testLang.js 8 Lang module bind() supplies extra arguments to the function
 900  [11/09/2017 08:10AM]: PASS: installed-tests/js/testLang.js 9 Lang module bind() appends the extra arguments to any arguments passed
 901  [11/09/2017 08:10AM]: PASS: installed-tests/js/testLocale.js 1 JS_SetLocaleCallbacks Intl API was compiled into SpiderMonkey
 902  [11/09/2017 08:10AM]: PASS: installed-tests/js/testLocale.js 2 JS_SetLocaleCallbacks toLocaleDateString() works
 903  [11/09/2017 08:10AM]: PASS: installed-tests/js/testLocale.js 3 JS_SetLocaleCallbacks toLocaleLowerCase() works
 904  [11/09/2017 08:10AM]: PASS: installed-tests/js/testLocale.js 4 JS_SetLocaleCallbacks toLocaleLowerCase() works for Unicode
 905  [11/09/2017 08:10AM]: PASS: installed-tests/js/testLocale.js 5 JS_SetLocaleCallbacks toLocaleUpperCase() works
 906  [11/09/2017 08:10AM]: PASS: installed-tests/js/testLocale.js 6 JS_SetLocaleCallbacks toLocaleUpperCase() works for Unicode
 907  [11/09/2017 08:10AM]: PASS: installed-tests/js/testLocale.js 7 JS_SetLocaleCallbacks localeCompare() works
 908  [11/09/2017 08:10AM]: PASS: installed-tests/js/testMainloop.js 1 Mainloop.timeout_add() runs a timeout function
 909  [11/09/2017 08:10AM]: PASS: installed-tests/js/testMainloop.js 2 Mainloop.timeout_add() runs a timeout function until it returns false
 910  [11/09/2017 08:10AM]: PASS: installed-tests/js/testMainloop.js 3 Mainloop.timeout_add() runs a timeout function after an initial timeout
 911  [11/09/2017 08:10AM]: PASS: installed-tests/js/testMainloop.js 4 Mainloop.idle_add() runs an idle function
 912  [11/09/2017 08:10AM]: PASS: installed-tests/js/testMainloop.js 5 Mainloop.idle_add() continues to run idle functions that return true
 913  [11/09/2017 08:10AM]: PASS: installed-tests/js/testMainloop.js 6 Mainloop.idle_add() does not run idle functions if removed
 914  [11/09/2017 08:10AM]: PASS: installed-tests/js/testMainloop.js 7 Mainloop.idle_add() can remove idle functions while they are being invoked
 915  [11/09/2017 08:10AM]: PASS: installed-tests/js/testMainloop.js 8 Mainloop.idle_add() does not leak idle callbacks
 916  [11/09/2017 08:10AM]: PASS: installed-tests/js/testMetaClass.js 1 A metaclass has its constructor called each time a class is created with it
 917  [11/09/2017 08:10AM]: PASS: installed-tests/js/testMetaClass.js 2 A metaclass is an instance of Lang.Class
 918  [11/09/2017 08:10AM]: PASS: installed-tests/js/testMetaClass.js 3 A metaclass produces instances that are instances of itself and Lang.Class
 919  [11/09/2017 08:10AM]: PASS: installed-tests/js/testMetaClass.js 4 A metaclass can dynamically define properties in its constructor
 920  [11/09/2017 08:10AM]: PASS: installed-tests/js/testMetaClass.js 5 A metaclass instance gets all the properties from its class and metaclass
 921  [11/09/2017 08:10AM]: PASS: installed-tests/js/testMetaClass.js 6 A metaclass instance gets dynamically defined properties from metaclass
 922  [11/09/2017 08:10AM]: PASS: installed-tests/js/testMetaClass.js 7 A metaclass can be instantiated with Lang.Class but still get the appropriate metaclass
 923  [11/09/2017 08:10AM]: PASS: installed-tests/js/testNamespace.js 1 GI repository namespace supplies a name
 924  [11/09/2017 08:10AM]: PASS: installed-tests/js/testParamSpec.js 1 GObject.ParamSpec.string has the correct name strings
 925  [11/09/2017 08:10AM]: PASS: installed-tests/js/testParamSpec.js 2 GObject.ParamSpec.string has the correct flags
 926  [11/09/2017 08:10AM]: PASS: installed-tests/js/testParamSpec.js 3 GObject.ParamSpec.string has the correct default value
 927  [11/09/2017 08:10AM]: PASS: installed-tests/js/testParamSpec.js 4 GObject.ParamSpec.int has the correct name strings
 928  [11/09/2017 08:10AM]: PASS: installed-tests/js/testParamSpec.js 5 GObject.ParamSpec.int has the correct flags
 929  [11/09/2017 08:10AM]: PASS: installed-tests/js/testParamSpec.js 6 GObject.ParamSpec.int has the correct default value
 930  [11/09/2017 08:10AM]: PASS: installed-tests/js/testParamSpec.js 7 GObject.ParamSpec.uint has the correct name strings
 931  [11/09/2017 08:10AM]: PASS: installed-tests/js/testParamSpec.js 8 GObject.ParamSpec.uint has the correct flags
 932  [11/09/2017 08:10AM]: PASS: installed-tests/js/testParamSpec.js 9 GObject.ParamSpec.uint has the correct default value
 933  [11/09/2017 08:10AM]: PASS: installed-tests/js/testParamSpec.js 10 GObject.ParamSpec.int64 has the correct name strings
 934  [11/09/2017 08:10AM]: PASS: installed-tests/js/testParamSpec.js 11 GObject.ParamSpec.int64 has the correct flags
 935  [11/09/2017 08:10AM]: PASS: installed-tests/js/testParamSpec.js 12 GObject.ParamSpec.int64 has the correct default value
 936  [11/09/2017 08:10AM]: PASS: installed-tests/js/testParamSpec.js 13 GObject.ParamSpec.uint64 has the correct name strings
 937  [11/09/2017 08:10AM]: PASS: installed-tests/js/testParamSpec.js 14 GObject.ParamSpec.uint64 has the correct flags
 938  [11/09/2017 08:10AM]: PASS: installed-tests/js/testParamSpec.js 15 GObject.ParamSpec.uint64 has the correct default value
 939  [11/09/2017 08:10AM]: PASS: installed-tests/js/testParamSpec.js 16 GObject.ParamSpec.enum has the correct name strings
 940  [11/09/2017 08:10AM]: PASS: installed-tests/js/testParamSpec.js 17 GObject.ParamSpec.enum has the correct flags
 941  [11/09/2017 08:10AM]: PASS: installed-tests/js/testParamSpec.js 18 GObject.ParamSpec.enum has the correct default value
 942  [11/09/2017 08:10AM]: PASS: installed-tests/js/testParamSpec.js 19 GObject.ParamSpec.flags has the correct name strings
 943  [11/09/2017 08:10AM]: PASS: installed-tests/js/testParamSpec.js 20 GObject.ParamSpec.flags has the correct flags
 944  [11/09/2017 08:10AM]: PASS: installed-tests/js/testParamSpec.js 21 GObject.ParamSpec.flags has the correct default value
 945  [11/09/2017 08:10AM]: PASS: installed-tests/js/testParamSpec.js 22 GObject.ParamSpec.object has the correct name strings
 946  [11/09/2017 08:10AM]: PASS: installed-tests/js/testParamSpec.js 23 GObject.ParamSpec.object has the correct flags
 947  [11/09/2017 08:10AM]: PASS: installed-tests/js/testParamSpec.js 24 GObject.ParamSpec.object has the correct default value
 948  [11/09/2017 08:10AM]: PASS: installed-tests/js/testSignals.js 1 Object with signals calls a signal handler when a signal is emitted
 949  [11/09/2017 08:10AM]: PASS: installed-tests/js/testSignals.js 2 Object with signals does not call a signal handler after the signal is disconnected
 950  [11/09/2017 08:10AM]: PASS: installed-tests/js/testSignals.js 3 Object with signals can disconnect a signal handler during signal emission
 951  [11/09/2017 08:10AM]: PASS: installed-tests/js/testSignals.js 4 Object with signals distinguishes multiple signals
 952  [11/09/2017 08:10AM]: ERROR: installed-tests/js/testSignals.js - too few tests run (expected 12, got 4)
 953  [11/09/2017 08:10AM]: ERROR: installed-tests/js/testSignals.js - exited with status 133 (terminated by signal 5?)
 954  [11/09/2017 08:10AM]: PASS: installed-tests/js/testSystem.js 1 System.addressOf() gives different results for different objects
 955  [11/09/2017 08:10AM]: FAIL: installed-tests/js/testSystem.js 2 System.version gives a plausible number
 956  [11/09/2017 08:10AM]: PASS: installed-tests/js/testSystem.js 3 System.refcount() gives the correct number
 957  [11/09/2017 08:10AM]: PASS: installed-tests/js/testSystem.js 4 System.gc() does not crash the application
 958  [11/09/2017 08:10AM]: ERROR: installed-tests/js/testSystem.js - exited with status 1
 959  [11/09/2017 08:10AM]: PASS: installed-tests/js/testTweener.js 1 Tweener runs a simple tween
 960  [11/09/2017 08:10AM]: PASS: installed-tests/js/testTweener.js 2 Tweener calls callbacks during the tween
 961  [11/09/2017 08:10AM]: PASS: installed-tests/js/testTweener.js 3 Tweener can pause tweens
 962  [11/09/2017 08:10AM]: PASS: installed-tests/js/testTweener.js 4 Tweener can remove tweens
 963  [11/09/2017 08:10AM]: PASS: installed-tests/js/testTweener.js 5 Tweener overrides a tween with another one acting on the same object and property at the same time
 964  [11/09/2017 08:10AM]: PASS: installed-tests/js/testTweener.js 6 Tweener does not override a tween with another one acting not at the same time
 965  [11/09/2017 08:10AM]: PASS: installed-tests/js/testTweener.js 7 Tweener can pause and resume all tweens
 966  [11/09/2017 08:10AM]: PASS: installed-tests/js/testTweener.js 8 Tweener can remove all tweens
 967  [11/09/2017 08:10AM]: PASS: installed-tests/js/testTweener.js 9 Tweener runs a tween with a time of 0 immediately
 968  [11/09/2017 08:10AM]: PASS: installed-tests/js/testTweener.js 10 Tweener can call a callback a certain number of times
 969  [11/09/2017 08:10AM]: PASS: installed-tests/js/testTweener.js 11 Tweener can count the number of tweens on an object
 970  [11/09/2017 08:10AM]: PASS: installed-tests/js/testTweener.js 12 Tweener can register special properties
 971  [11/09/2017 08:10AM]: PASS: installed-tests/js/testTweener.js 13 Tweener can register special modifiers for properties
 972  [11/09/2017 08:10AM]: PASS: installed-tests/js/testTweener.js 14 Tweener can split properties into more than one special property
 973  [11/09/2017 08:10AM]: PASS: installed-tests/js/testTweener.js 15 Tweener calls an overwrite callback when a tween is replaced
 974  [11/09/2017 08:10AM]: PASS: installed-tests/js/testTweener.js 16 Tweener can still overwrite a tween after it has started
 975  [11/09/2017 08:10AM]: PASS: installed-tests/js/testGDBus.js 1 Exported DBus object can call a remote method
 976  [11/09/2017 08:10AM]: ERROR: installed-tests/js/testGDBus.js - too few tests run (expected 18, got 1)
 977  [11/09/2017 08:10AM]: ERROR: installed-tests/js/testGDBus.js - exited with status 133 (terminated by signal 5?)
 978  [11/09/2017 08:10AM]: ERROR: installed-tests/js/testCairo.js - Bail out! JS_EvaluateScript() failed
 979  [11/09/2017 08:10AM]: ============================================================================
 980  [11/09/2017 08:10AM]: Testsuite summary for cjs 3.6.1
 981  [11/09/2017 08:10AM]: Please report to https://github.com/linuxmint/cjs/issues/new
 982  [11/09/2017 08:10AM]: make[3]: *** [Makefile:2814: test-suite.log] Error 1
 983  [11/09/2017 08:10AM]: make[2]: *** [Makefile:2922: check-TESTS] Error 2
 984  [11/09/2017 08:10AM]: make[1]: *** [Makefile:3139: check-am] Error 2
 985  [11/09/2017 08:10AM]: make: *** [Makefile:3141: check] Error 2
 986  [11/09/2017 08:10AM]: ==> Entering fakeroot environment...
 987  [11/09/2017 08:10AM]:  /usr/bin/mkdir -p /pkg/pkg/cjs/usr/lib
 988  [11/09/2017 08:10AM]:  /bin/sh ./libtool   --mode=install /usr/bin/install -c   libcjs.la /pkg/pkg/cjs/usr/lib
 989  [11/09/2017 08:10AM]: libtool: install: /usr/bin/install -c .libs/libcjs.so.0.0.0 /pkg/pkg/cjs/usr/lib/libcjs.so.0.0.0
 990  [11/09/2017 08:10AM]: libtool: install: (cd /pkg/pkg/cjs/usr/lib && { ln -s -f libcjs.so.0.0.0 libcjs.so.0 || { rm -f libcjs.so.0 && ln -s libcjs.so.0.0.0 libcjs.so.0; }; })
 991  [11/09/2017 08:10AM]: libtool: install: (cd /pkg/pkg/cjs/usr/lib && { ln -s -f libcjs.so.0.0.0 libcjs.so || { rm -f libcjs.so && ln -s libcjs.so.0.0.0 libcjs.so; }; })
 992  [11/09/2017 08:10AM]: libtool: install: /usr/bin/install -c .libs/libcjs.lai /pkg/pkg/cjs/usr/lib/libcjs.la
 993  [11/09/2017 08:10AM]: libtool: warning: remember to run libtool --finish /usr/lib
 994  [11/09/2017 08:10AM]:  /usr/bin/mkdir -p /pkg/pkg/cjs/usr/bin
 995  [11/09/2017 08:10AM]:   /bin/sh ./libtool   --mode=install /usr/bin/install -c cjs-console /pkg/pkg/cjs/usr/bin
 996  [11/09/2017 08:10AM]: libtool: warning: libcjs.la has not been installed in /usr/lib
 997  [11/09/2017 08:10AM]: libtool: install: /usr/bin/install -c .libs/cjs-console /pkg/pkg/cjs/usr/bin/cjs-console
 998  [11/09/2017 08:10AM]: (cd /pkg/pkg/cjs/usr/bin && ln -s -f cjs-console cjs)
 999  [11/09/2017 08:10AM]:  /usr/bin/mkdir -p /pkg/pkg/cjs/usr/include/cjs-1.0
1000  [11/09/2017 08:10AM]:  /usr/bin/mkdir -p /pkg/pkg/cjs/usr/include/cjs-1.0/cjs
1001  [11/09/2017 08:10AM]:  /usr/bin/install -c -m 644  cjs/context.h cjs/coverage.h cjs/gjs.h cjs/macros.h /pkg/pkg/cjs/usr/include/cjs-1.0/cjs
1002  [11/09/2017 08:10AM]:  /usr/bin/mkdir -p /pkg/pkg/cjs/usr/include/cjs-1.0/util
1003  [11/09/2017 08:10AM]:  /usr/bin/install -c -m 644  util/error.h /pkg/pkg/cjs/usr/include/cjs-1.0/util
1004  [11/09/2017 08:10AM]:  /usr/bin/mkdir -p /pkg/pkg/cjs/usr/lib/pkgconfig
1005  [11/09/2017 08:10AM]:  /usr/bin/install -c -m 644 cjs-1.0.pc /pkg/pkg/cjs/usr/lib/pkgconfig
1006  [11/09/2017 08:10AM]:  /usr/bin/mkdir -p /pkg/pkg/cjs/usr/lib/cjs/girepository-1.0
1007  [11/09/2017 08:10AM]:  /usr/bin/install -c -m 644 CjsPrivate-1.0.typelib /pkg/pkg/cjs/usr/lib/cjs/girepository-1.0
1008  [11/09/2017 08:10AM]:   -> Removing libtool files...
1009  [11/09/2017 08:10AM]:   -> Removing static library files...
1010  [11/09/2017 08:10AM]:   -> Stripping unneeded symbols from binaries and libraries...
1011  [11/09/2017 08:10AM]:   -> Compressing man and info pages...
1012  [11/09/2017 08:10AM]: ==> Checking for packaging issue...
1013  [11/09/2017 08:10AM]: ==> Creating package cjs...
1014  [11/09/2017 08:10AM]:   -> Generating .PKGINFO file...
1015  [11/09/2017 08:10AM]:   -> Generating .BUILDINFO file...
1016  [11/09/2017 08:10AM]:   -> Generating .MTREE file...
1017  [11/09/2017 08:10AM]: ==> Leaving fakeroot environment.
1018  [11/09/2017 08:10AM]: ==> Finished making: cjs 3.6.1-1 (Thu Nov  9 14:10:57 UTC 2017)
1019  [11/09/2017 08:10AM]: [\^/\^/^\^/^\^/\^/\^/^\^/^\^/]  Getting packages that would be generated by PKGBUILD...  [\^/\^/^\^/^\^/\^/\^/^\^/^\^/]
1020  [11/09/2017 08:10AM]: [\^/\^/^\^/^\^/\^/\^/^\^/^\^/]  cjs-3.6.1-1-i686
1021  [11/09/2017 08:10AM]: cjs-3.6.1-1-x86_64  [\^/\^/^\^/^\^/\^/\^/^\^/^\^/]
1022  [11/09/2017 08:10AM]: [\^/\^/^\^/^\^/\^/\^/^\^/^\^/]  CREATING 32-BIT BUILD ENVIRONMENT  [\^/\^/^\^/^\^/\^/\^/^\^/^\^/]
1023  [11/09/2017 08:10AM]: ==> Creating install root at /32build/root
1024  [11/09/2017 08:10AM]: ==> Installing packages to /32build/root
1025  [11/09/2017 08:10AM]: :: There are 26 members in group base-devel:
1026  [11/09/2017 08:10AM]:    1) autoconf  2) automake  3) binutils  4) bison  5) fakeroot  6) file  7) findutils  8) flex  9) gawk  10) gcc  11) gettext  12) grep  13) groff  14) gzip  15) libtool  16) m4  17) make  18) pacman  19) patch  20) pkg-config  21) sed  22) sudo  23) systemd  24) texinfo  25) util-linux  26) which
1027  [11/09/2017 08:10AM]: Enter a selection (default=all): warning: skipping target: sudo
1028  [11/09/2017 08:10AM]: Packages (122) acl-2.2.52-4  archlinux-keyring-20171020-1  attr-2.4.47-3  bash-4.4.012-2  bzip2-1.0.6-6  ca-certificates-20170307-1  ca-certificates-cacert-20140824-4  ca-certificates-mozilla-3.33-2  ca-certificates-utils-20170307-1  coreutils-8.28-1  cracklib-2.9.6-1  cryptsetup-1.7.5-2  curl-7.56.1-1  db-5.3.28-3  dbus-1.12.0-1  device-mapper-2.02.176-1  diffutils-3.6-1  e2fsprogs-1.43.7-1  expat-2.2.4-1  filesystem-2017.03-2  gc-7.6.0-1  gcc-libs-7.2.0-3  gdbm-1.13-1  glib2-2.54.2-2  glibc-2.26-6  gmp-6.1.2-1  gnupg-2.2.1-1  gnutls-3.5.16-1  gpgme-1.9.0-3  guile-2.2.2-1  hwids-20170715-1  iana-etc-20170824-1  icu-59.1-2  iptables-1.6.1-1  kbd-2.0.4-1  keyutils-1.5.10-1  kmod-24-1  krb5-1.15.2-1  less-487-1  libarchive-3.3.2-1  libassuan-2.4.3-1  libatomic_ops-7.4.6-1  libcap-2.25-1  libcap-ng-0.7.8-1  libelf-0.170-1  libffi-3.2.1-2  libgcrypt-1.8.1-1  libgpg-error-1.27-1  libidn-1.33-2  libksba-1.3.5-1  libldap-2.4.45-4  libmnl-1.0.4-1  libmpc-1.0.3-2  libnftnl-1.0.7-1  libnghttp2-1.23.1-1  libnl-3.4.0-1  libpcap-1.8.1-2  libpsl-0.18.0-1  libsasl-2.1.26-11  libseccomp-2.3.2-1  libsecret-0.18.5+14+g9980655-1  libssh2-1.8.0-2  libsystemd-235.38-1  libtasn1-4.12-2  libtirpc-1.0.2-1  libunistring-0.9.7-1  libusb-1.0.21-2  libutil-linux-2.31-1  linux-api-headers-4.12.7-1  lz4-1:1.8.0-1  mpfr-3.1.5.p2-1  ncurses-6.0+20170902-3  nettle-3.3-1  npth-1.5-1  openssl-1.1.0.g-1  p11-kit-0.23.9-1  pacman-mirrorlist-20171027-1  pam-1.3.0-1  pambase-20171006-1  pcre-8.41-1  pcre2-10.30-1  perl-5.26.1-1  perl-error-0.17025-2  pinentry-1.0.0-1  popt-1.16-9  python-3.6.3-1  readline-7.0.003-1  shadow-4.5-2  sqlite-3.21.0-1  tar-1.29-2  tzdata-2017c-1  xz-5.2.3-1  zlib-1:1.2.11-2  autoconf-2.69-4  automake-1.15.1-1  binutils-2.29.1-1  bison-3.0.4-3  fakeroot-1.22-1  file-5.32-1  findutils-4.6.0-2  flex-2.6.4-1  gawk-4.1.4-2  gcc-7.2.0-3  gettext-0.19.8.1-2  git-2.15.0-1  grep-3.1-1  groff-1.22.3-7  gzip-1.8-2  libtool-2.4.6+40+g6ca5e224-1  m4-1.4.18-1  make-4.2.1-2  pacman-5.0.2-2  patch-2.7.5-1  pkg-config-0.29.2-1  reflector-2017.6-1  sed-4.4-1  sudo-1.8.21.p2-1  systemd-235.38-1  texinfo-6.5-1  util-linux-2.31-1  wget-1.19.2-1  which-2.21-2
1029  [11/09/2017 08:10AM]: Total Installed Size:  772.50 MiB
1030  [11/09/2017 08:11AM]: installing linux-api-headers...
1031  [11/09/2017 08:11AM]: Optional dependencies for glibc
1032  [11/09/2017 08:11AM]: Optional dependencies for bash
1033  [11/09/2017 08:11AM]:     bash-completion: for tab completion
1034  [11/09/2017 08:11AM]: Optional dependencies for openssl
1035  [11/09/2017 08:11AM]:     ca-certificates [pending]
1036  [11/09/2017 08:12AM]: Optional dependencies for util-linux
1037  [11/09/2017 08:12AM]:     python: python bindings to libmount [pending]
1038  [11/09/2017 08:12AM]: Optional dependencies for glib2
1039  [11/09/2017 08:12AM]:     python: for gdbus-codegen and gtester-report [pending]
1040  [11/09/2017 08:12AM]:     libelf: gresource inspection tool [pending]
1041  [11/09/2017 08:12AM]: Optional dependencies for gettext
1042  [11/09/2017 08:12AM]:     git: for autopoint infrastructure updates [pending]
1043  [11/09/2017 08:12AM]: Optional dependencies for groff
1044  [11/09/2017 08:12AM]:     netpbm: for use together with man -H command interaction in browsers
1045  [11/09/2017 08:12AM]:     psutils: for use together with man -H command interaction in browsers
1046  [11/09/2017 08:12AM]: installing ca-certificates-utils...
1047  [11/09/2017 08:12AM]: installing ca-certificates-mozilla...
1048  [11/09/2017 08:12AM]: installing ca-certificates-cacert...
1049  [11/09/2017 08:12AM]: installing ca-certificates...
1050  [11/09/2017 08:12AM]: Optional dependencies for libsecret
1051  [11/09/2017 08:12AM]:     gnome-keyring: key storage service (or use any other service implementing org.freedesktop.secrets)
1052  [11/09/2017 08:12AM]: Optional dependencies for pinentry
1053  [11/09/2017 08:12AM]: Optional dependencies for gnutls
1054  [11/09/2017 08:12AM]:     guile: for use with Guile bindings [installed]
1055  [11/09/2017 08:12AM]: Optional dependencies for gnupg
1056  [11/09/2017 08:12AM]:     libldap: gpg2keys_ldap [installed]
1057  [11/09/2017 08:12AM]:     libusb-compat: scdaemon
1058  [11/09/2017 08:12AM]: installing pacman-mirrorlist...
1059  [11/09/2017 08:12AM]: installing archlinux-keyring...
1060  [11/09/2017 08:12AM]: Optional dependencies for patch
1061  [11/09/2017 08:12AM]:     ed: for patch -e functionality
1062  [11/09/2017 08:12AM]: Initializing machine ID from random generator.
1063  [11/09/2017 08:12AM]: Created symlink /etc/systemd/system/getty.target.wants/[email protected] → /usr/lib/systemd/system/[email protected]
1064  [11/09/2017 08:12AM]: Created symlink /etc/systemd/system/multi-user.target.wants/remote-fs.target → /usr/lib/systemd/system/remote-fs.target.
1065  [11/09/2017 08:12AM]: :: Append init=/usr/lib/systemd/systemd to your kernel command line in your
1066  [11/09/2017 08:12AM]:    bootloader to replace sysvinit with systemd, or install systemd-sysvcompat
1067  [11/09/2017 08:12AM]: Optional dependencies for systemd
1068  [11/09/2017 08:12AM]:     libmicrohttpd: remote journald capabilities
1069  [11/09/2017 08:12AM]:     quota-tools: kernel-level quota management
1070  [11/09/2017 08:12AM]:     systemd-sysvcompat: symlink package to provide sysvinit binaries
1071  [11/09/2017 08:12AM]:     polkit: allow administration as unprivileged user
1072  [11/09/2017 08:12AM]: Optional dependencies for wget
1073  [11/09/2017 08:12AM]:     ca-certificates: HTTPS downloads [installed]
1074  [11/09/2017 08:12AM]: Optional dependencies for git
1075  [11/09/2017 08:12AM]:     perl-term-readkey: git svn
1076  [11/09/2017 08:12AM]:     perl-mime-tools: git send-email
1077  [11/09/2017 08:12AM]:     perl-net-smtp-ssl: git send-email TLS support
1078  [11/09/2017 08:12AM]:     perl-authen-sasl: git send-email TLS support
1079  [11/09/2017 08:12AM]:     perl-mediawiki-api: git mediawiki support
1080  [11/09/2017 08:12AM]:     perl-datetime-format-iso8601: git mediawiki support
1081  [11/09/2017 08:12AM]:     perl-lwp-protocol-https: git mediawiki https support
1082  [11/09/2017 08:12AM]:     perl-cgi: gitweb (web interface) support
1083  [11/09/2017 08:12AM]:     python2: various helper scripts
1084  [11/09/2017 08:12AM]:     gnome-keyring: GNOME keyring credential helper
1085  [11/09/2017 08:12AM]: Optional dependencies for python
1086  [11/09/2017 08:12AM]:     mpdecimal: for decimal
1087  [11/09/2017 08:12AM]:     xz: for lzma [installed]
1088  [11/09/2017 08:12AM]: Optional dependencies for reflector
1089  [11/09/2017 08:12AM]:     rsync: rate rsync mirrors
1090  [11/09/2017 08:12AM]: (2/7) Updating udev hardware database...
1091  [11/09/2017 08:12AM]: (3/7) Updating system user accounts...
1092  [11/09/2017 08:12AM]: (7/7) Rebuilding certificate stores...
1093  [11/09/2017 08:12AM]: Failed to chown() cgroup /sys/fs/cgroup/systemd/docker/d26f9a8e989b094d1e53d03058318d6e74739bc58eb2b7047eb7ec1d5e21316f: No such file or directory
1094  [11/09/2017 08:12AM]: Attempted to remove disk file system, and we cant allow that.
1095  [11/09/2017 08:12AM]: [\^/\^/^\^/^\^/\^/\^/^\^/^\^/]  UPDATING 32BIT SOURCE CHECKSUMS  [\^/\^/^\^/^\^/\^/\^/^\^/^\^/]
1096  [11/09/2017 08:12AM]: 
1097   0     0    0     0    0     0      0      0 --:--:-- --:--:-- --:--:--     0
1098 100   120    0   120    0     0    120      0 --:--:-- --:--:-- --:--:--   833
1099  [11/09/2017 08:12AM]: 
1100 100  416k  100  416k    0     0   416k      0  0:00:01 --:--:--  0:00:01  416k
1101  [11/09/2017 08:12AM]: ==> Making package: cjs 3.6.1-1 (Thu Nov  9 14:12:23 UTC 2017)
1102  [11/09/2017 08:12AM]: Total Download Size:    9.56 MiB
1103  [11/09/2017 08:12AM]: Total Installed Size:  41.15 MiB
1104  [11/09/2017 08:12AM]: downloading lzo-2.10-1-i686.pkg.tar.xz...
1105  [11/09/2017 08:12AM]: downloading nspr-4.17-1-i686.pkg.tar.xz...
1106  [11/09/2017 08:12AM]: downloading libpng-1.6.34-2-i686.pkg.tar.xz...
1107  [11/09/2017 08:12AM]: downloading xcb-proto-1.12-3-any.pkg.tar.xz...
1108  [11/09/2017 08:12AM]: downloading xproto-7.0.31-1-any.pkg.tar.xz...
1109  [11/09/2017 08:12AM]: downloading libxdmcp-1.1.2-1-i686.pkg.tar.xz...
1110  [11/09/2017 08:12AM]: downloading libxau-1.0.8-2-i686.pkg.tar.xz...
1111  [11/09/2017 08:12AM]: downloading libxcb-1.12-1-i686.pkg.tar.xz...
1112  [11/09/2017 08:12AM]: downloading libx11-1.6.5-1-i686.pkg.tar.xz...
1113  [11/09/2017 08:12AM]: downloading renderproto-0.11.1-3-any.pkg.tar.xz...
1114  [11/09/2017 08:12AM]: downloading libxrender-0.9.10-1-i686.pkg.tar.xz...
1115  [11/09/2017 08:12AM]: downloading xextproto-7.3.0-1-any.pkg.tar.xz...
1116  [11/09/2017 08:12AM]: downloading libxext-1.3.3-1-i686.pkg.tar.xz...
1117  [11/09/2017 08:12AM]: downloading graphite-1:1.3.10-1-i686.pkg.tar.xz...
1118  [11/09/2017 08:12AM]: downloading harfbuzz-1.6.3-1-i686.pkg.tar.xz...
1119  [11/09/2017 08:12AM]: downloading freetype2-2.8.1-1-i686.pkg.tar.xz...
1120  [11/09/2017 08:12AM]: downloading fontconfig-2.12.6-1-i686.pkg.tar.xz...
1121  [11/09/2017 08:12AM]: downloading gobject-introspection-runtime-1.54.1-1-i686.pkg.tar.xz...
1122  [11/09/2017 08:12AM]: downloading dbus-glib-0.108-1-i686.pkg.tar.xz...
1123  [11/09/2017 08:12AM]: Packages (25) autoconf-archive-1:2017.09.28-1  boost-libs-1.65.1-1  docbook-xml-4.5-6  docbook-xsl-1.79.2-3  glib2-docs-2.54.2-2  gtk-doc-1.26+10+g01844e7-1  intltool-0.51.0-3  itstool-2.0.4+1+g9b84c00-2  libxml2-2.9.5+6+g07e227ed-1  libxslt-1.1.30-2  perl-xml-parser-2.44-6  python-appdirs-1.4.3-1  python-beaker-1.8.1-2  python-mako-1.0.7-1  python-markupsafe-1.0-1  python-packaging-16.8-2  python-pyparsing-2.2.0-1  python-setuptools-1:36.6.0-1  python-six-1.11.0-1  source-highlight-3.1.8-13  yelp-tools-3.18.0+1+g193c2bd-2  yelp-xsl-3.20.1-2  gnome-common-3.18.0-2  gobject-introspection-1.54.1-1  python2-2.7.14-1
1124  [11/09/2017 08:12AM]: Total Download Size:    20.65 MiB
1125  [11/09/2017 08:12AM]: Total Installed Size:  153.20 MiB
1126  [11/09/2017 08:12AM]: downloading glib2-docs-2.54.2-2-i686.pkg.tar.xz...
1127  [11/09/2017 08:12AM]: downloading perl-xml-parser-2.44-6-i686.pkg.tar.xz...
1128  [11/09/2017 08:12AM]: downloading intltool-0.51.0-3-any.pkg.tar.xz...
1129  [11/09/2017 08:12AM]: downloading yelp-xsl-3.20.1-2-any.pkg.tar.xz...
1130  [11/09/2017 08:12AM]: downloading libxml2-2.9.5+6+g07e227ed-1-i686.pkg.tar.xz...
1131  [11/09/2017 08:12AM]: downloading libxslt-1.1.30-2-i686.pkg.tar.xz...
1132  [11/09/2017 08:12AM]: downloading python2-2.7.14-1-i686.pkg.tar.xz...
1133  [11/09/2017 08:12AM]: downloading docbook-xml-4.5-6-any.pkg.tar.xz...
1134  [11/09/2017 08:12AM]: downloading itstool-2.0.4+1+g9b84c00-2-any.pkg.tar.xz...
1135  [11/09/2017 08:12AM]: downloading docbook-xsl-1.79.2-3-any.pkg.tar.xz...
1136  [11/09/2017 08:12AM]: downloading yelp-tools-3.18.0+1+g193c2bd-2-any.pkg.tar.xz...
1137  [11/09/2017 08:12AM]: downloading boost-libs-1.65.1-1-i686.pkg.tar.xz...
1138  [11/09/2017 08:12AM]: downloading source-highlight-3.1.8-13-i686.pkg.tar.xz...
1139  [11/09/2017 08:12AM]: downloading python-six-1.11.0-1-any.pkg.tar.xz...
1140  [11/09/2017 08:12AM]: downloading gtk-doc-1.26+10+g01844e7-1-any.pkg.tar.xz...
1141  [11/09/2017 08:12AM]: downloading gnome-common-3.18.0-2-any.pkg.tar.xz...
1142  [11/09/2017 08:12AM]: downloading python-markupsafe-1.0-1-i686.pkg.tar.xz...
1143  [11/09/2017 08:12AM]: downloading python-beaker-1.8.1-2-any.pkg.tar.xz...
1144  [11/09/2017 08:12AM]: downloading python-pyparsing-2.2.0-1-any.pkg.tar.xz...
1145  [11/09/2017 08:12AM]: downloading python-packaging-16.8-2-any.pkg.tar.xz...
1146  [11/09/2017 08:12AM]: downloading python-appdirs-1.4.3-1-any.pkg.tar.xz...
1147  [11/09/2017 08:12AM]: downloading python-setuptools-1:36.6.0-1-any.pkg.tar.xz...
1148  [11/09/2017 08:12AM]: downloading python-mako-1.0.7-1-any.pkg.tar.xz...
1149  [11/09/2017 08:12AM]: downloading gobject-introspection-1.54.1-1-i686.pkg.tar.xz...
1150  [11/09/2017 08:12AM]: downloading autoconf-archive-1:2017.09.28-1-any.pkg.tar.xz...
1151  [11/09/2017 08:12AM]: Optional dependencies for python2
1152  [11/09/2017 08:13AM]: checking whether the gcc linker (/usr/bin/ld -m elf_i386) supports shared libraries... yes
1153  [11/09/2017 08:13AM]: checking for ld used by g++... /usr/bin/ld -m elf_i386
1154  [11/09/2017 08:13AM]: checking if the linker (/usr/bin/ld -m elf_i386) is GNU ld... yes
1155  [11/09/2017 08:14AM]:                  from /usr/lib/gcc/i686-pc-linux-gnu/7.2.0/include-fixed/limits.h:194,
1156  [11/09/2017 08:14AM]:                  from /usr/lib/gcc/i686-pc-linux-gnu/7.2.0/include-fixed/syslimits.h:7,
1157  [11/09/2017 08:14AM]:                  from /usr/lib/gcc/i686-pc-linux-gnu/7.2.0/include-fixed/limits.h:34,
1158  [11/09/2017 08:14AM]:                  from /pkg/src/cjs-3.6.1/g-ir-cpp-m8cnl5or.c:4:
1159  [11/09/2017 08:14AM]: /usr/lib/gcc/i686-pc-linux-gnu/7.2.0/include/stddef.h:435: syntax error, unexpected identifier in   __float128 __max_align_f128 __attribute__((__aligned__(__alignof(__float128)))); at __float128
1160  [11/09/2017 08:14AM]:                  from /pkg/src/cjs-3.6.1/g-ir-cpp-45llw5g7.c:4:
1161  [11/09/2017 08:14AM]:                  from /pkg/src/cjs-3.6.1/g-ir-cpp-qcrkmdrb.c:4:
1162  [11/09/2017 08:14AM]:                  from /pkg/src/cjs-3.6.1/g-ir-cpp-to9o20j2.c:4:
1163  [11/09/2017 08:14AM]: ==> Finished making: cjs 3.6.1-1 (Thu Nov  9 14:14:54 UTC 2017)