Build Record

Build Number: 7661

Transaction: 3759
Package: brave
Version: 0.19.53dev-1
Start: 12/18/2017 10:43AM
Finish: 12/18/2017 10:48AM
Result: failed
 brave/PKGBUILD CHANGED

Build Log

  1 [12/18/2017 10:43AM]: [\^/\^/^\^/^\^/\^/\^/^\^/^\^/]  SETTING UP ENVIRONMENT  [\^/\^/^\^/^\^/\^/\^/^\^/^\^/]
  2  [12/18/2017 10:43AM]: [\^/\^/^\^/^\^/\^/\^/^\^/^\^/]  ADDING UPSTREAM PGP KEYS TO KEYRING  [\^/\^/^\^/^\^/\^/\^/^\^/^\^/]
  3  [12/18/2017 10:43AM]: gpg: WARNING: unsafe ownership on homedir /tmp/antbs/.gnupg
  4  [12/18/2017 10:43AM]: gpg: keybox /tmp/antbs/.gnupg/pubring.kbx created
  5  [12/18/2017 10:43AM]: gpg: key 23EFEFE93C4CFFFE: 1 signature not checked due to a missing key
  6  [12/18/2017 10:43AM]: gpg: /tmp/antbs/.gnupg/trustdb.gpg: trustdb created
  7  [12/18/2017 10:43AM]: gpg: key 23EFEFE93C4CFFFE: public key Italo A. Casas <[email protected]> imported
  8  [12/18/2017 10:43AM]: gpg: key B63B535A4C206CA9: 8 signatures not checked due to missing keys
  9  [12/18/2017 10:43AM]: gpg: key B63B535A4C206CA9: public key Evan Lucas <[email protected]> imported
 10  [12/18/2017 10:43AM]: gpg: key E73BC641CC11F4C8: 14 signatures not checked due to missing keys
 11  [12/18/2017 10:43AM]: gpg: key E73BC641CC11F4C8: public key Myles Borins <[email protected]> imported
 12  [12/18/2017 10:43AM]: gpg: key C273792F7D83545D: 2 signatures not checked due to missing keys
 13  [12/18/2017 10:43AM]: gpg: key C273792F7D83545D: public key Rod Vagg <[email protected]> imported
 14  [12/18/2017 10:43AM]: gpg: key C97EC7A07EDE3FC1: 19 signatures not checked due to missing keys
 15  [12/18/2017 10:43AM]: gpg: key C97EC7A07EDE3FC1: public key keybase.io/jasnell <[email protected]> imported
 16  [12/18/2017 10:43AM]: gpg: key 09FE44734EB7990E: public key Jeremiah Senkpiel <[email protected]> imported
 17  [12/18/2017 10:43AM]: gpg: key 7434390BDBE9B9C5: public key Colin Ihrig <[email protected]> imported
 18  [12/18/2017 10:43AM]: gpg: key 61B7B526D98F0353: 24 signatures not checked due to missing keys
 19  [12/18/2017 10:43AM]: gpg: key 61B7B526D98F0353: public key Mozilla Software Releases <[email protected]> imported
 20  [12/18/2017 10:43AM]: gpg: key 61B7B526D98F0353: Mozilla Software Releases <[email protected]> not changed
 21  [12/18/2017 10:43AM]: gpg: no ultimately trusted keys found
 22  [12/18/2017 10:43AM]: gpg: Total number processed: 9
 23  [12/18/2017 10:43AM]: gpg:               imported: 8
 24  [12/18/2017 10:43AM]: gpg:              unchanged: 1
 25  [12/18/2017 10:43AM]: [\^/\^/^\^/^\^/\^/\^/^\^/^\^/]  SYNCING REPO DATABASES  [\^/\^/^\^/^\^/\^/\^/^\^/^\^/]
 26  [12/18/2017 10:43AM]: :: Synchronizing package databases...
 27  [12/18/2017 10:43AM]: downloading antergos-staging.db...
 28  [12/18/2017 10:43AM]: downloading antergos.db...
 29  [12/18/2017 10:43AM]: downloading core.db...
 30  [12/18/2017 10:43AM]: downloading community.db...
 31  [12/18/2017 10:43AM]: :: Starting full system upgrade...
 32  [12/18/2017 10:43AM]: [\^/\^/^\^/^\^/\^/\^/^\^/^\^/]  TRYING BUILD  [\^/\^/^\^/^\^/\^/\^/^\^/^\^/]
 33  [12/18/2017 10:43AM]: [\^/\^/^\^/^\^/\^/\^/^\^/^\^/]  UPDATING SOURCE CHECKSUMS  [\^/\^/^\^/^\^/\^/\^/^\^/^\^/]
 34  [12/18/2017 10:43AM]: ==> Generating checksums for source files...
 35  [12/18/2017 10:43AM]: ==> Making package: brave 0.19.53dev-1 (Mon Dec 18 16:43:52 UTC 2017)
 36  [12/18/2017 10:43AM]: ==> Checking runtime dependencies...
 37  [12/18/2017 10:43AM]: ==> Installing missing dependencies...
 38  [12/18/2017 10:43AM]: :: There are 11 providers available for ttf-font:
 39  [12/18/2017 10:43AM]:    1) ttf-google-fonts-typewolf
 40  [12/18/2017 10:43AM]:    2) noto-fonts  3) noto-fonts-extra  4) ttf-bitstream-vera  5) ttf-croscore  6) ttf-dejavu  7) ttf-freefont  8) ttf-linux-libertine
 41  [12/18/2017 10:43AM]:    9) ttf-droid  10) ttf-liberation  11) ttf-ubuntu-font-family
 42  [12/18/2017 10:43AM]: Enter a number (default=1):
 43  [12/18/2017 10:43AM]: looking for conflicting packages...
 44  [12/18/2017 10:43AM]: warning: dependency cycle detected:
 45  [12/18/2017 10:43AM]: warning: harfbuzz will be installed before its freetype2 dependency
 46  [12/18/2017 10:43AM]: Packages (71) atk-2.26.1-1  avahi-0.7-2  cairo-1.15.8-2  compositeproto-0.4.2-3  damageproto-1.2.1-3  dbus-glib-0.108-1  fixesproto-5.0+9+g4292ec1-1  fontconfig-2.12.6+5+g665584a-1  freetype2-2.8.1-1  gdk-pixbuf2-2.36.11-1  graphite-1:1.3.10-1  gtk-update-icon-cache-3.22.26+47+g3a1a7135a2-3  harfbuzz-1.7.2-1  hicolor-icon-theme-0.17-1  icu-60.2-1  inputproto-2.3.2-1  jasper-2.0.14-1  js-24.2.0-4  kbproto-1.0.7-1  libcroco-0.6.12+4+g9ad7287-1  libcups-2.2.6-1  libdaemon-0.14-3  libdatrie-0.2.10-2  libfontenc-1.1.3-1  libjpeg-turbo-1.5.2-2  libpng-1.6.34-2  librsvg-2:2.40.20-1  libthai-0.1.27-1  libtiff-4.0.9-1  libx11-1.6.5-1  libxau-1.0.8-2  libxcb-1.12-1  libxcomposite-0.4.4-2  libxcursor-1.1.15-1  libxdamage-1.1.4-2  libxdmcp-1.1.2-1  libxext-1.3.3-1  libxfixes-5.0.3-1  libxft-2.3.2-1  libxi-1.7.9-1  libxinerama-1.1.3-2  libxml2-2.9.7+4+g72182550-2  libxrandr-1.5.1-1  libxrender-0.9.10-1  lzo-2.10-1  nspr-4.17-1  pango-1.40.14-1  pixman-0.34.0-1  polkit-0.113+34+g29ba7af-1  randrproto-1.5.0-1  recordproto-1.14.2-2  renderproto-0.11.1-3  scrnsaverproto-1.2.2-2  shared-mime-info-1.9-1  xcb-proto-1.12-3  xextproto-7.3.0-1  xineramaproto-1.2.1-3  xorg-fonts-encodings-1.0.4-4  xorg-mkfontdir-1.0.7-8  xorg-mkfontscale-1.1.2-1  xproto-7.0.31-1  alsa-lib-1.1.5-1  desktop-file-utils-0.23-1  gconf-3.2.6-5  gtk2-2.24.31-1  libgnome-keyring-3.12.0-2  libnotify-0.7.7-1  libxss-1.2.2-2  libxtst-1.2.3-1  nss-3.34.1-1  ttf-google-fonts-typewolf-17.11.git+2e2caa2-1
 47  [12/18/2017 10:43AM]: Total Download Size:     3.00 MiB
 48  [12/18/2017 10:43AM]: Total Installed Size:  313.72 MiB
 49  [12/18/2017 10:43AM]: :: Proceed with installation? [Y/n]
 50  [12/18/2017 10:43AM]: downloading harfbuzz-1.7.2-1-x86_64.pkg.tar.xz...
 51  [12/18/2017 10:43AM]: downloading libxinerama-1.1.3-2-x86_64.pkg.tar.xz...
 52  [12/18/2017 10:43AM]: downloading js-24.2.0-4-x86_64.pkg.tar.xz...
 53  [12/18/2017 10:43AM]: downloading polkit-0.113+34+g29ba7af-1-x86_64.pkg.tar.xz...
 54  [12/18/2017 10:43AM]: downloading libxtst-1.2.3-1-x86_64.pkg.tar.xz...
 55  [12/18/2017 10:43AM]: checking package integrity...
 56  [12/18/2017 10:43AM]: checking for file conflicts...
 57  [12/18/2017 10:43AM]: :: Processing package changes...
 58  [12/18/2017 10:43AM]: Optional dependencies for harfbuzz
 59  [12/18/2017 10:43AM]:     cairo: hb-view program [pending]
 60  [12/18/2017 10:43AM]: warning: directory permissions differ on /var/
 61  [12/18/2017 10:43AM]: filesystem: 777  package: 755
 62  [12/18/2017 10:43AM]:   Fontconfig configuration is done via /etc/fonts/conf.avail and conf.d.
 63  [12/18/2017 10:43AM]:   Read /etc/fonts/conf.d/README for more information.
 64  [12/18/2017 10:43AM]:   Configuration via /etc/fonts/local.conf is still possible,
 65  [12/18/2017 10:43AM]:   but is no longer recommended for options available in conf.avail.
 66  [12/18/2017 10:43AM]:   Main systemwide configuration should be done by symlinks
 67  [12/18/2017 10:43AM]:   (especially for autohinting, sub-pixel and lcdfilter):
 68  [12/18/2017 10:43AM]:   ln -s ../conf.avail/XX-foo.conf
 69  [12/18/2017 10:43AM]:   Check also https://wiki.archlinux.org/index.php/Font_Configuration
 70  [12/18/2017 10:43AM]:   and https://wiki.archlinux.org/index.php/Fonts.
 71  [12/18/2017 10:43AM]: Rebuilding fontconfig cache... done.
 72  [12/18/2017 10:43AM]: Optional dependencies for libxcursor
 73  [12/18/2017 10:43AM]:     gnome-themes-standard: fallback icon theme
 74  [12/18/2017 10:43AM]: installing compositeproto...
 75  [12/18/2017 10:43AM]: installing shared-mime-info...
 76  [12/18/2017 10:43AM]: Optional dependencies for libtiff
 77  [12/18/2017 10:43AM]:     freeglut: for using tiffgt
 78  [12/18/2017 10:43AM]: Optional dependencies for avahi
 79  [12/18/2017 10:43AM]:     gtk3: avahi-discover, avahi-discover-standalone, bshell, bssh, bvnc
 80  [12/18/2017 10:43AM]:     gtk2: gtk2 bindings [pending]
 81  [12/18/2017 10:43AM]:     pygtk: avahi-bookmarks
 82  [12/18/2017 10:43AM]:     python2-twisted: avahi-bookmarks
 83  [12/18/2017 10:43AM]:     nss-mdns: NSS support for mDNS
 84  [12/18/2017 10:43AM]:     python-gobject: avahi-discover
 85  [12/18/2017 10:43AM]:     python-dbus: avahi-discover
 86  [12/18/2017 10:43AM]: Optional dependencies for jasper
 87  [12/18/2017 10:43AM]:     jasper-doc: documentation
 88  [12/18/2017 10:43AM]: installing hicolor-icon-theme...
 89  [12/18/2017 10:43AM]: installing gtk-update-icon-cache...
 90  [12/18/2017 10:43AM]: installing desktop-file-utils...
 91  [12/18/2017 10:43AM]: Optional dependencies for gtk2
 92  [12/18/2017 10:43AM]:     gnome-themes-standard: Default widget theme
 93  [12/18/2017 10:43AM]:     adwaita-icon-theme: Default icon theme
 94  [12/18/2017 10:43AM]: Optional dependencies for alsa-lib
 95  [12/18/2017 10:43AM]:     python2: for python smixer plugin [installed]
 96  [12/18/2017 10:44AM]: installing xorg-fonts-encodings...
 97  [12/18/2017 10:44AM]: installing xorg-mkfontscale...
 98  [12/18/2017 10:44AM]: Creating X fontdir indices... done.
 99  [12/18/2017 10:44AM]: installing ttf-google-fonts-typewolf...
100  [12/18/2017 10:44AM]: installing libgnome-keyring...
101  [12/18/2017 10:44AM]: Optional dependencies for libgnome-keyring
102  [12/18/2017 10:44AM]:     gnome-keyring: key storage service (or use any other service implementing org.freedesktop.secrets)
103  [12/18/2017 10:44AM]: :: Running post-transaction hooks...
104  [12/18/2017 10:44AM]: ( 1/10) Updating fontconfig cache...
105  [12/18/2017 10:44AM]: ( 2/10) Probing GDK-Pixbuf loader modules...
106  [12/18/2017 10:44AM]: ( 3/10) Updating GIO module cache...
107  [12/18/2017 10:44AM]: ( 4/10) Probing GTK2 input method modules...
108  [12/18/2017 10:44AM]: ( 5/10) Updating icon theme caches...
109  [12/18/2017 10:44AM]: ( 6/10) Updating system user accounts...
110  [12/18/2017 10:44AM]: ( 7/10) Arming ConditionNeedsUpdate...
111  [12/18/2017 10:44AM]: ( 8/10) Updating the desktop file MIME type cache...
112  [12/18/2017 10:44AM]: ( 9/10) Updating the MIME type database...
113  [12/18/2017 10:44AM]: (10/10) Updating X fontdir indices...
114  [12/18/2017 10:44AM]: Packages (7) c-ares-1.13.0-1  http-parser-2.7.1-1  libuv-1.18.0-1  nodejs-9.3.0-1  openssl-1.0-1.0.2.n-1  semver-5.4.1-1  npm-5.6.0-1
115  [12/18/2017 10:44AM]: Total Installed Size:  45.87 MiB
116  [12/18/2017 10:44AM]: Optional dependencies for openssl-1.0
117  [12/18/2017 10:44AM]:     ca-certificates [installed]
118  [12/18/2017 10:44AM]: Optional dependencies for nodejs
119  [12/18/2017 10:44AM]:     npm: nodejs package manager [pending]
120  [12/18/2017 10:44AM]: Optional dependencies for npm
121  [12/18/2017 10:44AM]:     python2: for node-gyp [installed]
122  [12/18/2017 10:44AM]: (1/1) Arming ConditionNeedsUpdate...
123  [12/18/2017 10:44AM]:   -> Cloning browser-laptop git repo...
124  [12/18/2017 10:44AM]: Cloning into bare repository /pkg/browser-laptop...
125  [12/18/2017 10:44AM]: ==> Validating source files with md5sums...
126  [12/18/2017 10:44AM]:     brave.desktop ... Passed
127  [12/18/2017 10:44AM]:     browser-laptop ... Skipped
128  [12/18/2017 10:44AM]:   -> Creating working copy of browser-laptop git repo...
129  [12/18/2017 10:44AM]: Cloning into browser-laptop...
130  [12/18/2017 10:44AM]: Switched to a new branch makepkg
131  [12/18/2017 10:45AM]: > [email protected] preinstall /pkg/src/browser-laptop/node_modules/tracking-protection
132  [12/18/2017 10:45AM]: > npm install hashset-cpp && npm install cppunitlite
133  [12/18/2017 10:45AM]: > [email protected] install /pkg/src/browser-laptop/node_modules/tracking-protection/node_modules/hashset-cpp
134  [12/18/2017 10:45AM]: make: Entering directory /pkg/src/browser-laptop/node_modules/tracking-protection/node_modules/hashset-cpp/build
135  [12/18/2017 10:45AM]:   CXX(target) Release/obj.target/hashset-cpp/addon.o
136  [12/18/2017 10:45AM]:   CXX(target) Release/obj.target/hashset-cpp/HashSetWrap.o
137  [12/18/2017 10:45AM]: ../HashSetWrap.cpp: In static member function static void HashSetWrap::HashSetWrap::New(const v8::FunctionCallbackInfo<v8::Value>&):
138  [12/18/2017 10:45AM]: ../HashSetWrap.cpp:61:59: warning: v8::Local<v8::Object> v8::Function::NewInstance(int, v8::Local<v8::Value>*) const is deprecated: Use maybe version [-Wdeprecated-declarations]
139  [12/18/2017 10:45AM]:      args.GetReturnValue().Set(cons->NewInstance(argc, argv));
140  [12/18/2017 10:45AM]:                                                            ^
141  [12/18/2017 10:45AM]: In file included from /pkg/src/.node-gyp/4.4.29/deps/v8/include/v8.h:26:0,
142  [12/18/2017 10:45AM]:                  from /pkg/src/.node-gyp/4.4.29/src/node.h:42,
143  [12/18/2017 10:45AM]:                  from ../HashSetWrap.h:9,
144  [12/18/2017 10:45AM]:                  from ../HashSetWrap.cpp:6:
145  [12/18/2017 10:45AM]: /pkg/src/.node-gyp/4.4.29/deps/v8/include/v8.h:3829:31: note: declared here
146  [12/18/2017 10:45AM]:                  Local<Object> NewInstance(int argc, Local<Value> argv[]) const);
147  [12/18/2017 10:45AM]:                                ^
148  [12/18/2017 10:45AM]: /pkg/src/.node-gyp/4.4.29/deps/v8/include/v8config.h:318:3: note: in definition of macro V8_DEPRECATED
149  [12/18/2017 10:45AM]:    declarator __attribute__((deprecated(message)))
150  [12/18/2017 10:45AM]:   CXX(target) Release/obj.target/hashset-cpp/HashSet.o
151  [12/18/2017 10:45AM]:   SOLINK_MODULE(target) Release/obj.target/hashset-cpp.node
152  [12/18/2017 10:45AM]:   COPY Release/hashset-cpp.node
153  [12/18/2017 10:45AM]: make: Leaving directory /pkg/src/browser-laptop/node_modules/tracking-protection/node_modules/hashset-cpp/build
154  [12/18/2017 10:45AM]: npm notice created a lockfile as package-lock.json. You should commit this file.
155  [12/18/2017 10:45AM]: > [email protected] install /pkg/src/browser-laptop/node_modules/tracking-protection/node_modules/cppunitlite
156  [12/18/2017 10:45AM]: make: Entering directory /pkg/src/browser-laptop/node_modules/tracking-protection/node_modules/cppunitlite/build
157  [12/18/2017 10:45AM]:   CXX(target) Release/obj.target/CppUnitLite/src/Failure.o
158  [12/18/2017 10:45AM]:   CXX(target) Release/obj.target/CppUnitLite/src/SimpleString.o
159  [12/18/2017 10:45AM]:   CXX(target) Release/obj.target/CppUnitLite/src/Test.o
160  [12/18/2017 10:45AM]:   CXX(target) Release/obj.target/CppUnitLite/src/TestResult.o
161  [12/18/2017 10:45AM]:   CXX(target) Release/obj.target/CppUnitLite/src/TestRegistry.o
162  [12/18/2017 10:45AM]:   AR(target) Release/obj.target/CppUnitLite.a
163  [12/18/2017 10:45AM]:   COPY Release/CppUnitLite.a
164  [12/18/2017 10:45AM]:   CXX(target) Release/obj.target/test/test/StackMain.o
165  [12/18/2017 10:45AM]:   CXX(target) Release/obj.target/test/test/StackTest.o
166  [12/18/2017 10:45AM]:   LINK(target) Release/test
167  [12/18/2017 10:45AM]: make: Leaving directory /pkg/src/browser-laptop/node_modules/tracking-protection/node_modules/cppunitlite/build
168  [12/18/2017 10:45AM]: > [email protected] preinstall /pkg/src/browser-laptop/node_modules/ad-block
169  [12/18/2017 10:45AM]: > npm install bloom-filter-cpp && npm install hashset-cpp
170  [12/18/2017 10:45AM]: > [email protected] install /pkg/src/browser-laptop/node_modules/ad-block/node_modules/bloom-filter-cpp
171  [12/18/2017 10:45AM]: make: Entering directory /pkg/src/browser-laptop/node_modules/ad-block/node_modules/bloom-filter-cpp/build
172  [12/18/2017 10:45AM]:   CXX(target) Release/obj.target/bloom-filter-cpp/addon.o
173  [12/18/2017 10:45AM]:   CXX(target) Release/obj.target/bloom-filter-cpp/BloomFilterWrap.o
174  [12/18/2017 10:45AM]: ../BloomFilterWrap.cpp: In static member function static void BloomFilterWrap::BloomFilterWrap::New(const v8::FunctionCallbackInfo<v8::Value>&):
175  [12/18/2017 10:45AM]: ../BloomFilterWrap.cpp:62:59: warning: v8::Local<v8::Object> v8::Function::NewInstance(int, v8::Local<v8::Value>*) const is deprecated: Use maybe version [-Wdeprecated-declarations]
176  [12/18/2017 10:45AM]:                  from ../BloomFilterWrap.h:9,
177  [12/18/2017 10:45AM]:                  from ../BloomFilterWrap.cpp:6:
178  [12/18/2017 10:45AM]:   CXX(target) Release/obj.target/bloom-filter-cpp/BloomFilter.o
179  [12/18/2017 10:45AM]:   CXX(target) Release/obj.target/bloom-filter-cpp/hashFn.o
180  [12/18/2017 10:45AM]:   SOLINK_MODULE(target) Release/obj.target/bloom-filter-cpp.node
181  [12/18/2017 10:45AM]:   COPY Release/bloom-filter-cpp.node
182  [12/18/2017 10:45AM]: make: Leaving directory /pkg/src/browser-laptop/node_modules/ad-block/node_modules/bloom-filter-cpp/build
183  [12/18/2017 10:45AM]: > [email protected] install /pkg/src/browser-laptop/node_modules/ad-block/node_modules/hashset-cpp
184  [12/18/2017 10:45AM]: make: Entering directory /pkg/src/browser-laptop/node_modules/ad-block/node_modules/hashset-cpp/build
185  [12/18/2017 10:45AM]: make: Leaving directory /pkg/src/browser-laptop/node_modules/ad-block/node_modules/hashset-cpp/build
186  [12/18/2017 10:45AM]: > [email protected] install /pkg/src/browser-laptop/node_modules/bloom-filter-cpp
187  [12/18/2017 10:45AM]: make: Entering directory /pkg/src/browser-laptop/node_modules/bloom-filter-cpp/build
188  [12/18/2017 10:45AM]: make: Leaving directory /pkg/src/browser-laptop/node_modules/bloom-filter-cpp/build
189  [12/18/2017 10:45AM]: > [email protected] install /pkg/src/browser-laptop/node_modules/cppunitlite
190  [12/18/2017 10:45AM]: make: Entering directory /pkg/src/browser-laptop/node_modules/cppunitlite/build
191  [12/18/2017 10:45AM]: make: Leaving directory /pkg/src/browser-laptop/node_modules/cppunitlite/build
192  [12/18/2017 10:45AM]: > [email protected] install /pkg/src/browser-laptop/node_modules/hashset-cpp
193  [12/18/2017 10:45AM]: make: Entering directory /pkg/src/browser-laptop/node_modules/hashset-cpp/build
194  [12/18/2017 10:45AM]: make: Leaving directory /pkg/src/browser-laptop/node_modules/hashset-cpp/build
195  [12/18/2017 10:45AM]: > [email protected] install /pkg/src/browser-laptop/node_modules/dtrace-provider
196  [12/18/2017 10:45AM]: > [email protected] install /pkg/src/browser-laptop/node_modules/sha3
197  [12/18/2017 10:45AM]: make: Entering directory /pkg/src/browser-laptop/node_modules/sha3/build
198  [12/18/2017 10:45AM]:   CXX(target) Release/obj.target/sha3/src/addon.o
199  [12/18/2017 10:45AM]: In file included from ../../nan/nan.h:192:0,
200  [12/18/2017 10:45AM]:                  from ../src/addon.cpp:4:
201  [12/18/2017 10:45AM]: ../../nan/nan_maybe_43_inl.h: In function Nan::Maybe<bool> Nan::ForceSet(v8::Local<v8::Object>, v8::Local<v8::Value>, v8::Local<v8::Value>, v8::PropertyAttribute):
202  [12/18/2017 10:45AM]: ../../nan/nan_maybe_43_inl.h:112:73: warning: v8::Maybe<bool> v8::Object::ForceSet(v8::Local<v8::Context>, v8::Local<v8::Value>, v8::Local<v8::Value>, v8::PropertyAttribute) is deprecated: Use CreateDataProperty / DefineOwnProperty [-Wdeprecated-declarations]
203  [12/18/2017 10:45AM]:    return obj->ForceSet(isolate->GetCurrentContext(), key, value, attribs);
204  [12/18/2017 10:45AM]:                                                                          ^
205  [12/18/2017 10:45AM]:                  from ../src/addon.cpp:1:
206  [12/18/2017 10:45AM]: /pkg/src/.node-gyp/4.4.29/deps/v8/include/v8.h:3100:29: note: declared here
207  [12/18/2017 10:45AM]:                  Maybe<bool> ForceSet(Local<Context> context, Local<Value> key,
208  [12/18/2017 10:45AM]:                              ^
209  [12/18/2017 10:45AM]: ../src/addon.cpp: In static member function static Nan::NAN_METHOD_RETURN_TYPE SHA3Hash::New(Nan::NAN_METHOD_ARGS_TYPE):
210  [12/18/2017 10:45AM]: ../src/addon.cpp:49:23: warning: new of type SHA3Hash with extended alignment 32 [-Waligned-new=]
211  [12/18/2017 10:45AM]: ../src/addon.cpp:49:23: note: uses void* operator new(std::size_t), which does not have an alignment parameter
212  [12/18/2017 10:45AM]: ../src/addon.cpp:49:23: note: use -faligned-new to enable C++17 over-aligned new support
213  [12/18/2017 10:45AM]: ../src/addon.cpp:59:58: warning: v8::Local<v8::Object> v8::Function::NewInstance(int, v8::Local<v8::Value>*) const is deprecated: Use maybe version [-Wdeprecated-declarations]
214  [12/18/2017 10:45AM]:     info.GetReturnValue().Set(cons->NewInstance(argc, argv));
215  [12/18/2017 10:45AM]:                                                           ^
216  [12/18/2017 10:45AM]:   CXX(target) Release/obj.target/sha3/src/displayIntermediateValues.o
217  [12/18/2017 10:45AM]:   CXX(target) Release/obj.target/sha3/src/KeccakF-1600-reference.o
218  [12/18/2017 10:45AM]:   CXX(target) Release/obj.target/sha3/src/KeccakNISTInterface.o
219  [12/18/2017 10:45AM]:   CXX(target) Release/obj.target/sha3/src/KeccakSponge.o
220  [12/18/2017 10:45AM]:   SOLINK_MODULE(target) Release/obj.target/sha3.node
221  [12/18/2017 10:45AM]: make: Leaving directory /pkg/src/browser-laptop/node_modules/sha3/build
222  [12/18/2017 10:45AM]: > [email protected] install /pkg/src/browser-laptop/node_modules/bufferutil
223  [12/18/2017 10:45AM]: > prebuild-install || node-gyp rebuild
224  [12/18/2017 10:45AM]: /pkg/src/browser-laptop/node_modules/node-abi/index.js:45
225  [12/18/2017 10:45AM]:   throw new Error(Could not detect abi for version  + target +  and runtime  + runtime + .  Updating node-abi might help solve this issue if it is a new release of  + runtime)
226  [12/18/2017 10:45AM]: Error: Could not detect abi for version 4.4.29 and runtime electron.  Updating node-abi might help solve this issue if it is a new release of electron
227  [12/18/2017 10:45AM]:     at getAbi (/pkg/src/browser-laptop/node_modules/node-abi/index.js:45:9)
228  [12/18/2017 10:45AM]:     at module.exports (/pkg/src/browser-laptop/node_modules/prebuild-install/rc.js:57:12)
229  [12/18/2017 10:45AM]:     at Object.<anonymous> (/pkg/src/browser-laptop/node_modules/prebuild-install/bin.js:9:25)
230  [12/18/2017 10:45AM]:     at Module._compile (module.js:660:30)
231  [12/18/2017 10:45AM]:     at Object.Module._extensions..js (module.js:671:10)
232  [12/18/2017 10:45AM]:     at Module.load (module.js:573:32)
233  [12/18/2017 10:45AM]:     at tryModuleLoad (module.js:513:12)
234  [12/18/2017 10:45AM]:     at Function.Module._load (module.js:505:3)
235  [12/18/2017 10:45AM]:     at Function.Module.runMain (module.js:701:10)
236  [12/18/2017 10:45AM]:     at startup (bootstrap_node.js:194:16)
237  [12/18/2017 10:45AM]: make: Entering directory /pkg/src/browser-laptop/node_modules/bufferutil/build
238  [12/18/2017 10:45AM]:   CXX(target) Release/obj.target/bufferutil/src/bufferutil.o
239  [12/18/2017 10:45AM]: In file included from ../node_modules/nan/nan.h:192:0,
240  [12/18/2017 10:45AM]:                  from ../src/bufferutil.cc:7:
241  [12/18/2017 10:45AM]: ../node_modules/nan/nan_maybe_43_inl.h: In function Nan::Maybe<bool> Nan::ForceSet(v8::Local<v8::Object>, v8::Local<v8::Value>, v8::Local<v8::Value>, v8::PropertyAttribute):
242  [12/18/2017 10:45AM]: ../node_modules/nan/nan_maybe_43_inl.h:112:73: warning: v8::Maybe<bool> v8::Object::ForceSet(v8::Local<v8::Context>, v8::Local<v8::Value>, v8::Local<v8::Value>, v8::PropertyAttribute) is deprecated: Use CreateDataProperty / DefineOwnProperty [-Wdeprecated-declarations]
243  [12/18/2017 10:45AM]:                  from ../node_modules/nan/nan.h:49,
244  [12/18/2017 10:45AM]:   SOLINK_MODULE(target) Release/obj.target/bufferutil.node
245  [12/18/2017 10:45AM]:   COPY Release/bufferutil.node
246  [12/18/2017 10:45AM]: make: Leaving directory /pkg/src/browser-laptop/node_modules/bufferutil/build
247  [12/18/2017 10:45AM]: > [email protected] install /pkg/src/browser-laptop/node_modules/leveldown
248  [12/18/2017 10:45AM]: make: Entering directory /pkg/src/browser-laptop/node_modules/leveldown/build
249  [12/18/2017 10:45AM]:   CXX(target) Release/obj.target/leveldb/deps/leveldb/leveldb-1.20/db/builder.o
250  [12/18/2017 10:45AM]:   CXX(target) Release/obj.target/leveldb/deps/leveldb/leveldb-1.20/db/db_impl.o
251  [12/18/2017 10:45AM]:   CXX(target) Release/obj.target/leveldb/deps/leveldb/leveldb-1.20/db/db_iter.o
252  [12/18/2017 10:45AM]:   CXX(target) Release/obj.target/leveldb/deps/leveldb/leveldb-1.20/db/filename.o
253  [12/18/2017 10:45AM]:   CXX(target) Release/obj.target/leveldb/deps/leveldb/leveldb-1.20/db/dbformat.o
254  [12/18/2017 10:45AM]:   CXX(target) Release/obj.target/leveldb/deps/leveldb/leveldb-1.20/db/log_reader.o
255  [12/18/2017 10:45AM]:   CXX(target) Release/obj.target/leveldb/deps/leveldb/leveldb-1.20/db/log_writer.o
256  [12/18/2017 10:45AM]:   CXX(target) Release/obj.target/leveldb/deps/leveldb/leveldb-1.20/db/memtable.o
257  [12/18/2017 10:45AM]:   CXX(target) Release/obj.target/leveldb/deps/leveldb/leveldb-1.20/db/repair.o
258  [12/18/2017 10:45AM]:   CXX(target) Release/obj.target/leveldb/deps/leveldb/leveldb-1.20/db/table_cache.o
259  [12/18/2017 10:45AM]:   CXX(target) Release/obj.target/leveldb/deps/leveldb/leveldb-1.20/db/version_edit.o
260  [12/18/2017 10:45AM]:   CXX(target) Release/obj.target/leveldb/deps/leveldb/leveldb-1.20/db/version_set.o
261  [12/18/2017 10:45AM]:   CXX(target) Release/obj.target/leveldb/deps/leveldb/leveldb-1.20/db/write_batch.o
262  [12/18/2017 10:45AM]:   CXX(target) Release/obj.target/leveldb/deps/leveldb/leveldb-1.20/helpers/memenv/memenv.o
263  [12/18/2017 10:45AM]:   CXX(target) Release/obj.target/leveldb/deps/leveldb/leveldb-1.20/port/port_posix_sse.o
264  [12/18/2017 10:45AM]:   CXX(target) Release/obj.target/leveldb/deps/leveldb/leveldb-1.20/table/block.o
265  [12/18/2017 10:45AM]:   CXX(target) Release/obj.target/leveldb/deps/leveldb/leveldb-1.20/table/block_builder.o
266  [12/18/2017 10:45AM]:   CXX(target) Release/obj.target/leveldb/deps/leveldb/leveldb-1.20/table/filter_block.o
267  [12/18/2017 10:45AM]:   CXX(target) Release/obj.target/leveldb/deps/leveldb/leveldb-1.20/table/format.o
268  [12/18/2017 10:45AM]:   CXX(target) Release/obj.target/leveldb/deps/leveldb/leveldb-1.20/table/iterator.o
269  [12/18/2017 10:45AM]:   CXX(target) Release/obj.target/leveldb/deps/leveldb/leveldb-1.20/table/merger.o
270  [12/18/2017 10:45AM]:   CXX(target) Release/obj.target/leveldb/deps/leveldb/leveldb-1.20/table/table.o
271  [12/18/2017 10:45AM]:   CXX(target) Release/obj.target/leveldb/deps/leveldb/leveldb-1.20/table/table_builder.o
272  [12/18/2017 10:45AM]:   CXX(target) Release/obj.target/leveldb/deps/leveldb/leveldb-1.20/table/two_level_iterator.o
273  [12/18/2017 10:45AM]:   CXX(target) Release/obj.target/leveldb/deps/leveldb/leveldb-1.20/util/arena.o
274  [12/18/2017 10:45AM]:   CXX(target) Release/obj.target/leveldb/deps/leveldb/leveldb-1.20/util/bloom.o
275  [12/18/2017 10:45AM]:   CXX(target) Release/obj.target/leveldb/deps/leveldb/leveldb-1.20/util/cache.o
276  [12/18/2017 10:45AM]:   CXX(target) Release/obj.target/leveldb/deps/leveldb/leveldb-1.20/util/coding.o
277  [12/18/2017 10:45AM]:   CXX(target) Release/obj.target/leveldb/deps/leveldb/leveldb-1.20/util/comparator.o
278  [12/18/2017 10:45AM]:   CXX(target) Release/obj.target/leveldb/deps/leveldb/leveldb-1.20/util/crc32c.o
279  [12/18/2017 10:45AM]:   CXX(target) Release/obj.target/leveldb/deps/leveldb/leveldb-1.20/util/env.o
280  [12/18/2017 10:45AM]:   CXX(target) Release/obj.target/leveldb/deps/leveldb/leveldb-1.20/util/filter_policy.o
281  [12/18/2017 10:45AM]:   CXX(target) Release/obj.target/leveldb/deps/leveldb/leveldb-1.20/util/hash.o
282  [12/18/2017 10:45AM]: ../deps/leveldb/leveldb-1.20/util/hash.cc: In function uint32_t leveldb::Hash(const char*, size_t, uint32_t):
283  [12/18/2017 10:45AM]: ../deps/leveldb/leveldb-1.20/util/hash.cc:37:9: warning: this statement may fall through [-Wimplicit-fallthrough=]
284  [12/18/2017 10:45AM]:        h += static_cast<unsigned char>(data[2]) << 16;
285  [12/18/2017 10:45AM]:        ~~^~~~~~~~~~~~~~~~~~~~~~~~~~~~~~~~~~~~~~~~~~~~
286  [12/18/2017 10:45AM]: ../deps/leveldb/leveldb-1.20/util/hash.cc:39:5: note: here
287  [12/18/2017 10:45AM]: ../deps/leveldb/leveldb-1.20/util/hash.cc:40:9: warning: this statement may fall through [-Wimplicit-fallthrough=]
288  [12/18/2017 10:45AM]:        h += static_cast<unsigned char>(data[1]) << 8;
289  [12/18/2017 10:45AM]:        ~~^~~~~~~~~~~~~~~~~~~~~~~~~~~~~~~~~~~~~~~~~~~
290  [12/18/2017 10:45AM]: ../deps/leveldb/leveldb-1.20/util/hash.cc:42:5: note: here
291  [12/18/2017 10:45AM]:   CXX(target) Release/obj.target/leveldb/deps/leveldb/leveldb-1.20/util/logging.o
292  [12/18/2017 10:45AM]:   CXX(target) Release/obj.target/leveldb/deps/leveldb/leveldb-1.20/util/options.o
293  [12/18/2017 10:45AM]:   CXX(target) Release/obj.target/leveldb/deps/leveldb/leveldb-1.20/util/status.o
294  [12/18/2017 10:45AM]:   CXX(target) Release/obj.target/leveldb/deps/leveldb/leveldb-1.20/port/port_posix.o
295  [12/18/2017 10:45AM]:   CXX(target) Release/obj.target/leveldb/deps/leveldb/leveldb-1.20/util/env_posix.o
296  [12/18/2017 10:46AM]:   AR(target) Release/obj.target/deps/leveldb/leveldb.a
297  [12/18/2017 10:46AM]:   CXX(target) Release/obj.target/snappy/deps/snappy/snappy-1.1.4/snappy-sinksource.o
298  [12/18/2017 10:46AM]:   CXX(target) Release/obj.target/snappy/deps/snappy/snappy-1.1.4/snappy-stubs-internal.o
299  [12/18/2017 10:46AM]:   CXX(target) Release/obj.target/snappy/deps/snappy/snappy-1.1.4/snappy.o
300  [12/18/2017 10:46AM]:   AR(target) Release/obj.target/deps/snappy/snappy.a
301  [12/18/2017 10:46AM]:   CXX(target) Release/obj.target/leveldown/src/batch.o
302  [12/18/2017 10:46AM]:                  from ../src/batch.cc:3:
303  [12/18/2017 10:46AM]:                  from ../src/batch.cc:1:
304  [12/18/2017 10:46AM]:   CXX(target) Release/obj.target/leveldown/src/batch_async.o
305  [12/18/2017 10:46AM]:                  from ../src/database.h:16,
306  [12/18/2017 10:46AM]:                  from ../src/batch.h:9,
307  [12/18/2017 10:46AM]:                  from ../src/batch_async.cc:8:
308  [12/18/2017 10:46AM]:                  from ../src/batch.h:5,
309  [12/18/2017 10:46AM]:   CXX(target) Release/obj.target/leveldown/src/database.o
310  [12/18/2017 10:46AM]:                  from ../src/leveldown.h:11,
311  [12/18/2017 10:46AM]:                  from ../src/database.cc:12:
312  [12/18/2017 10:46AM]:                  from ../src/database.cc:6:
313  [12/18/2017 10:46AM]:   CXX(target) Release/obj.target/leveldown/src/database_async.o
314  [12/18/2017 10:46AM]:                  from ../src/database_async.cc:12:
315  [12/18/2017 10:46AM]:                  from ../src/database_async.cc:6:
316  [12/18/2017 10:46AM]:   CXX(target) Release/obj.target/leveldown/src/iterator.o
317  [12/18/2017 10:46AM]:                  from ../src/iterator.cc:9:
318  [12/18/2017 10:46AM]:                  from ../src/iterator.cc:6:
319  [12/18/2017 10:46AM]:   CXX(target) Release/obj.target/leveldown/src/iterator_async.o
320  [12/18/2017 10:46AM]:                  from ../src/iterator_async.cc:9:
321  [12/18/2017 10:46AM]:                  from ../src/iterator_async.cc:6:
322  [12/18/2017 10:46AM]:   CXX(target) Release/obj.target/leveldown/src/leveldown.o
323  [12/18/2017 10:46AM]:                  from ../src/leveldown.cc:8:
324  [12/18/2017 10:46AM]:                  from ../src/leveldown.cc:6:
325  [12/18/2017 10:46AM]:   CXX(target) Release/obj.target/leveldown/src/leveldown_async.o
326  [12/18/2017 10:46AM]:                  from ../src/leveldown_async.cc:8:
327  [12/18/2017 10:46AM]:                  from ../src/leveldown.h:8,
328  [12/18/2017 10:46AM]:   SOLINK_MODULE(target) Release/obj.target/leveldown.node
329  [12/18/2017 10:46AM]:   COPY Release/leveldown.node
330  [12/18/2017 10:46AM]: make: Leaving directory /pkg/src/browser-laptop/node_modules/leveldown/build
331  [12/18/2017 10:46AM]: > [email protected] install /pkg/src/browser-laptop/node_modules/prova-lib/node_modules/secp256k1
332  [12/18/2017 10:46AM]: > prebuild-install || node-gyp rebuild || echo Secp256k1 bindings compilation fail. Pure JS implementation will be used.
333  [12/18/2017 10:46AM]: make: Entering directory /pkg/src/browser-laptop/node_modules/prova-lib/node_modules/secp256k1/build
334  [12/18/2017 10:46AM]:   CXX(target) Release/obj.target/secp256k1/src/addon.o
335  [12/18/2017 10:46AM]: In file included from ../../../../nan/nan.h:192:0,
336  [12/18/2017 10:46AM]:                  from ../src/addon.cc:2:
337  [12/18/2017 10:46AM]: ../../../../nan/nan_maybe_43_inl.h: In function Nan::Maybe<bool> Nan::ForceSet(v8::Local<v8::Object>, v8::Local<v8::Value>, v8::Local<v8::Value>, v8::PropertyAttribute):
338  [12/18/2017 10:46AM]: ../../../../nan/nan_maybe_43_inl.h:112:73: warning: v8::Maybe<bool> v8::Object::ForceSet(v8::Local<v8::Context>, v8::Local<v8::Value>, v8::Local<v8::Value>, v8::PropertyAttribute) is deprecated: Use CreateDataProperty / DefineOwnProperty [-Wdeprecated-declarations]
339  [12/18/2017 10:46AM]:                  from ../src/addon.cc:1:
340  [12/18/2017 10:46AM]:   CXX(target) Release/obj.target/secp256k1/src/privatekey.o
341  [12/18/2017 10:46AM]:                  from ../src/privatekey.cc:2:
342  [12/18/2017 10:46AM]:                  from ../src/privatekey.cc:1:
343  [12/18/2017 10:46AM]:   CXX(target) Release/obj.target/secp256k1/src/publickey.o
344  [12/18/2017 10:46AM]:                  from ../src/publickey.cc:3:
345  [12/18/2017 10:46AM]:                  from ../src/publickey.cc:2:
346  [12/18/2017 10:46AM]:   CXX(target) Release/obj.target/secp256k1/src/signature.o
347  [12/18/2017 10:46AM]:                  from ../src/signature.cc:2:
348  [12/18/2017 10:46AM]:                  from ../src/signature.cc:1:
349  [12/18/2017 10:46AM]:   CXX(target) Release/obj.target/secp256k1/src/ecdsa.o
350  [12/18/2017 10:46AM]:                  from ../src/ecdsa.cc:2:
351  [12/18/2017 10:46AM]:                  from ../src/ecdsa.cc:1:
352  [12/18/2017 10:46AM]:   CXX(target) Release/obj.target/secp256k1/src/ecdh.o
353  [12/18/2017 10:46AM]:                  from ../src/ecdh.cc:2:
354  [12/18/2017 10:46AM]:                  from ../src/ecdh.cc:1:
355  [12/18/2017 10:46AM]:   CC(target) Release/obj.target/secp256k1/src/secp256k1-src/src/secp256k1.o
356  [12/18/2017 10:46AM]: ../src/secp256k1-src/src/secp256k1.c: In function secp256k1_ec_pubkey_parse:
357  [12/18/2017 10:46AM]: ../src/secp256k1-src/src/secp256k1.c:22:8: warning: nonnull argument pubkey compared to NULL [-Wnonnull-compare]
358  [12/18/2017 10:46AM]:      if (EXPECT(!(cond), 0)) { \
359  [12/18/2017 10:46AM]: ../src/secp256k1-src/src/secp256k1.c:154:5: note: in expansion of macro ARG_CHECK
360  [12/18/2017 10:46AM]:      ARG_CHECK(pubkey != NULL);
361  [12/18/2017 10:46AM]: ../src/secp256k1-src/src/secp256k1.c:22:8: warning: nonnull argument input compared to NULL [-Wnonnull-compare]
362  [12/18/2017 10:46AM]: ../src/secp256k1-src/src/secp256k1.c:156:5: note: in expansion of macro ARG_CHECK
363  [12/18/2017 10:46AM]:      ARG_CHECK(input != NULL);
364  [12/18/2017 10:46AM]: ../src/secp256k1-src/src/secp256k1.c: In function secp256k1_ec_pubkey_serialize:
365  [12/18/2017 10:46AM]: ../src/secp256k1-src/src/secp256k1.c:22:8: warning: nonnull argument output compared to NULL [-Wnonnull-compare]
366  [12/18/2017 10:46AM]: ../src/secp256k1-src/src/secp256k1.c:175:5: note: in expansion of macro ARG_CHECK
367  [12/18/2017 10:46AM]: ../src/secp256k1-src/src/secp256k1.c:22:8: warning: nonnull argument outputlen compared to NULL [-Wnonnull-compare]
368  [12/18/2017 10:46AM]: ../src/secp256k1-src/src/secp256k1.c:171:5: note: in expansion of macro ARG_CHECK
369  [12/18/2017 10:46AM]:      ARG_CHECK(outputlen != NULL);
370  [12/18/2017 10:46AM]: ../src/secp256k1-src/src/secp256k1.c:177:5: note: in expansion of macro ARG_CHECK
371  [12/18/2017 10:46AM]: ../src/secp256k1-src/src/secp256k1.c: In function secp256k1_ecdsa_signature_parse_der:
372  [12/18/2017 10:46AM]: ../src/secp256k1-src/src/secp256k1.c:22:8: warning: nonnull argument sig compared to NULL [-Wnonnull-compare]
373  [12/18/2017 10:46AM]: ../src/secp256k1-src/src/secp256k1.c:216:5: note: in expansion of macro ARG_CHECK
374  [12/18/2017 10:46AM]:      ARG_CHECK(sig != NULL);
375  [12/18/2017 10:46AM]: ../src/secp256k1-src/src/secp256k1.c:217:5: note: in expansion of macro ARG_CHECK
376  [12/18/2017 10:46AM]: ../src/secp256k1-src/src/secp256k1.c: In function secp256k1_ecdsa_signature_parse_compact:
377  [12/18/2017 10:46AM]: ../src/secp256k1-src/src/secp256k1.c:234:5: note: in expansion of macro ARG_CHECK
378  [12/18/2017 10:46AM]: ../src/secp256k1-src/src/secp256k1.c:22:8: warning: nonnull argument input64 compared to NULL [-Wnonnull-compare]
379  [12/18/2017 10:46AM]: ../src/secp256k1-src/src/secp256k1.c:235:5: note: in expansion of macro ARG_CHECK
380  [12/18/2017 10:46AM]:      ARG_CHECK(input64 != NULL);
381  [12/18/2017 10:46AM]: ../src/secp256k1-src/src/secp256k1.c: In function secp256k1_ecdsa_signature_serialize_der:
382  [12/18/2017 10:46AM]: ../src/secp256k1-src/src/secp256k1.c:253:5: note: in expansion of macro ARG_CHECK
383  [12/18/2017 10:46AM]: ../src/secp256k1-src/src/secp256k1.c:254:5: note: in expansion of macro ARG_CHECK
384  [12/18/2017 10:46AM]: ../src/secp256k1-src/src/secp256k1.c:255:5: note: in expansion of macro ARG_CHECK
385  [12/18/2017 10:46AM]: ../src/secp256k1-src/src/secp256k1.c: In function secp256k1_ecdsa_signature_serialize_compact:
386  [12/18/2017 10:46AM]: ../src/secp256k1-src/src/secp256k1.c:22:8: warning: nonnull argument output64 compared to NULL [-Wnonnull-compare]
387  [12/18/2017 10:46AM]: ../src/secp256k1-src/src/secp256k1.c:265:5: note: in expansion of macro ARG_CHECK
388  [12/18/2017 10:46AM]:      ARG_CHECK(output64 != NULL);
389  [12/18/2017 10:46AM]: ../src/secp256k1-src/src/secp256k1.c:266:5: note: in expansion of macro ARG_CHECK
390  [12/18/2017 10:46AM]: ../src/secp256k1-src/src/secp256k1.c: In function secp256k1_ecdsa_signature_normalize:
391  [12/18/2017 10:46AM]: ../src/secp256k1-src/src/secp256k1.c:22:8: warning: nonnull argument sigin compared to NULL [-Wnonnull-compare]
392  [12/18/2017 10:46AM]: ../src/secp256k1-src/src/secp256k1.c:279:5: note: in expansion of macro ARG_CHECK
393  [12/18/2017 10:46AM]: ../src/secp256k1-src/src/secp256k1.c: In function secp256k1_ecdsa_verify:
394  [12/18/2017 10:46AM]: ../src/secp256k1-src/src/secp256k1.c:300:5: note: in expansion of macro ARG_CHECK
395  [12/18/2017 10:46AM]: ../src/secp256k1-src/src/secp256k1.c:22:8: warning: nonnull argument msg32 compared to NULL [-Wnonnull-compare]
396  [12/18/2017 10:46AM]: ../src/secp256k1-src/src/secp256k1.c:299:5: note: in expansion of macro ARG_CHECK
397  [12/18/2017 10:46AM]: ../src/secp256k1-src/src/secp256k1.c:301:5: note: in expansion of macro ARG_CHECK
398  [12/18/2017 10:46AM]: ../src/secp256k1-src/src/secp256k1.c: In function secp256k1_ecdsa_sign:
399  [12/18/2017 10:46AM]: ../src/secp256k1-src/src/secp256k1.c:22:8: warning: nonnull argument signature compared to NULL [-Wnonnull-compare]
400  [12/18/2017 10:46AM]: ../src/secp256k1-src/src/secp256k1.c:353:5: note: in expansion of macro ARG_CHECK
401  [12/18/2017 10:46AM]: ../src/secp256k1-src/src/secp256k1.c:352:5: note: in expansion of macro ARG_CHECK
402  [12/18/2017 10:46AM]: ../src/secp256k1-src/src/secp256k1.c:22:8: warning: nonnull argument seckey compared to NULL [-Wnonnull-compare]
403  [12/18/2017 10:46AM]: ../src/secp256k1-src/src/secp256k1.c:354:5: note: in expansion of macro ARG_CHECK
404  [12/18/2017 10:46AM]: ../src/secp256k1-src/src/secp256k1.c: In function secp256k1_ec_seckey_verify:
405  [12/18/2017 10:46AM]: ../src/secp256k1-src/src/secp256k1.c:396:5: note: in expansion of macro ARG_CHECK
406  [12/18/2017 10:46AM]: ../src/secp256k1-src/src/secp256k1.c: In function secp256k1_ec_pubkey_create:
407  [12/18/2017 10:46AM]: ../src/secp256k1-src/src/secp256k1.c:411:5: note: in expansion of macro ARG_CHECK
408  [12/18/2017 10:46AM]: ../src/secp256k1-src/src/secp256k1.c:414:5: note: in expansion of macro ARG_CHECK
409  [12/18/2017 10:46AM]: ../src/secp256k1-src/src/secp256k1.c: In function secp256k1_ec_privkey_negate:
410  [12/18/2017 10:46AM]: ../src/secp256k1-src/src/secp256k1.c:430:5: note: in expansion of macro ARG_CHECK
411  [12/18/2017 10:46AM]: ../src/secp256k1-src/src/secp256k1.c: In function secp256k1_ec_pubkey_negate:
412  [12/18/2017 10:46AM]: ../src/secp256k1-src/src/secp256k1.c:443:5: note: in expansion of macro ARG_CHECK
413  [12/18/2017 10:46AM]: ../src/secp256k1-src/src/secp256k1.c: In function secp256k1_ec_privkey_tweak_add:
414  [12/18/2017 10:46AM]: ../src/secp256k1-src/src/secp256k1.c:460:5: note: in expansion of macro ARG_CHECK
415  [12/18/2017 10:46AM]: ../src/secp256k1-src/src/secp256k1.c:22:8: warning: nonnull argument tweak compared to NULL [-Wnonnull-compare]
416  [12/18/2017 10:46AM]: ../src/secp256k1-src/src/secp256k1.c:461:5: note: in expansion of macro ARG_CHECK
417  [12/18/2017 10:46AM]: ../src/secp256k1-src/src/secp256k1.c: In function secp256k1_ec_pubkey_tweak_add:
418  [12/18/2017 10:46AM]: ../src/secp256k1-src/src/secp256k1.c:484:5: note: in expansion of macro ARG_CHECK
419  [12/18/2017 10:46AM]: ../src/secp256k1-src/src/secp256k1.c:485:5: note: in expansion of macro ARG_CHECK
420  [12/18/2017 10:46AM]: ../src/secp256k1-src/src/secp256k1.c: In function secp256k1_ec_privkey_tweak_mul:
421  [12/18/2017 10:46AM]: ../src/secp256k1-src/src/secp256k1.c:507:5: note: in expansion of macro ARG_CHECK
422  [12/18/2017 10:46AM]: ../src/secp256k1-src/src/secp256k1.c:508:5: note: in expansion of macro ARG_CHECK
423  [12/18/2017 10:46AM]: ../src/secp256k1-src/src/secp256k1.c: In function secp256k1_ec_pubkey_tweak_mul:
424  [12/18/2017 10:46AM]: ../src/secp256k1-src/src/secp256k1.c:530:5: note: in expansion of macro ARG_CHECK
425  [12/18/2017 10:46AM]: ../src/secp256k1-src/src/secp256k1.c:531:5: note: in expansion of macro ARG_CHECK
426  [12/18/2017 10:46AM]: ../src/secp256k1-src/src/secp256k1.c: In function secp256k1_ec_pubkey_combine:
427  [12/18/2017 10:46AM]: ../src/secp256k1-src/src/secp256k1.c:22:8: warning: nonnull argument pubnonce compared to NULL [-Wnonnull-compare]
428  [12/18/2017 10:46AM]: ../src/secp256k1-src/src/secp256k1.c:559:5: note: in expansion of macro ARG_CHECK
429  [12/18/2017 10:46AM]: ../src/secp256k1-src/src/secp256k1.c:22:8: warning: nonnull argument pubnonces compared to NULL [-Wnonnull-compare]
430  [12/18/2017 10:46AM]: ../src/secp256k1-src/src/secp256k1.c:562:5: note: in expansion of macro ARG_CHECK
431  [12/18/2017 10:46AM]: ../src/secp256k1-src/src/secp256k1.c: In function secp256k1_ecdsa_recoverable_signature_parse_compact:
432  [12/18/2017 10:46AM]: ../src/secp256k1-src/src/modules/recovery/main_impl.h:44:5: note: in expansion of macro ARG_CHECK
433  [12/18/2017 10:46AM]: ../src/secp256k1-src/src/modules/recovery/main_impl.h:45:5: note: in expansion of macro ARG_CHECK
434  [12/18/2017 10:46AM]: ../src/secp256k1-src/src/secp256k1.c: In function secp256k1_ecdsa_recoverable_signature_serialize_compact:
435  [12/18/2017 10:46AM]: ../src/secp256k1-src/src/modules/recovery/main_impl.h:64:5: note: in expansion of macro ARG_CHECK
436  [12/18/2017 10:46AM]: ../src/secp256k1-src/src/secp256k1.c:22:8: warning: nonnull argument recid compared to NULL [-Wnonnull-compare]
437  [12/18/2017 10:46AM]: ../src/secp256k1-src/src/modules/recovery/main_impl.h:66:5: note: in expansion of macro ARG_CHECK
438  [12/18/2017 10:46AM]: ../src/secp256k1-src/src/modules/recovery/main_impl.h:65:5: note: in expansion of macro ARG_CHECK
439  [12/18/2017 10:46AM]: ../src/secp256k1-src/src/secp256k1.c: In function secp256k1_ecdsa_recoverable_signature_convert:
440  [12/18/2017 10:46AM]: ../src/secp256k1-src/src/modules/recovery/main_impl.h:79:5: note: in expansion of macro ARG_CHECK
441  [12/18/2017 10:46AM]: ../src/secp256k1-src/src/modules/recovery/main_impl.h:80:5: note: in expansion of macro ARG_CHECK
442  [12/18/2017 10:46AM]: ../src/secp256k1-src/src/secp256k1.c: In function secp256k1_ecdsa_sign_recoverable:
443  [12/18/2017 10:46AM]: ../src/secp256k1-src/src/modules/recovery/main_impl.h:132:5: note: in expansion of macro ARG_CHECK
444  [12/18/2017 10:46AM]: ../src/secp256k1-src/src/modules/recovery/main_impl.h:131:5: note: in expansion of macro ARG_CHECK
445  [12/18/2017 10:46AM]: ../src/secp256k1-src/src/modules/recovery/main_impl.h:133:5: note: in expansion of macro ARG_CHECK
446  [12/18/2017 10:46AM]: ../src/secp256k1-src/src/secp256k1.c: In function secp256k1_ecdsa_recover:
447  [12/18/2017 10:46AM]: ../src/secp256k1-src/src/modules/recovery/main_impl.h:179:5: note: in expansion of macro ARG_CHECK
448  [12/18/2017 10:46AM]: ../src/secp256k1-src/src/modules/recovery/main_impl.h:178:5: note: in expansion of macro ARG_CHECK
449  [12/18/2017 10:46AM]: ../src/secp256k1-src/src/modules/recovery/main_impl.h:177:5: note: in expansion of macro ARG_CHECK
450  [12/18/2017 10:46AM]:   CC(target) Release/obj.target/secp256k1/src/secp256k1-src/contrib/lax_der_parsing.o
451  [12/18/2017 10:46AM]:   CC(target) Release/obj.target/secp256k1/src/secp256k1-src/contrib/lax_der_privatekey_parsing.o
452  [12/18/2017 10:46AM]:   SOLINK_MODULE(target) Release/obj.target/secp256k1.node
453  [12/18/2017 10:46AM]: make: Leaving directory /pkg/src/browser-laptop/node_modules/prova-lib/node_modules/secp256k1/build
454  [12/18/2017 10:46AM]: > [email protected] install /pkg/src/browser-laptop/node_modules/secp256k1
455  [12/18/2017 10:46AM]: (node:1155) MaxListenersExceededWarning: Possible EventEmitter memory leak detected. 11 SIGINT listeners added. Use emitter.setMaxListeners() to increase limit
456  [12/18/2017 10:46AM]: make: Entering directory /pkg/src/browser-laptop/node_modules/secp256k1/build
457  [12/18/2017 10:46AM]: ../src/secp256k1-src/src/secp256k1.c:433:5: note: in expansion of macro ARG_CHECK
458  [12/18/2017 10:46AM]: ../src/secp256k1-src/src/secp256k1.c:434:5: note: in expansion of macro ARG_CHECK
459  [12/18/2017 10:46AM]: ../src/secp256k1-src/src/secp256k1.c:457:5: note: in expansion of macro ARG_CHECK
460  [12/18/2017 10:46AM]: ../src/secp256k1-src/src/secp256k1.c:458:5: note: in expansion of macro ARG_CHECK
461  [12/18/2017 10:46AM]: ../src/secp256k1-src/src/secp256k1.c:480:5: note: in expansion of macro ARG_CHECK
462  [12/18/2017 10:46AM]: ../src/secp256k1-src/src/secp256k1.c:481:5: note: in expansion of macro ARG_CHECK
463  [12/18/2017 10:46AM]: ../src/secp256k1-src/src/secp256k1.c:503:5: note: in expansion of macro ARG_CHECK
464  [12/18/2017 10:46AM]: ../src/secp256k1-src/src/secp256k1.c:504:5: note: in expansion of macro ARG_CHECK
465  [12/18/2017 10:46AM]: ../src/secp256k1-src/src/secp256k1.c:532:5: note: in expansion of macro ARG_CHECK
466  [12/18/2017 10:46AM]: ../src/secp256k1-src/src/secp256k1.c:535:5: note: in expansion of macro ARG_CHECK
467  [12/18/2017 10:46AM]: make: Leaving directory /pkg/src/browser-laptop/node_modules/secp256k1/build
468  [12/18/2017 10:46AM]: > [email protected] install /pkg/src/browser-laptop/node_modules/spectron/node_modules/electron-chromedriver
469  [12/18/2017 10:46AM]: > node ./download-chromedriver.js
470  [12/18/2017 10:46AM]: > [email protected] install /pkg/src/browser-laptop/node_modules/ad-block
471  [12/18/2017 10:46AM]: make: Entering directory /pkg/src/browser-laptop/node_modules/ad-block/build
472  [12/18/2017 10:46AM]:   CXX(target) Release/obj.target/ad-block/addon.o
473  [12/18/2017 10:46AM]:   CXX(target) Release/obj.target/ad-block/ad_block_client_wrap.o
474  [12/18/2017 10:46AM]: ../ad_block_client_wrap.cc: In static member function static void ad_block_client_wrap::AdBlockClientWrap::New(const v8::FunctionCallbackInfo<v8::Value>&):
475  [12/18/2017 10:46AM]: ../ad_block_client_wrap.cc:117:59: warning: v8::Local<v8::Object> v8::Function::NewInstance(int, v8::Local<v8::Value>*) const is deprecated: Use maybe version [-Wdeprecated-declarations]
476  [12/18/2017 10:46AM]:                  from /pkg/src/.node-gyp/4.4.29/src/node_buffer.h:4,
477  [12/18/2017 10:46AM]:                  from ../ad_block_client_wrap.cc:6:
478  [12/18/2017 10:46AM]:   CXX(target) Release/obj.target/ad-block/ad_block_client.o
479  [12/18/2017 10:46AM]: ../ad_block_client.cc: In function void parseFilter(const char*, const char*, Filter*, BloomFilter*, BloomFilter*, HashSet<Filter>*, HashSet<Filter>*, HashSet<CosmeticFilter>*):
480  [12/18/2017 10:46AM]: ../ad_block_client.cc:313:29: warning: this statement may fall through [-Wimplicit-fallthrough=]
481  [12/18/2017 10:46AM]:            if (*(p+1) == # || *(p+1) == @) {
482  [12/18/2017 10:46AM]:                ~~~~~~~~~~~~~~^~~~~~~~~~~~~~~~
483  [12/18/2017 10:46AM]: ../ad_block_client.cc:328:9: note: here
484  [12/18/2017 10:46AM]:   CXX(target) Release/obj.target/ad-block/cosmetic_filter.o
485  [12/18/2017 10:46AM]:   CXX(target) Release/obj.target/ad-block/filter.o
486  [12/18/2017 10:46AM]:   CXX(target) Release/obj.target/ad-block/node_modules/bloom-filter-cpp/BloomFilter.o
487  [12/18/2017 10:46AM]:   CXX(target) Release/obj.target/ad-block/node_modules/bloom-filter-cpp/hashFn.o
488  [12/18/2017 10:46AM]:   CXX(target) Release/obj.target/ad-block/node_modules/hashset-cpp/HashSet.o
489  [12/18/2017 10:46AM]:   SOLINK_MODULE(target) Release/obj.target/ad-block.node
490  [12/18/2017 10:46AM]:   COPY Release/ad-block.node
491  [12/18/2017 10:46AM]: make: Leaving directory /pkg/src/browser-laptop/node_modules/ad-block/build
492  [12/18/2017 10:46AM]: > [email protected] install /pkg/src/browser-laptop/node_modules/electron-chromedriver
493  [12/18/2017 10:46AM]: > [email protected] install /pkg/src/browser-laptop/node_modules/keytar
494  [12/18/2017 10:46AM]: make: Entering directory /pkg/src/browser-laptop/node_modules/keytar/build
495  [12/18/2017 10:46AM]:   CXX(target) Release/obj.target/keytar/src/main.o
496  [12/18/2017 10:46AM]:   CXX(target) Release/obj.target/keytar/src/keytar_posix.o
497  [12/18/2017 10:46AM]:   SOLINK_MODULE(target) Release/obj.target/keytar.node
498  [12/18/2017 10:46AM]:   COPY Release/keytar.node
499  [12/18/2017 10:46AM]: make: Leaving directory /pkg/src/browser-laptop/node_modules/keytar/build
500  [12/18/2017 10:46AM]: > [email protected] install /pkg/src/browser-laptop/node_modules/nsp/node_modules/git-validate
501  [12/18/2017 10:46AM]: > [email protected] install /pkg/src/browser-laptop/node_modules/pre-commit
502  [12/18/2017 10:46AM]: pre-commit: Detected an existing git pre-commit hook
503  [12/18/2017 10:46AM]: pre-commit: Old pre-commit hook backuped to pre-commit.old
504  [12/18/2017 10:46AM]: > [email protected] install /pkg/src/browser-laptop/node_modules/pre-push
505  [12/18/2017 10:46AM]: pre-push: Detected an existing git pre-push hook
506  [12/18/2017 10:46AM]: pre-push: Old pre-push hook backuped to pre-push.old
507  [12/18/2017 10:46AM]: > [email protected] install /pkg/src/browser-laptop/node_modules/tracking-protection
508  [12/18/2017 10:46AM]: make: Entering directory /pkg/src/browser-laptop/node_modules/tracking-protection/build
509  [12/18/2017 10:46AM]: test.target.mk:137: warning: overriding recipe for target Release/test
510  [12/18/2017 10:46AM]: node_modules/cppunitlite/test.target.mk:125: warning: ignoring old recipe for target Release/test
511  [12/18/2017 10:46AM]:   CXX(target) Release/obj.target/CppUnitLite/node_modules/cppunitlite/src/Failure.o
512  [12/18/2017 10:46AM]:   CXX(target) Release/obj.target/CppUnitLite/node_modules/cppunitlite/src/SimpleString.o
513  [12/18/2017 10:46AM]:   CXX(target) Release/obj.target/CppUnitLite/node_modules/cppunitlite/src/Test.o
514  [12/18/2017 10:46AM]:   CXX(target) Release/obj.target/CppUnitLite/node_modules/cppunitlite/src/TestResult.o
515  [12/18/2017 10:46AM]:   CXX(target) Release/obj.target/CppUnitLite/node_modules/cppunitlite/src/TestRegistry.o
516  [12/18/2017 10:46AM]:   AR(target) Release/obj.target/node_modules/cppunitlite/CppUnitLite.a
517  [12/18/2017 10:46AM]:   CXX(target) Release/obj.target/hashset-cpp/node_modules/hashset-cpp/addon.o
518  [12/18/2017 10:46AM]:   CXX(target) Release/obj.target/hashset-cpp/node_modules/hashset-cpp/HashSetWrap.o
519  [12/18/2017 10:46AM]: ../node_modules/hashset-cpp/HashSetWrap.cpp: In static member function static void HashSetWrap::HashSetWrap::New(const v8::FunctionCallbackInfo<v8::Value>&):
520  [12/18/2017 10:46AM]: ../node_modules/hashset-cpp/HashSetWrap.cpp:61:59: warning: v8::Local<v8::Object> v8::Function::NewInstance(int, v8::Local<v8::Value>*) const is deprecated: Use maybe version [-Wdeprecated-declarations]
521  [12/18/2017 10:46AM]:                  from ../node_modules/hashset-cpp/HashSetWrap.h:9,
522  [12/18/2017 10:46AM]:                  from ../node_modules/hashset-cpp/HashSetWrap.cpp:6:
523  [12/18/2017 10:46AM]:   CXX(target) Release/obj.target/hashset-cpp/node_modules/hashset-cpp/HashSet.o
524  [12/18/2017 10:46AM]:   SOLINK_MODULE(target) Release/obj.target/node_modules/hashset-cpp/hashset-cpp.node
525  [12/18/2017 10:46AM]:   CXX(target) Release/obj.target/sample/main.o
526  [12/18/2017 10:46AM]:   CXX(target) Release/obj.target/sample/TPParser.o
527  [12/18/2017 10:46AM]:   CXX(target) Release/obj.target/sample/node_modules/hashset-cpp/HashSet.o
528  [12/18/2017 10:46AM]:   LINK(target) Release/sample
529  [12/18/2017 10:46AM]:   CXX(target) Release/obj.target/test/test/test-main.o
530  [12/18/2017 10:46AM]: g++: warning: ..: linker input file unused because linking not done
531  [12/18/2017 10:46AM]:   CXX(target) Release/obj.target/test/test/tracking-protection-test.o
532  [12/18/2017 10:46AM]:   CXX(target) Release/obj.target/test/TPParser.o
533  [12/18/2017 10:46AM]:   CXX(target) Release/obj.target/test/node_modules/hashset-cpp/HashSet.o
534  [12/18/2017 10:46AM]:   CXX(target) Release/obj.target/test/node_modules/cppunitlite/test/StackMain.o
535  [12/18/2017 10:46AM]:   CXX(target) Release/obj.target/test/node_modules/cppunitlite/test/StackTest.o
536  [12/18/2017 10:46AM]:   CXX(target) Release/obj.target/tp_node_addon/TPParser.o
537  [12/18/2017 10:46AM]:   CXX(target) Release/obj.target/tp_node_addon/node_addon/TPParserWrap.o
538  [12/18/2017 10:46AM]: ../node_addon/TPParserWrap.cpp: In static member function static void TPParserWrap::CTPParserWrap::New(const v8::FunctionCallbackInfo<v8::Value>&):
539  [12/18/2017 10:46AM]: ../node_addon/TPParserWrap.cpp:70:67: warning: v8::Local<v8::Object> v8::Function::NewInstance(int, v8::Local<v8::Value>*) const is deprecated: Use maybe version [-Wdeprecated-declarations]
540  [12/18/2017 10:46AM]:              args.GetReturnValue().Set(cons->NewInstance(argc, argv));
541  [12/18/2017 10:46AM]:                                                                    ^
542  [12/18/2017 10:46AM]:                  from ../node_addon/TPParserWrap.cpp:6:
543  [12/18/2017 10:46AM]:   CXX(target) Release/obj.target/tp_node_addon/node_addon/addon.o
544  [12/18/2017 10:46AM]:   SOLINK_MODULE(target) Release/obj.target/tp_node_addon.node
545  [12/18/2017 10:46AM]:   COPY Release/tp_node_addon.node
546  [12/18/2017 10:46AM]:   CXX(target) Release/obj.target/tracking-protection/TPParser.o
547  [12/18/2017 10:46AM]:   AR(target) Release/obj.target/tracking-protection.a
548  [12/18/2017 10:46AM]:   COPY Release/tracking-protection.a
549  [12/18/2017 10:46AM]: make: Leaving directory /pkg/src/browser-laptop/node_modules/tracking-protection/build
550  [12/18/2017 10:46AM]: > [email protected] postinstall /pkg/src/browser-laptop/node_modules/bat-client/node_modules/tldjs
551  [12/18/2017 10:46AM]: > node ./bin/postinstall.js
552  [12/18/2017 10:46AM]: > [email protected] postinstall /pkg/src/browser-laptop/node_modules/bat-publisher/node_modules/tldjs
553  [12/18/2017 10:46AM]: > [email protected] postinstall /pkg/src/browser-laptop/node_modules/spawn-sync
554  [12/18/2017 10:46AM]: > [email protected] postinstall /pkg/src/browser-laptop/node_modules/electron-prebuilt
555  [12/18/2017 10:46AM]: Downloading brave-v4.4.29-linux-x64.zip
556  [12/18/2017 10:46AM]: [>                                            ] 0.0% (0 B/s)
557  [12/18/2017 10:46AM]: Downloading brave-v4.4.29-linux-x64.zip
558  [12/18/2017 10:46AM]: [>                                            ] 0.0% of 52.4 MB (0 B/s)
559  [12/18/2017 10:46AM]: [>                                            ] 1.3% of 52.4 MB (677.4 kB/s)
560  [12/18/2017 10:46AM]: [=>                                           ] 6.1% of 52.4 MB (2.58 MB/s)
561  [12/18/2017 10:46AM]: [======>                                      ] 17.7% of 52.4 MB (6.2 MB/s)
562  [12/18/2017 10:46AM]: [==================>                          ] 42.5% of 52.4 MB (12.72 MB/s)
563  [12/18/2017 10:46AM]: [================================>            ] 74.4% of 52.4 MB (19.48 MB/s)
564  [12/18/2017 10:46AM]: [============================================>] 100.0% of 52.4 MB (26.2 MB/s)
565  [12/18/2017 10:46AM]: > [email protected] postinstall /pkg/src/browser-laptop/node_modules/flow-bin
566  [12/18/2017 10:46AM]:   ✔ flow binary test passed successfully
567  [12/18/2017 10:46AM]: > [email protected] postinstall /pkg/src/browser-laptop
568  [12/18/2017 10:46AM]: > npm run download-sync-client && webpack
569  [12/18/2017 10:46AM]: > [email protected] download-sync-client /pkg/src/browser-laptop
570  [12/18/2017 10:46AM]: > node ./tools/downloadSyncClient
571  [12/18/2017 10:47AM]: writing sync bundle to /pkg/src/browser-laptop/app/extensions/brave/content/scripts/sync.js
572  [12/18/2017 10:47AM]: Hash: ea6036b76340183c1b56235271770f06807edf5bd031c5c981f8db651281
573  [12/18/2017 10:47AM]:     Hash: ea6036b76340183c1b56
574  [12/18/2017 10:47AM]:     Version: webpack 1.15.0
575  [12/18/2017 10:47AM]:                                      Asset       Size  Chunks             Chunk Names
576  [12/18/2017 10:47AM]:       de46bc0216c15ce3302139b3c2af4884.svg  789 bytes          [emitted]
577  [12/18/2017 10:47AM]:       41943a7d37ac5c61823a2a17c4e06070.svg  733 bytes          [emitted]
578  [12/18/2017 10:47AM]:     af7ae505a9eed503f8b8e6982036873e.woff2    77.2 kB          [emitted]
579  [12/18/2017 10:47AM]:      fee66e712a8a08eef5805a46892932ad.woff      98 kB          [emitted]
580  [12/18/2017 10:47AM]:       b06871f281fee6b241d60582ae9369b9.ttf     166 kB          [emitted]
581  [12/18/2017 10:47AM]:       912ec66d7572ff821749319396470bde.svg     444 kB          [emitted]
582  [12/18/2017 10:47AM]:       2ad15189f9772058209b9036ebf8bda1.svg    1.34 kB          [emitted]
583  [12/18/2017 10:47AM]:       292a09c3abb7e423680bb8be4de82460.svg  768 bytes          [emitted]
584  [12/18/2017 10:47AM]:       f9c5944d81cb03f5601faa8815856fc4.svg     1.3 kB          [emitted]
585  [12/18/2017 10:47AM]:       a42c3b4a1de787c14f05edf1ec49c9fd.svg    1.72 kB          [emitted]
586  [12/18/2017 10:47AM]:       dfd0990bd610a78a34d31bd751d140bd.svg    1.72 kB          [emitted]
587  [12/18/2017 10:47AM]:       b6dd4b1292cfd4470e58486c56ad0832.svg    3.69 kB          [emitted]
588  [12/18/2017 10:47AM]:       f3b9223a9b686682b28b618d9f28817e.svg  792 bytes          [emitted]
589  [12/18/2017 10:47AM]:       59023652f84793c67f7775cea1b33195.svg  670 bytes          [emitted]
590  [12/18/2017 10:47AM]:       fbb1a0acb7d12f9e64c82a8cc82aeb66.svg  615 bytes          [emitted]
591  [12/18/2017 10:47AM]:       7e57f5ffe33356122ffb083eecf8f2cf.svg    1.13 kB          [emitted]
592  [12/18/2017 10:47AM]:       ab6512b7dac5700b20f7de361aa47884.svg    1.03 kB          [emitted]
593  [12/18/2017 10:47AM]:       aa1e37293df5a3c347ea3784959aa105.svg  776 bytes          [emitted]
594  [12/18/2017 10:47AM]:       d50f42f7ea312cabab88d8eda5bb14a9.svg    2.88 kB          [emitted]
595  [12/18/2017 10:47AM]:       24e964b96ac35120541941897f6a01e3.svg  869 bytes          [emitted]
596  [12/18/2017 10:47AM]:       222f169694e4d1e956fce5a4fb5ad23d.svg  626 bytes          [emitted]
597  [12/18/2017 10:47AM]:       e606b7f6bbecaced0044c1052a99b7a9.svg    1.06 kB          [emitted]
598  [12/18/2017 10:47AM]:       eb1972095e43719a327e7fc4dd7691a4.svg    1.82 kB          [emitted]
599  [12/18/2017 10:47AM]:       7e7925a41b22d080e00c8d7309745420.svg  378 bytes          [emitted]
600  [12/18/2017 10:47AM]:       196262d2122e55e514d47f9e44b66520.svg  431 bytes          [emitted]
601  [12/18/2017 10:47AM]:       4bb98a05900622845d2e66b433711e32.png    2.93 kB          [emitted]
602  [12/18/2017 10:47AM]:       b6190b89305d7ca6eb2b6a84fb68d7bf.png     2.7 kB          [emitted]
603  [12/18/2017 10:47AM]:       4126c044e93c3caa1faaca0f4ec04e1e.png    11.1 kB          [emitted]
604  [12/18/2017 10:47AM]:       80c2dca1e4c4e1e3f495563a6952ee12.png    25.1 kB          [emitted]
605  [12/18/2017 10:47AM]:       4134ecd741d7d7b79fd1bb41ca3ad4d5.svg  472 bytes          [emitted]
606  [12/18/2017 10:47AM]:       89f9f5560225e5eee776ab6ae8f9f0b3.svg  840 bytes          [emitted]
607  [12/18/2017 10:47AM]:       f5ff01ecdaca34dc1cac01191958b4b3.svg  494 bytes          [emitted]
608  [12/18/2017 10:47AM]:       adc4e1913e1d98de46263c2dad9b914c.svg  820 bytes          [emitted]
609  [12/18/2017 10:47AM]:       bd7efdfbcb45f934ff13bfe5f5de5330.svg  990 bytes          [emitted]
610  [12/18/2017 10:47AM]:       e877f09f64a2ce7ec153e0efdd4ed1a1.svg  861 bytes          [emitted]
611  [12/18/2017 10:47AM]:       21db55dd9ae45888ef8d007135d7e243.svg    1.56 kB          [emitted]
612  [12/18/2017 10:47AM]:       d7876d48e80112e766d737346a616707.svg     1.5 kB          [emitted]
613  [12/18/2017 10:47AM]:       247d2a2d16b90d7364981e7224620a2a.svg  976 bytes          [emitted]
614  [12/18/2017 10:47AM]:       c74aae1d7c31e27b75eb9c779b6fab4c.svg    1.03 kB          [emitted]
615  [12/18/2017 10:47AM]:       674f50d287a8c48dc19ba404d20fe713.eot     166 kB          [emitted]
616  [12/18/2017 10:47AM]:       14ad83ede0f899bd6a66a37194df85c6.svg  934 bytes          [emitted]
617  [12/18/2017 10:47AM]:       493bc2b131dc439f27e05c4d3f4e93e7.png    12.1 kB          [emitted]
618  [12/18/2017 10:47AM]:       392507919f6ec931361b489a56c65ce9.svg  816 bytes          [emitted]
619  [12/18/2017 10:47AM]:       d5a535fdec793b2b9219ef7abfa185ce.svg  205 bytes          [emitted]
620  [12/18/2017 10:47AM]:       5ccced21c6505bfab561c1e015e407e1.svg  239 bytes          [emitted]
621  [12/18/2017 10:47AM]:       23b20b72da217563c4304c07c5206dd0.svg  213 bytes          [emitted]
622  [12/18/2017 10:47AM]:       e008bf562e79f9e1fd5110df9d61627d.svg  355 bytes          [emitted]
623  [12/18/2017 10:47AM]:       c11dbc2db4c1e34f10ac562b48e1d886.svg  289 bytes          [emitted]
624  [12/18/2017 10:47AM]:       430b679826c6e11b1767e7e05649e028.svg  615 bytes          [emitted]
625  [12/18/2017 10:47AM]:       2e7aa1b656ba910260191a20406af15f.svg  618 bytes          [emitted]
626  [12/18/2017 10:47AM]:       38ad268f3a41dc9191cc26857537e4c1.svg  452 bytes          [emitted]
627  [12/18/2017 10:47AM]:       a60b6ab6aaca89b5627cee5fb224ce64.svg  438 bytes          [emitted]
628  [12/18/2017 10:47AM]:       f88876b2519c8cbda6ef6fa17e83eeff.svg  687 bytes          [emitted]
629  [12/18/2017 10:47AM]:       bc90457507bcff2412ad0d500d7f92a9.svg  693 bytes          [emitted]
630  [12/18/2017 10:47AM]:       b6fb7a0b51d3af832d445c02e46d434d.png    2.13 kB          [emitted]
631  [12/18/2017 10:47AM]:       a34dd95ecb584ddb353a854a069d89a1.png    18.1 kB          [emitted]
632  [12/18/2017 10:47AM]:       0c4a088449e73ec59b36bb111c7e03b5.png    5.91 kB          [emitted]
633  [12/18/2017 10:47AM]:       69e1af008c893d635dabe4b7feb5f366.png    2.39 kB          [emitted]
634  [12/18/2017 10:47AM]:       51a0855604244165c58b5867df7d5676.png    4.69 kB          [emitted]
635  [12/18/2017 10:47AM]:       1be94b6e3fe1720c770ab40ab0c71cbe.png    7.22 kB          [emitted]
636  [12/18/2017 10:47AM]:       cd1a406ba824513a8d92a2e1418a2977.svg  418 bytes          [emitted]
637  [12/18/2017 10:47AM]:       1acaa76443941825560798bdb3936bf9.svg  437 bytes          [emitted]
638  [12/18/2017 10:47AM]:       3bad0d188335cbfe4a29bd448fa4d0e3.svg  430 bytes          [emitted]
639  [12/18/2017 10:47AM]:       f8aa9b15e2d849c26e84ec0dba7bebae.svg    1.27 kB          [emitted]
640  [12/18/2017 10:47AM]:       cbba55184f62c3df8728928b9016f9d7.svg     1.7 kB          [emitted]
641  [12/18/2017 10:47AM]:       1d10887913956d5ffe996a035b489730.svg    1.51 kB          [emitted]
642  [12/18/2017 10:47AM]:       df9d90f487acc18337a62e10623a2d87.svg    1.21 kB          [emitted]
643  [12/18/2017 10:47AM]:       4816047e6c690868e2f2dfb972e11263.svg    1.09 kB          [emitted]
644  [12/18/2017 10:47AM]:       e27fa9769059ed125a576fe851592410.svg  671 bytes          [emitted]
645  [12/18/2017 10:47AM]:       dafa0bbc64a10f10d65c8eadadd14c0a.svg  890 bytes          [emitted]
646  [12/18/2017 10:47AM]:       dba2dc28147a6dc7176d68287cb3fb74.svg    2.66 kB          [emitted]
647  [12/18/2017 10:47AM]:       8c9c38b16d3e35299481600c10f9bd19.svg  823 bytes          [emitted]
648  [12/18/2017 10:47AM]:       e61458fc4b59fafd5f6bb3a25b6d94ff.svg  824 bytes          [emitted]
649  [12/18/2017 10:47AM]:       f70c25409713b4132e79b004c03ef3cb.svg  428 bytes          [emitted]
650  [12/18/2017 10:47AM]:                        aboutPages.entry.js    4.12 MB       0  [emitted]  aboutPages
651  [12/18/2017 10:47AM]:                               app.entry.js    3.32 MB       1  [emitted]  app
652  [12/18/2017 10:47AM]:                    aboutPages.entry.js.map    5.51 MB       0  [emitted]  aboutPages
653  [12/18/2017 10:47AM]:                           app.entry.js.map    4.61 MB       1  [emitted]  app
654  [12/18/2017 10:47AM]:        [0] multi app 28 bytes {1} [built]
655  [12/18/2017 10:47AM]:        [0] multi aboutPages 28 bytes {0} [built]
656  [12/18/2017 10:47AM]:         + 912 hidden modules
657  [12/18/2017 10:47AM]:     Hash: 235271770f06807edf5b
658  [12/18/2017 10:47AM]:                   Asset    Size  Chunks             Chunk Names
659  [12/18/2017 10:47AM]:         lib.devTools.js  717 kB       0  [emitted]  devTools
660  [12/18/2017 10:47AM]:     lib.devTools.js.map  952 kB       0  [emitted]  devTools
661  [12/18/2017 10:47AM]:        [0] multi devTools 28 bytes {0} [built]
662  [12/18/2017 10:47AM]:         + 54 hidden modules
663  [12/18/2017 10:47AM]:     Hash: d031c5c981f8db651281
664  [12/18/2017 10:47AM]:                    webtorrentPage.entry.js     1.4 MB       0  [emitted]  main
665  [12/18/2017 10:47AM]:                webtorrentPage.entry.js.map    1.72 MB       0  [emitted]  main
666  [12/18/2017 10:47AM]:        [0] multi main 28 bytes {0} [built]
667  [12/18/2017 10:47AM]: npm WARN optional SKIPPING OPTIONAL DEPENDENCY: [email protected] (node_modules/7zip-bin-mac):
668  [12/18/2017 10:47AM]: npm WARN notsup SKIPPING OPTIONAL DEPENDENCY: Unsupported platform for [email protected]: wanted {os:darwin,arch:any} (current: {os:linux,arch:x64})
669  [12/18/2017 10:47AM]: npm WARN optional SKIPPING OPTIONAL DEPENDENCY: [email protected] (node_modules/fsevents):
670  [12/18/2017 10:47AM]: npm WARN notsup SKIPPING OPTIONAL DEPENDENCY: Unsupported platform for [email protected]: wanted {os:darwin,arch:any} (current: {os:linux,arch:x64})
671  [12/18/2017 10:47AM]: added 2264 packages in 204.479s
672  [12/18/2017 10:47AM]: > [email protected] build-package /pkg/src/browser-laptop
673  [12/18/2017 10:47AM]: > node ./tools/buildPackage.js
674  [12/18/2017 10:47AM]: Building version 0.19.53 in Brave-linux-x64 with Electron 4.4.29
675  [12/18/2017 10:47AM]: echo cleaning up target...&&rm -Rf Brave-linux-x64&&rm -Rf dist&&rm -f Brave.tar.bz2&&echo done&&echo starting build...&&./node_modules/.bin/webpack&&npm run checks&&node ./node_modules/electron-packager/cli.js . Brave --overwrite --ignore=pre-comit|pre-push|test/|docs/|tools/|signcode-tf|rx|nslog|eslint|cppunitlite|caniuse-db|cross-env|spectron|\.(0|13ctype|APACHE2|BSD|DOCS|DS_Store|LESSER|Makefile|a|ac|aff|after|am|arcconfig|arclint|babelrc|bat|before|bnf|brave-gyp|c|cardinalrc|cc|cfg|closure-compiler|cmake|cmd|covignore|cpp|csv|cxx|d|def|deps|dic|dll|dntrc|dockerignore|dsp|editorconfig|editorconfig~|el|enc|entitlements|eot|esprima|flow|flowconfig|gitattributes|githug|gitignore|gitattributes|gitignore|gitkeep|gitmodules|gnu|gradle|gyp|gypi|gz|h|hbs|hxx|idl|iml|in|inc|include|info|jade|java|jsfmtrc|jshint|jshintignore|jshintrc|jslintrc|jst|js~|keep|lint|lintignore|lock|log|ls|m4|mailmap|map|markdown|md|mdown|md~|mem|min-wd|mk|mkd|mm|mustache|myspell|myspell|name|nsh|nsi|nsprc|nuspec|nvmrc|o|old|orig|otf|param|patch|pegjs|post|pre|pro|py|rej|s|sage|scss|settings|sh|skip|source-map|stamp|swo|tap|targ|template|tern-port|tern-project|testignore|tm_properties|tmp|tpl|ts|txt|un~|vscode|xcf|xml|yaml|yml)$|/deps/|Release/obj|obj.target|ad-block/(node_modules|test|perf|sample|scripts|test|vendor|ABPFilterParserData.dat)|tracking-protection/(node_modules|test|data|scripts|vendor)|tracking-protection/build/node_modules|tracking-protection/build/Release/(sample.exe|test.exe)|sqlite3/src|nsp/node_modules|electron-installer-squirrel-windows|electron-chromedriver|electron-installer-debian|node-notifier/vendor|node-gyp|npm|jsdoc|docs|sinon|electron-download|electron-rebuild|electron-packager|electron-builder|electron-prebuilt|electron-rebuild|electron-winstaller-fixed|muon-winstaller|electron-installer-redhat|flow-bin|babel$|babel-(?!polyfill|regenerator-runtime|preset-env)|jsdom-global|react-addons-perf|react-addons-test-utils|enzyme|git-rev-sync|sqlite3|uglify-js|webdriverio|webpack-dev-server --platform=linux --arch=x64 --version=4.4.29 --icon=res/app.png --asar=true --app-version=0.19.53 --build-version=4.4.29 --protocol=http --protocol-name=HTTP Handler --protocol=https --protocol-name=HTTPS Handler --version-string.CompanyName=Brave Software --version-string.ProductName=Brave --version-string.Copyright=Copyright 2017, Brave Software --version-string.FileDescription=Brave&&mv Brave-linux-x64/Brave Brave-linux-x64/brave&&ncp ./app/extensions Brave-linux-x64/resources/extensions&&mkdirp Brave-linux-x64/resources/app.asar.unpacked/node_modules/node-anonize2-relic-emscripten&&ncp node_modules/node-anonize2-relic-emscripten/anonize2.js.mem Brave-linux-x64/resources/app.asar.unpacked/node_modules/node-anonize2-relic-emscripten/anonize2.js.mem
676  [12/18/2017 10:48AM]: Hash: eb591ca4499faaa7817ffd5edc8cc02cf4a888f91e68966a09cf7112cf54
677  [12/18/2017 10:48AM]:     Hash: eb591ca4499faaa7817f
678  [12/18/2017 10:48AM]:                        aboutPages.entry.js    4.07 MB       0  [emitted]  aboutPages
679  [12/18/2017 10:48AM]:                               app.entry.js    3.28 MB       1  [emitted]  app
680  [12/18/2017 10:48AM]:                    aboutPages.entry.js.map    5.42 MB       0  [emitted]  aboutPages
681  [12/18/2017 10:48AM]:                           app.entry.js.map    4.56 MB       1  [emitted]  app
682  [12/18/2017 10:48AM]:     ERROR in aboutPages.entry.js from UglifyJs
683  [12/18/2017 10:48AM]:     SyntaxError: Name expected [./app/renderer/components/styles/global.js:5,6]
684  [12/18/2017 10:48AM]:     ERROR in app.entry.js from UglifyJs
685  [12/18/2017 10:48AM]:     Hash: fd5edc8cc02cf4a888f9
686  [12/18/2017 10:48AM]:     ERROR in lib.devTools.js from UglifyJs
687  [12/18/2017 10:48AM]:     SyntaxError: Unexpected token: operator (>) [./js/constants/config.js:46,13]
688  [12/18/2017 10:48AM]:     Hash: 1e68966a09cf7112cf54
689  [12/18/2017 10:48AM]:                    webtorrentPage.entry.js    1.35 MB       0  [emitted]  main
690  [12/18/2017 10:48AM]:                webtorrentPage.entry.js.map    1.66 MB       0  [emitted]  main
691  [12/18/2017 10:48AM]:     ERROR in webtorrentPage.entry.js from UglifyJs
692  [12/18/2017 10:48AM]:     SyntaxError: Name expected [./app/renderer/components/styles/commonStyles.js:5,6]
693  [12/18/2017 10:48AM]: > [email protected] checks /pkg/src/browser-laptop
694  [12/18/2017 10:48AM]: > [email protected] check-security /pkg/src/browser-laptop
695  [12/18/2017 10:48AM]: (+) 6 vulnerabilities found
696  [12/18/2017 10:48AM]: ┌───────────────┬─────────────────────────────────────────────────────────────────┐
697  [12/18/2017 10:48AM]: │               │ Regular Expression Denial of Service                            │
698  [12/18/2017 10:48AM]: ├───────────────┼─────────────────────────────────────────────────────────────────┤
699  [12/18/2017 10:48AM]: │ Name          │ moment                                                          │
700  [12/18/2017 10:48AM]: │ CVSS          │ 7.5 (High)701  [12/18/2017 10:48AM]: │ Patched       │ >=2.19.3                                                        │
702  [12/18/2017 10:48AM]: │ Path          │ [email protected] > [email protected] > [email protected] > [email protected]703  [12/18/2017 10:48AM]: │ More Info     │ https://nodesecurity.io/advisories/532                          │
704  [12/18/2017 10:48AM]: └───────────────┴─────────────────────────────────────────────────────────────────┘
705  [12/18/2017 10:48AM]: │ Path          │ [email protected] > [email protected] > [email protected]… │
706  [12/18/2017 10:48AM]: │ Path          │ [email protected] > [email protected]707  [12/18/2017 10:48AM]: │               │ Denial of Service                                               │
708  [12/18/2017 10:48AM]: │ Vulnerable    │ <1.1.5 || >=2.0.0 <3.3.1                                        │
709  [12/18/2017 10:48AM]: │ Patched       │ >= 1.1.5 <2.0.0 || >=3.3.1                                      │
710  [12/18/2017 10:48AM]: │ Path          │ [email protected] > [email protected] > [email protected] > [email protected]… │
711  [12/18/2017 10:48AM]: │ More Info     │ https://nodesecurity.io/advisories/550                          │
712  [12/18/2017 10:48AM]: │ Path          │ [email protected] > [email protected] > [email protected] >… │
713  [12/18/2017 10:48AM]: npm ERR! [email protected] check-security: `nsp check`
714  [12/18/2017 10:48AM]: npm ERR! Failed at the [email protected] check-security script.
715  [12/18/2017 10:48AM]: npm ERR! This is probably not a problem with npm. There is likely additional logging output above.
716  [12/18/2017 10:48AM]: npm ERR! A complete log of this run can be found in:
717  [12/18/2017 10:48AM]: npm ERR!     /pkg/src/.npm/_logs/2017-12-18T16_48_26_849Z-debug.log
718  [12/18/2017 10:48AM]: npm ERR! [email protected] checks: `npm run check-security`
719  [12/18/2017 10:48AM]: npm ERR! Failed at the [email protected] checks script.
720  [12/18/2017 10:48AM]: npm ERR!     /pkg/src/.npm/_logs/2017-12-18T16_48_26_862Z-debug.log
721  [12/18/2017 10:48AM]: buildPackage failed { Error: Command failed: echo cleaning up target...&&rm -Rf Brave-linux-x64&&rm -Rf dist&&rm -f Brave.tar.bz2&&echo done&&echo starting build...&&./node_modules/.bin/webpack&&npm run checks&&node ./node_modules/electron-packager/cli.js . Brave --overwrite --ignore=pre-comit|pre-push|test/|docs/|tools/|signcode-tf|rx|nslog|eslint|cppunitlite|caniuse-db|cross-env|spectron|\.(0|13ctype|APACHE2|BSD|DOCS|DS_Store|LESSER|Makefile|a|ac|aff|after|am|arcconfig|arclint|babelrc|bat|before|bnf|brave-gyp|c|cardinalrc|cc|cfg|closure-compiler|cmake|cmd|covignore|cpp|csv|cxx|d|def|deps|dic|dll|dntrc|dockerignore|dsp|editorconfig|editorconfig~|el|enc|entitlements|eot|esprima|flow|flowconfig|gitattributes|githug|gitignore|gitattributes|gitignore|gitkeep|gitmodules|gnu|gradle|gyp|gypi|gz|h|hbs|hxx|idl|iml|in|inc|include|info|jade|java|jsfmtrc|jshint|jshintignore|jshintrc|jslintrc|jst|js~|keep|lint|lintignore|lock|log|ls|m4|mailmap|map|markdown|md|mdown|md~|mem|min-wd|mk|mkd|mm|mustache|myspell|myspell|name|nsh|nsi|nsprc|nuspec|nvmrc|o|old|orig|otf|param|patch|pegjs|post|pre|pro|py|rej|s|sage|scss|settings|sh|skip|source-map|stamp|swo|tap|targ|template|tern-port|tern-project|testignore|tm_properties|tmp|tpl|ts|txt|un~|vscode|xcf|xml|yaml|yml)$|/deps/|Release/obj|obj.target|ad-block/(node_modules|test|perf|sample|scripts|test|vendor|ABPFilterParserData.dat)|tracking-protection/(node_modules|test|data|scripts|vendor)|tracking-protection/build/node_modules|tracking-protection/build/Release/(sample.exe|test.exe)|sqlite3/src|nsp/node_modules|electron-installer-squirrel-windows|electron-chromedriver|electron-installer-debian|node-notifier/vendor|node-gyp|npm|jsdoc|docs|sinon|electron-download|electron-rebuild|electron-packager|electron-builder|electron-prebuilt|electron-rebuild|electron-winstaller-fixed|muon-winstaller|electron-installer-redhat|flow-bin|babel$|babel-(?!polyfill|regenerator-runtime|preset-env)|jsdom-global|react-addons-perf|react-addons-test-utils|enzyme|git-rev-sync|sqlite3|uglify-js|webdriverio|webpack-dev-server --platform=linux --arch=x64 --version=4.4.29 --icon=res/app.png --asar=true --app-version=0.19.53 --build-version=4.4.29 --protocol=http --protocol-name=HTTP Handler --protocol=https --protocol-name=HTTPS Handler --version-string.CompanyName=Brave Software --version-string.ProductName=Brave --version-string.Copyright=Copyright 2017, Brave Software --version-string.FileDescription=Brave&&mv Brave-linux-x64/Brave Brave-linux-x64/brave&&ncp ./app/extensions Brave-linux-x64/resources/extensions&&mkdirp Brave-linux-x64/resources/app.asar.unpacked/node_modules/node-anonize2-relic-emscripten&&ncp node_modules/node-anonize2-relic-emscripten/anonize2.js.mem Brave-linux-x64/resources/app.asar.unpacked/node_modules/node-anonize2-relic-emscripten/anonize2.js.mem
722  [12/18/2017 10:48AM]:     at ChildProcess.exithandler (child_process.js:272:12)
723  [12/18/2017 10:48AM]:     at ChildProcess.emit (events.js:159:13)
724  [12/18/2017 10:48AM]:     at maybeClose (internal/child_process.js:943:16)
725  [12/18/2017 10:48AM]:     at Process.ChildProcess._handle.onexit (internal/child_process.js:220:5)
726  [12/18/2017 10:48AM]:   cmd: echo cleaning up target...&&rm -Rf Brave-linux-x64&&rm -Rf dist&&rm -f Brave.tar.bz2&&echo done&&echo starting build...&&./node_modules/.bin/webpack&&npm run checks&&node ./node_modules/electron-packager/cli.js . Brave --overwrite --ignore=pre-comit|pre-push|test/|docs/|tools/|signcode-tf|rx|nslog|eslint|cppunitlite|caniuse-db|cross-env|spectron|\\.(0|13ctype|APACHE2|BSD|DOCS|DS_Store|LESSER|Makefile|a|ac|aff|after|am|arcconfig|arclint|babelrc|bat|before|bnf|brave-gyp|c|cardinalrc|cc|cfg|closure-compiler|cmake|cmd|covignore|cpp|csv|cxx|d|def|deps|dic|dll|dntrc|dockerignore|dsp|editorconfig|editorconfig~|el|enc|entitlements|eot|esprima|flow|flowconfig|gitattributes|githug|gitignore|gitattributes|gitignore|gitkeep|gitmodules|gnu|gradle|gyp|gypi|gz|h|hbs|hxx|idl|iml|in|inc|include|info|jade|java|jsfmtrc|jshint|jshintignore|jshintrc|jslintrc|jst|js~|keep|lint|lintignore|lock|log|ls|m4|mailmap|map|markdown|md|mdown|md~|mem|min-wd|mk|mkd|mm|mustache|myspell|myspell|name|nsh|nsi|nsprc|nuspec|nvmrc|o|old|orig|otf|param|patch|pegjs|post|pre|pro|py|rej|s|sage|scss|settings|sh|skip|source-map|stamp|swo|tap|targ|template|tern-port|tern-project|testignore|tm_properties|tmp|tpl|ts|txt|un~|vscode|xcf|xml|yaml|yml)$|/deps/|Release/obj|obj.target|ad-block/(node_modules|test|perf|sample|scripts|test|vendor|ABPFilterParserData.dat)|tracking-protection/(node_modules|test|data|scripts|vendor)|tracking-protection/build/node_modules|tracking-protection/build/Release/(sample.exe|test.exe)|sqlite3/src|nsp/node_modules|electron-installer-squirrel-windows|electron-chromedriver|electron-installer-debian|node-notifier/vendor|node-gyp|npm|jsdoc|docs|sinon|electron-download|electron-rebuild|electron-packager|electron-builder|electron-prebuilt|electron-rebuild|electron-winstaller-fixed|muon-winstaller|electron-installer-redhat|flow-bin|babel$|babel-(?!polyfill|regenerator-runtime|preset-env)|jsdom-global|react-addons-perf|react-addons-test-utils|enzyme|git-rev-sync|sqlite3|uglify-js|webdriverio|webpack-dev-server --platform=linux --arch=x64 --version=4.4.29 --icon=res/app.png --asar=true --app-version=0.19.53 --build-version=4.4.29 --protocol=http --protocol-name=HTTP Handler --protocol=https --protocol-name=HTTPS Handler --version-string.CompanyName=Brave Software --version-string.ProductName=Brave --version-string.Copyright=Copyright 2017, Brave Software --version-string.FileDescription=Brave&&mv Brave-linux-x64/Brave Brave-linux-x64/brave&&ncp ./app/extensions Brave-linux-x64/resources/extensions&&mkdirp Brave-linux-x64/resources/app.asar.unpacked/node_modules/node-anonize2-relic-emscripten&&ncp node_modules/node-anonize2-relic-emscripten/anonize2.js.mem Brave-linux-x64/resources/app.asar.unpacked/node_modules/node-anonize2-relic-emscripten/anonize2.js.mem }
727  [12/18/2017 10:48AM]: npm ERR! [email protected] build-package: `node ./tools/buildPackage.js`
728  [12/18/2017 10:48AM]: npm ERR! Failed at the [email protected] build-package script.
729  [12/18/2017 10:48AM]: npm ERR!     /pkg/src/.npm/_logs/2017-12-18T16_48_26_884Z-debug.log
730  [12/18/2017 10:48AM]: ==> ERROR: A failure occurred in build().
731  [12/18/2017 10:48AM]: rm: cannot remove **.pkg.**: No such file or directory
732  [12/18/2017 10:48AM]: [\^/\^/^\^/^\^/\^/\^/^\^/^\^/]  BUILD FAILED  [\^/\^/^\^/^\^/\^/\^/^\^/^\^/]