Build Record

Build Number: 7664

Transaction: 3762
Package: brave
Version: 0.19.70dev-1
Start: 12/30/2017 10:08AM
Finish: 12/30/2017 10:14AM
Result: failed
 brave/PKGBUILD CHANGED

Build Log

  1 [12/30/2017 10:08AM]: [\^/\^/^\^/^\^/\^/\^/^\^/^\^/]  SETTING UP ENVIRONMENT  [\^/\^/^\^/^\^/\^/\^/^\^/^\^/]
  2  [12/30/2017 10:08AM]: [\^/\^/^\^/^\^/\^/\^/^\^/^\^/]  ADDING UPSTREAM PGP KEYS TO KEYRING  [\^/\^/^\^/^\^/\^/\^/^\^/^\^/]
  3  [12/30/2017 10:08AM]: gpg: WARNING: unsafe ownership on homedir /tmp/antbs/.gnupg
  4  [12/30/2017 10:08AM]: gpg: keybox /tmp/antbs/.gnupg/pubring.kbx created
  5  [12/30/2017 10:08AM]: gpg: key 23EFEFE93C4CFFFE: 1 signature not checked due to a missing key
  6  [12/30/2017 10:08AM]: gpg: /tmp/antbs/.gnupg/trustdb.gpg: trustdb created
  7  [12/30/2017 10:08AM]: gpg: key 23EFEFE93C4CFFFE: public key Italo A. Casas <[email protected]> imported
  8  [12/30/2017 10:08AM]: gpg: key B63B535A4C206CA9: 8 signatures not checked due to missing keys
  9  [12/30/2017 10:08AM]: gpg: key B63B535A4C206CA9: public key Evan Lucas <[email protected]> imported
 10  [12/30/2017 10:08AM]: gpg: key E73BC641CC11F4C8: 14 signatures not checked due to missing keys
 11  [12/30/2017 10:08AM]: gpg: key E73BC641CC11F4C8: public key Myles Borins <[email protected]> imported
 12  [12/30/2017 10:08AM]: gpg: key C273792F7D83545D: 2 signatures not checked due to missing keys
 13  [12/30/2017 10:08AM]: gpg: key C273792F7D83545D: public key Rod Vagg <[email protected]> imported
 14  [12/30/2017 10:08AM]: gpg: key C97EC7A07EDE3FC1: 19 signatures not checked due to missing keys
 15  [12/30/2017 10:08AM]: gpg: key C97EC7A07EDE3FC1: public key keybase.io/jasnell <[email protected]> imported
 16  [12/30/2017 10:08AM]: gpg: key 09FE44734EB7990E: public key Jeremiah Senkpiel <[email protected]> imported
 17  [12/30/2017 10:08AM]: gpg: key 7434390BDBE9B9C5: public key Colin Ihrig <[email protected]> imported
 18  [12/30/2017 10:08AM]: gpg: key 61B7B526D98F0353: 24 signatures not checked due to missing keys
 19  [12/30/2017 10:08AM]: gpg: key 61B7B526D98F0353: public key Mozilla Software Releases <[email protected]> imported
 20  [12/30/2017 10:08AM]: gpg: key 61B7B526D98F0353: Mozilla Software Releases <[email protected]> not changed
 21  [12/30/2017 10:08AM]: gpg: no ultimately trusted keys found
 22  [12/30/2017 10:08AM]: gpg: Total number processed: 9
 23  [12/30/2017 10:08AM]: gpg:               imported: 8
 24  [12/30/2017 10:08AM]: gpg:              unchanged: 1
 25  [12/30/2017 10:08AM]: [\^/\^/^\^/^\^/\^/\^/^\^/^\^/]  SYNCING REPO DATABASES  [\^/\^/^\^/^\^/\^/\^/^\^/^\^/]
 26  [12/30/2017 10:08AM]: :: Synchronizing package databases...
 27  [12/30/2017 10:08AM]: downloading antergos-staging.db...
 28  [12/30/2017 10:08AM]: downloading antergos.db...
 29  [12/30/2017 10:08AM]: downloading core.db...
 30  [12/30/2017 10:08AM]: downloading community.db...
 31  [12/30/2017 10:08AM]: :: Starting full system upgrade...
 32  [12/30/2017 10:08AM]: [\^/\^/^\^/^\^/\^/\^/^\^/^\^/]  TRYING BUILD  [\^/\^/^\^/^\^/\^/\^/^\^/^\^/]
 33  [12/30/2017 10:08AM]: [\^/\^/^\^/^\^/\^/\^/^\^/^\^/]  UPDATING SOURCE CHECKSUMS  [\^/\^/^\^/^\^/\^/\^/^\^/^\^/]
 34  [12/30/2017 10:08AM]: ==> Generating checksums for source files...
 35  [12/30/2017 10:08AM]: ==> Making package: brave 0.19.70dev-1 (Sat Dec 30 16:08:57 UTC 2017)
 36  [12/30/2017 10:08AM]: ==> Checking runtime dependencies...
 37  [12/30/2017 10:08AM]: ==> Installing missing dependencies...
 38  [12/30/2017 10:08AM]: :: There are 10 providers available for ttf-font:
 39  [12/30/2017 10:08AM]:    1) ttf-google-fonts-typewolf
 40  [12/30/2017 10:08AM]:    2) noto-fonts  3) noto-fonts-extra  4) ttf-bitstream-vera  5) ttf-croscore  6) ttf-dejavu  7) ttf-freefont
 41  [12/30/2017 10:08AM]:    8) ttf-droid  9) ttf-liberation  10) ttf-ubuntu-font-family
 42  [12/30/2017 10:08AM]: Enter a number (default=1):
 43  [12/30/2017 10:08AM]: looking for conflicting packages...
 44  [12/30/2017 10:08AM]: warning: dependency cycle detected:
 45  [12/30/2017 10:08AM]: warning: harfbuzz will be installed before its freetype2 dependency
 46  [12/30/2017 10:08AM]: Packages (71) atk-2.26.1-1  avahi-0.7-2  cairo-1.15.10-1  compositeproto-0.4.2-3  damageproto-1.2.1-3  dbus-glib-0.108-1  fixesproto-5.0+9+g4292ec1-1  fontconfig-2.12.6+5+g665584a-1  freetype2-2.8.1-1  gdk-pixbuf2-2.36.11-1  graphite-1:1.3.10-1  gtk-update-icon-cache-3.22.26+47+g3a1a7135a2-3  harfbuzz-1.7.4-1  hicolor-icon-theme-0.17-1  icu-60.2-1  inputproto-2.3.2-1  jasper-2.0.14-1  js-24.2.0-4  kbproto-1.0.7-1  libcroco-0.6.12+4+g9ad7287-1  libcups-2.2.6-1  libdaemon-0.14-3  libdatrie-0.2.10-2  libfontenc-1.1.3-1  libjpeg-turbo-1.5.3-1  libpng-1.6.34-2  librsvg-2:2.40.20-1  libthai-0.1.27-1  libtiff-4.0.9-1  libx11-1.6.5-1  libxau-1.0.8-2  libxcb-1.12-1  libxcomposite-0.4.4-2  libxcursor-1.1.15-1  libxdamage-1.1.4-2  libxdmcp-1.1.2-1  libxext-1.3.3-1  libxfixes-5.0.3-1  libxft-2.3.2-1  libxi-1.7.9-1  libxinerama-1.1.3-2  libxml2-2.9.7+4+g72182550-2  libxrandr-1.5.1-1  libxrender-0.9.10-1  lzo-2.10-1  nspr-4.17-1  pango-1.40.14-1  pixman-0.34.0-1  polkit-0.113+34+g29ba7af-1  randrproto-1.5.0-1  recordproto-1.14.2-2  renderproto-0.11.1-3  scrnsaverproto-1.2.2-2  shared-mime-info-1.9-1  xcb-proto-1.12-3  xextproto-7.3.0-1  xineramaproto-1.2.1-3  xorg-fonts-encodings-1.0.4-4  xorg-mkfontdir-1.0.7-8  xorg-mkfontscale-1.1.2-1  xproto-7.0.31-1  alsa-lib-1.1.5-1  desktop-file-utils-0.23-1  gconf-3.2.6-5  gtk2-2.24.31-1  libgnome-keyring-3.12.0-2  libnotify-0.7.7-1  libxss-1.2.2-2  libxtst-1.2.3-1  nss-3.34.1-1  ttf-google-fonts-typewolf-17.11.git+2e2caa2-1
 47  [12/30/2017 10:08AM]: Total Download Size:     0.14 MiB
 48  [12/30/2017 10:08AM]: Total Installed Size:  313.65 MiB
 49  [12/30/2017 10:08AM]: :: Proceed with installation? [Y/n]
 50  [12/30/2017 10:08AM]: downloading libxi-1.7.9-1-x86_64.pkg.tar.xz...
 51  [12/30/2017 10:08AM]: checking package integrity...
 52  [12/30/2017 10:09AM]: checking for file conflicts...
 53  [12/30/2017 10:09AM]: :: Processing package changes...
 54  [12/30/2017 10:09AM]: Optional dependencies for harfbuzz
 55  [12/30/2017 10:09AM]:     cairo: hb-view program [pending]
 56  [12/30/2017 10:09AM]: warning: directory permissions differ on /var/
 57  [12/30/2017 10:09AM]: filesystem: 777  package: 755
 58  [12/30/2017 10:09AM]:   Fontconfig configuration is done via /etc/fonts/conf.avail and conf.d.
 59  [12/30/2017 10:09AM]:   Read /etc/fonts/conf.d/README for more information.
 60  [12/30/2017 10:09AM]:   Configuration via /etc/fonts/local.conf is still possible,
 61  [12/30/2017 10:09AM]:   but is no longer recommended for options available in conf.avail.
 62  [12/30/2017 10:09AM]:   Main systemwide configuration should be done by symlinks
 63  [12/30/2017 10:09AM]:   (especially for autohinting, sub-pixel and lcdfilter):
 64  [12/30/2017 10:09AM]:   ln -s ../conf.avail/XX-foo.conf
 65  [12/30/2017 10:09AM]:   Check also https://wiki.archlinux.org/index.php/Font_Configuration
 66  [12/30/2017 10:09AM]:   and https://wiki.archlinux.org/index.php/Fonts.
 67  [12/30/2017 10:09AM]: Rebuilding fontconfig cache... done.
 68  [12/30/2017 10:09AM]: Optional dependencies for libxcursor
 69  [12/30/2017 10:09AM]:     gnome-themes-standard: fallback icon theme
 70  [12/30/2017 10:09AM]: installing compositeproto...
 71  [12/30/2017 10:09AM]: installing shared-mime-info...
 72  [12/30/2017 10:09AM]: Optional dependencies for libtiff
 73  [12/30/2017 10:09AM]:     freeglut: for using tiffgt
 74  [12/30/2017 10:09AM]: Optional dependencies for avahi
 75  [12/30/2017 10:09AM]:     gtk3: avahi-discover, avahi-discover-standalone, bshell, bssh, bvnc
 76  [12/30/2017 10:09AM]:     gtk2: gtk2 bindings [pending]
 77  [12/30/2017 10:09AM]:     pygtk: avahi-bookmarks
 78  [12/30/2017 10:09AM]:     python2-twisted: avahi-bookmarks
 79  [12/30/2017 10:09AM]:     nss-mdns: NSS support for mDNS
 80  [12/30/2017 10:09AM]:     python-gobject: avahi-discover
 81  [12/30/2017 10:09AM]:     python-dbus: avahi-discover
 82  [12/30/2017 10:09AM]: Optional dependencies for jasper
 83  [12/30/2017 10:09AM]:     jasper-doc: documentation
 84  [12/30/2017 10:09AM]: installing hicolor-icon-theme...
 85  [12/30/2017 10:09AM]: installing gtk-update-icon-cache...
 86  [12/30/2017 10:09AM]: installing desktop-file-utils...
 87  [12/30/2017 10:09AM]: Optional dependencies for gtk2
 88  [12/30/2017 10:09AM]:     gnome-themes-standard: Default widget theme
 89  [12/30/2017 10:09AM]:     adwaita-icon-theme: Default icon theme
 90  [12/30/2017 10:09AM]: Optional dependencies for alsa-lib
 91  [12/30/2017 10:09AM]:     python2: for python smixer plugin [installed]
 92  [12/30/2017 10:09AM]: installing xorg-fonts-encodings...
 93  [12/30/2017 10:09AM]: installing xorg-mkfontscale...
 94  [12/30/2017 10:09AM]: Creating X fontdir indices... done.
 95  [12/30/2017 10:09AM]: installing ttf-google-fonts-typewolf...
 96  [12/30/2017 10:09AM]: installing libgnome-keyring...
 97  [12/30/2017 10:09AM]: Optional dependencies for libgnome-keyring
 98  [12/30/2017 10:09AM]:     gnome-keyring: key storage service (or use any other service implementing org.freedesktop.secrets)
 99  [12/30/2017 10:09AM]: :: Running post-transaction hooks...
100  [12/30/2017 10:09AM]: ( 1/10) Updating fontconfig cache...
101  [12/30/2017 10:09AM]: ( 2/10) Probing GDK-Pixbuf loader modules...
102  [12/30/2017 10:09AM]: ( 3/10) Updating GIO module cache...
103  [12/30/2017 10:09AM]: ( 4/10) Probing GTK2 input method modules...
104  [12/30/2017 10:09AM]: ( 5/10) Updating icon theme caches...
105  [12/30/2017 10:09AM]: ( 6/10) Updating system user accounts...
106  [12/30/2017 10:09AM]: ( 7/10) Arming ConditionNeedsUpdate...
107  [12/30/2017 10:09AM]: ( 8/10) Updating the desktop file MIME type cache...
108  [12/30/2017 10:09AM]: ( 9/10) Updating the MIME type database...
109  [12/30/2017 10:09AM]: (10/10) Updating X fontdir indices...
110  [12/30/2017 10:09AM]: Packages (7) c-ares-1.13.0-1  http-parser-2.7.1-1  libuv-1.18.0-1  nodejs-9.3.0-1  openssl-1.0-1.0.2.n-1  semver-5.4.1-1  npm-5.6.0-1
111  [12/30/2017 10:09AM]: Total Installed Size:  45.87 MiB
112  [12/30/2017 10:09AM]: Optional dependencies for openssl-1.0
113  [12/30/2017 10:09AM]:     ca-certificates [installed]
114  [12/30/2017 10:09AM]: Optional dependencies for nodejs
115  [12/30/2017 10:09AM]:     npm: nodejs package manager [pending]
116  [12/30/2017 10:09AM]: Optional dependencies for npm
117  [12/30/2017 10:09AM]:     python2: for node-gyp [installed]
118  [12/30/2017 10:09AM]: (1/1) Arming ConditionNeedsUpdate...
119  [12/30/2017 10:09AM]:   -> Cloning browser-laptop git repo...
120  [12/30/2017 10:09AM]: Cloning into bare repository /pkg/browser-laptop...
121  [12/30/2017 10:09AM]: ==> Validating source files with md5sums...
122  [12/30/2017 10:09AM]:     brave.desktop ... Passed
123  [12/30/2017 10:09AM]:     browser-laptop ... Skipped
124  [12/30/2017 10:09AM]:   -> Creating working copy of browser-laptop git repo...
125  [12/30/2017 10:09AM]: Cloning into browser-laptop...
126  [12/30/2017 10:09AM]: Switched to a new branch makepkg
127  [12/30/2017 10:10AM]: > [email protected] preinstall /pkg/src/browser-laptop/node_modules/tracking-protection
128  [12/30/2017 10:10AM]: > npm install hashset-cpp && npm install cppunitlite
129  [12/30/2017 10:10AM]: > [email protected] install /pkg/src/browser-laptop/node_modules/tracking-protection/node_modules/hashset-cpp
130  [12/30/2017 10:10AM]: make: Entering directory /pkg/src/browser-laptop/node_modules/tracking-protection/node_modules/hashset-cpp/build
131  [12/30/2017 10:10AM]:   CXX(target) Release/obj.target/hashset-cpp/addon.o
132  [12/30/2017 10:10AM]:   CXX(target) Release/obj.target/hashset-cpp/HashSetWrap.o
133  [12/30/2017 10:10AM]: ../HashSetWrap.cpp: In static member function static void HashSetWrap::HashSetWrap::New(const v8::FunctionCallbackInfo<v8::Value>&):
134  [12/30/2017 10:10AM]: ../HashSetWrap.cpp:61:59: warning: v8::Local<v8::Object> v8::Function::NewInstance(int, v8::Local<v8::Value>*) const is deprecated: Use maybe version [-Wdeprecated-declarations]
135  [12/30/2017 10:10AM]:      args.GetReturnValue().Set(cons->NewInstance(argc, argv));
136  [12/30/2017 10:10AM]:                                                            ^
137  [12/30/2017 10:10AM]: In file included from /pkg/src/.node-gyp/4.5.9/deps/v8/include/v8.h:26:0,
138  [12/30/2017 10:10AM]:                  from /pkg/src/.node-gyp/4.5.9/src/node.h:42,
139  [12/30/2017 10:10AM]:                  from ../HashSetWrap.h:9,
140  [12/30/2017 10:10AM]:                  from ../HashSetWrap.cpp:6:
141  [12/30/2017 10:10AM]: /pkg/src/.node-gyp/4.5.9/deps/v8/include/v8.h:3844:31: note: declared here
142  [12/30/2017 10:10AM]:                  Local<Object> NewInstance(int argc, Local<Value> argv[]) const);
143  [12/30/2017 10:10AM]:                                ^
144  [12/30/2017 10:10AM]: /pkg/src/.node-gyp/4.5.9/deps/v8/include/v8config.h:318:3: note: in definition of macro V8_DEPRECATED
145  [12/30/2017 10:10AM]:    declarator __attribute__((deprecated(message)))
146  [12/30/2017 10:10AM]:   CXX(target) Release/obj.target/hashset-cpp/HashSet.o
147  [12/30/2017 10:10AM]:   SOLINK_MODULE(target) Release/obj.target/hashset-cpp.node
148  [12/30/2017 10:10AM]:   COPY Release/hashset-cpp.node
149  [12/30/2017 10:10AM]: make: Leaving directory /pkg/src/browser-laptop/node_modules/tracking-protection/node_modules/hashset-cpp/build
150  [12/30/2017 10:10AM]: npm notice created a lockfile as package-lock.json. You should commit this file.
151  [12/30/2017 10:10AM]: > [email protected] install /pkg/src/browser-laptop/node_modules/tracking-protection/node_modules/cppunitlite
152  [12/30/2017 10:10AM]: make: Entering directory /pkg/src/browser-laptop/node_modules/tracking-protection/node_modules/cppunitlite/build
153  [12/30/2017 10:10AM]:   CXX(target) Release/obj.target/CppUnitLite/src/Failure.o
154  [12/30/2017 10:10AM]:   CXX(target) Release/obj.target/CppUnitLite/src/SimpleString.o
155  [12/30/2017 10:10AM]:   CXX(target) Release/obj.target/CppUnitLite/src/Test.o
156  [12/30/2017 10:10AM]:   CXX(target) Release/obj.target/CppUnitLite/src/TestResult.o
157  [12/30/2017 10:10AM]:   CXX(target) Release/obj.target/CppUnitLite/src/TestRegistry.o
158  [12/30/2017 10:10AM]:   AR(target) Release/obj.target/CppUnitLite.a
159  [12/30/2017 10:10AM]:   COPY Release/CppUnitLite.a
160  [12/30/2017 10:10AM]:   CXX(target) Release/obj.target/test/test/StackMain.o
161  [12/30/2017 10:10AM]:   CXX(target) Release/obj.target/test/test/StackTest.o
162  [12/30/2017 10:10AM]:   LINK(target) Release/test
163  [12/30/2017 10:10AM]: make: Leaving directory /pkg/src/browser-laptop/node_modules/tracking-protection/node_modules/cppunitlite/build
164  [12/30/2017 10:10AM]: > [email protected] preinstall /pkg/src/browser-laptop/node_modules/ad-block
165  [12/30/2017 10:10AM]: > npm install bloom-filter-cpp && npm install hashset-cpp
166  [12/30/2017 10:10AM]: > [email protected] install /pkg/src/browser-laptop/node_modules/ad-block/node_modules/bloom-filter-cpp
167  [12/30/2017 10:10AM]: make: Entering directory /pkg/src/browser-laptop/node_modules/ad-block/node_modules/bloom-filter-cpp/build
168  [12/30/2017 10:10AM]:   CXX(target) Release/obj.target/bloom-filter-cpp/addon.o
169  [12/30/2017 10:10AM]:   CXX(target) Release/obj.target/bloom-filter-cpp/BloomFilterWrap.o
170  [12/30/2017 10:10AM]: ../BloomFilterWrap.cpp: In static member function static void BloomFilterWrap::BloomFilterWrap::New(const v8::FunctionCallbackInfo<v8::Value>&):
171  [12/30/2017 10:10AM]: ../BloomFilterWrap.cpp:62:59: warning: v8::Local<v8::Object> v8::Function::NewInstance(int, v8::Local<v8::Value>*) const is deprecated: Use maybe version [-Wdeprecated-declarations]
172  [12/30/2017 10:10AM]:                  from ../BloomFilterWrap.h:9,
173  [12/30/2017 10:10AM]:                  from ../BloomFilterWrap.cpp:6:
174  [12/30/2017 10:10AM]:   CXX(target) Release/obj.target/bloom-filter-cpp/BloomFilter.o
175  [12/30/2017 10:10AM]:   CXX(target) Release/obj.target/bloom-filter-cpp/hashFn.o
176  [12/30/2017 10:10AM]:   SOLINK_MODULE(target) Release/obj.target/bloom-filter-cpp.node
177  [12/30/2017 10:10AM]:   COPY Release/bloom-filter-cpp.node
178  [12/30/2017 10:10AM]: make: Leaving directory /pkg/src/browser-laptop/node_modules/ad-block/node_modules/bloom-filter-cpp/build
179  [12/30/2017 10:10AM]: > [email protected] install /pkg/src/browser-laptop/node_modules/ad-block/node_modules/hashset-cpp
180  [12/30/2017 10:10AM]: make: Entering directory /pkg/src/browser-laptop/node_modules/ad-block/node_modules/hashset-cpp/build
181  [12/30/2017 10:10AM]: make: Leaving directory /pkg/src/browser-laptop/node_modules/ad-block/node_modules/hashset-cpp/build
182  [12/30/2017 10:10AM]: > [email protected] install /pkg/src/browser-laptop/node_modules/bloom-filter-cpp
183  [12/30/2017 10:10AM]: make: Entering directory /pkg/src/browser-laptop/node_modules/bloom-filter-cpp/build
184  [12/30/2017 10:10AM]: make: Leaving directory /pkg/src/browser-laptop/node_modules/bloom-filter-cpp/build
185  [12/30/2017 10:10AM]: > [email protected] install /pkg/src/browser-laptop/node_modules/cppunitlite
186  [12/30/2017 10:10AM]: make: Entering directory /pkg/src/browser-laptop/node_modules/cppunitlite/build
187  [12/30/2017 10:10AM]: make: Leaving directory /pkg/src/browser-laptop/node_modules/cppunitlite/build
188  [12/30/2017 10:10AM]: > [email protected] install /pkg/src/browser-laptop/node_modules/hashset-cpp
189  [12/30/2017 10:10AM]: make: Entering directory /pkg/src/browser-laptop/node_modules/hashset-cpp/build
190  [12/30/2017 10:10AM]: make: Leaving directory /pkg/src/browser-laptop/node_modules/hashset-cpp/build
191  [12/30/2017 10:10AM]: > [email protected] install /pkg/src/browser-laptop/node_modules/dtrace-provider
192  [12/30/2017 10:10AM]: > [email protected] install /pkg/src/browser-laptop/node_modules/sha3
193  [12/30/2017 10:11AM]: make: Entering directory /pkg/src/browser-laptop/node_modules/sha3/build
194  [12/30/2017 10:11AM]:   CXX(target) Release/obj.target/sha3/src/addon.o
195  [12/30/2017 10:11AM]: In file included from ../../nan/nan.h:192:0,
196  [12/30/2017 10:11AM]:                  from ../src/addon.cpp:4:
197  [12/30/2017 10:11AM]: ../../nan/nan_maybe_43_inl.h: In function Nan::Maybe<bool> Nan::ForceSet(v8::Local<v8::Object>, v8::Local<v8::Value>, v8::Local<v8::Value>, v8::PropertyAttribute):
198  [12/30/2017 10:11AM]: ../../nan/nan_maybe_43_inl.h:112:73: warning: v8::Maybe<bool> v8::Object::ForceSet(v8::Local<v8::Context>, v8::Local<v8::Value>, v8::Local<v8::Value>, v8::PropertyAttribute) is deprecated: Use CreateDataProperty / DefineOwnProperty [-Wdeprecated-declarations]
199  [12/30/2017 10:11AM]:    return obj->ForceSet(isolate->GetCurrentContext(), key, value, attribs);
200  [12/30/2017 10:11AM]:                                                                          ^
201  [12/30/2017 10:11AM]:                  from ../src/addon.cpp:1:
202  [12/30/2017 10:11AM]: /pkg/src/.node-gyp/4.5.9/deps/v8/include/v8.h:3115:29: note: declared here
203  [12/30/2017 10:11AM]:                  Maybe<bool> ForceSet(Local<Context> context, Local<Value> key,
204  [12/30/2017 10:11AM]:                              ^
205  [12/30/2017 10:11AM]: ../src/addon.cpp: In static member function static Nan::NAN_METHOD_RETURN_TYPE SHA3Hash::New(Nan::NAN_METHOD_ARGS_TYPE):
206  [12/30/2017 10:11AM]: ../src/addon.cpp:49:23: warning: new of type SHA3Hash with extended alignment 32 [-Waligned-new=]
207  [12/30/2017 10:11AM]: ../src/addon.cpp:49:23: note: uses void* operator new(std::size_t), which does not have an alignment parameter
208  [12/30/2017 10:11AM]: ../src/addon.cpp:49:23: note: use -faligned-new to enable C++17 over-aligned new support
209  [12/30/2017 10:11AM]: ../src/addon.cpp:59:58: warning: v8::Local<v8::Object> v8::Function::NewInstance(int, v8::Local<v8::Value>*) const is deprecated: Use maybe version [-Wdeprecated-declarations]
210  [12/30/2017 10:11AM]:     info.GetReturnValue().Set(cons->NewInstance(argc, argv));
211  [12/30/2017 10:11AM]:                                                           ^
212  [12/30/2017 10:11AM]:   CXX(target) Release/obj.target/sha3/src/displayIntermediateValues.o
213  [12/30/2017 10:11AM]:   CXX(target) Release/obj.target/sha3/src/KeccakF-1600-reference.o
214  [12/30/2017 10:11AM]:   CXX(target) Release/obj.target/sha3/src/KeccakNISTInterface.o
215  [12/30/2017 10:11AM]:   CXX(target) Release/obj.target/sha3/src/KeccakSponge.o
216  [12/30/2017 10:11AM]:   SOLINK_MODULE(target) Release/obj.target/sha3.node
217  [12/30/2017 10:11AM]: make: Leaving directory /pkg/src/browser-laptop/node_modules/sha3/build
218  [12/30/2017 10:11AM]: > [email protected] install /pkg/src/browser-laptop/node_modules/bufferutil
219  [12/30/2017 10:11AM]: > prebuild-install || node-gyp rebuild
220  [12/30/2017 10:11AM]: /pkg/src/browser-laptop/node_modules/node-abi/index.js:45
221  [12/30/2017 10:11AM]:   throw new Error(Could not detect abi for version  + target +  and runtime  + runtime + .  Updating node-abi might help solve this issue if it is a new release of  + runtime)
222  [12/30/2017 10:11AM]: Error: Could not detect abi for version 4.5.9 and runtime electron.  Updating node-abi might help solve this issue if it is a new release of electron
223  [12/30/2017 10:11AM]:     at getAbi (/pkg/src/browser-laptop/node_modules/node-abi/index.js:45:9)
224  [12/30/2017 10:11AM]:     at module.exports (/pkg/src/browser-laptop/node_modules/prebuild-install/rc.js:57:12)
225  [12/30/2017 10:11AM]:     at Object.<anonymous> (/pkg/src/browser-laptop/node_modules/prebuild-install/bin.js:9:25)
226  [12/30/2017 10:11AM]:     at Module._compile (module.js:660:30)
227  [12/30/2017 10:11AM]:     at Object.Module._extensions..js (module.js:671:10)
228  [12/30/2017 10:11AM]:     at Module.load (module.js:573:32)
229  [12/30/2017 10:11AM]:     at tryModuleLoad (module.js:513:12)
230  [12/30/2017 10:11AM]:     at Function.Module._load (module.js:505:3)
231  [12/30/2017 10:11AM]:     at Function.Module.runMain (module.js:701:10)
232  [12/30/2017 10:11AM]:     at startup (bootstrap_node.js:194:16)
233  [12/30/2017 10:11AM]: make: Entering directory /pkg/src/browser-laptop/node_modules/bufferutil/build
234  [12/30/2017 10:11AM]:   CXX(target) Release/obj.target/bufferutil/src/bufferutil.o
235  [12/30/2017 10:11AM]: In file included from ../node_modules/nan/nan.h:192:0,
236  [12/30/2017 10:11AM]:                  from ../src/bufferutil.cc:7:
237  [12/30/2017 10:11AM]: ../node_modules/nan/nan_maybe_43_inl.h: In function Nan::Maybe<bool> Nan::ForceSet(v8::Local<v8::Object>, v8::Local<v8::Value>, v8::Local<v8::Value>, v8::PropertyAttribute):
238  [12/30/2017 10:11AM]: ../node_modules/nan/nan_maybe_43_inl.h:112:73: warning: v8::Maybe<bool> v8::Object::ForceSet(v8::Local<v8::Context>, v8::Local<v8::Value>, v8::Local<v8::Value>, v8::PropertyAttribute) is deprecated: Use CreateDataProperty / DefineOwnProperty [-Wdeprecated-declarations]
239  [12/30/2017 10:11AM]:                  from ../node_modules/nan/nan.h:49,
240  [12/30/2017 10:11AM]:   SOLINK_MODULE(target) Release/obj.target/bufferutil.node
241  [12/30/2017 10:11AM]:   COPY Release/bufferutil.node
242  [12/30/2017 10:11AM]: make: Leaving directory /pkg/src/browser-laptop/node_modules/bufferutil/build
243  [12/30/2017 10:11AM]: > [email protected] install /pkg/src/browser-laptop/node_modules/leveldown
244  [12/30/2017 10:11AM]: make: Entering directory /pkg/src/browser-laptop/node_modules/leveldown/build
245  [12/30/2017 10:11AM]:   CXX(target) Release/obj.target/leveldb/deps/leveldb/leveldb-1.20/db/builder.o
246  [12/30/2017 10:11AM]:   CXX(target) Release/obj.target/leveldb/deps/leveldb/leveldb-1.20/db/db_impl.o
247  [12/30/2017 10:11AM]:   CXX(target) Release/obj.target/leveldb/deps/leveldb/leveldb-1.20/db/db_iter.o
248  [12/30/2017 10:11AM]:   CXX(target) Release/obj.target/leveldb/deps/leveldb/leveldb-1.20/db/filename.o
249  [12/30/2017 10:11AM]:   CXX(target) Release/obj.target/leveldb/deps/leveldb/leveldb-1.20/db/dbformat.o
250  [12/30/2017 10:11AM]:   CXX(target) Release/obj.target/leveldb/deps/leveldb/leveldb-1.20/db/log_reader.o
251  [12/30/2017 10:11AM]:   CXX(target) Release/obj.target/leveldb/deps/leveldb/leveldb-1.20/db/log_writer.o
252  [12/30/2017 10:11AM]:   CXX(target) Release/obj.target/leveldb/deps/leveldb/leveldb-1.20/db/memtable.o
253  [12/30/2017 10:11AM]:   CXX(target) Release/obj.target/leveldb/deps/leveldb/leveldb-1.20/db/repair.o
254  [12/30/2017 10:11AM]:   CXX(target) Release/obj.target/leveldb/deps/leveldb/leveldb-1.20/db/table_cache.o
255  [12/30/2017 10:11AM]:   CXX(target) Release/obj.target/leveldb/deps/leveldb/leveldb-1.20/db/version_edit.o
256  [12/30/2017 10:11AM]:   CXX(target) Release/obj.target/leveldb/deps/leveldb/leveldb-1.20/db/version_set.o
257  [12/30/2017 10:11AM]:   CXX(target) Release/obj.target/leveldb/deps/leveldb/leveldb-1.20/db/write_batch.o
258  [12/30/2017 10:11AM]:   CXX(target) Release/obj.target/leveldb/deps/leveldb/leveldb-1.20/helpers/memenv/memenv.o
259  [12/30/2017 10:11AM]:   CXX(target) Release/obj.target/leveldb/deps/leveldb/leveldb-1.20/port/port_posix_sse.o
260  [12/30/2017 10:11AM]:   CXX(target) Release/obj.target/leveldb/deps/leveldb/leveldb-1.20/table/block.o
261  [12/30/2017 10:11AM]:   CXX(target) Release/obj.target/leveldb/deps/leveldb/leveldb-1.20/table/block_builder.o
262  [12/30/2017 10:11AM]:   CXX(target) Release/obj.target/leveldb/deps/leveldb/leveldb-1.20/table/filter_block.o
263  [12/30/2017 10:11AM]:   CXX(target) Release/obj.target/leveldb/deps/leveldb/leveldb-1.20/table/format.o
264  [12/30/2017 10:11AM]:   CXX(target) Release/obj.target/leveldb/deps/leveldb/leveldb-1.20/table/iterator.o
265  [12/30/2017 10:11AM]:   CXX(target) Release/obj.target/leveldb/deps/leveldb/leveldb-1.20/table/merger.o
266  [12/30/2017 10:11AM]:   CXX(target) Release/obj.target/leveldb/deps/leveldb/leveldb-1.20/table/table.o
267  [12/30/2017 10:11AM]:   CXX(target) Release/obj.target/leveldb/deps/leveldb/leveldb-1.20/table/table_builder.o
268  [12/30/2017 10:11AM]:   CXX(target) Release/obj.target/leveldb/deps/leveldb/leveldb-1.20/table/two_level_iterator.o
269  [12/30/2017 10:11AM]:   CXX(target) Release/obj.target/leveldb/deps/leveldb/leveldb-1.20/util/arena.o
270  [12/30/2017 10:11AM]:   CXX(target) Release/obj.target/leveldb/deps/leveldb/leveldb-1.20/util/bloom.o
271  [12/30/2017 10:11AM]:   CXX(target) Release/obj.target/leveldb/deps/leveldb/leveldb-1.20/util/cache.o
272  [12/30/2017 10:11AM]:   CXX(target) Release/obj.target/leveldb/deps/leveldb/leveldb-1.20/util/coding.o
273  [12/30/2017 10:11AM]:   CXX(target) Release/obj.target/leveldb/deps/leveldb/leveldb-1.20/util/comparator.o
274  [12/30/2017 10:11AM]:   CXX(target) Release/obj.target/leveldb/deps/leveldb/leveldb-1.20/util/crc32c.o
275  [12/30/2017 10:11AM]:   CXX(target) Release/obj.target/leveldb/deps/leveldb/leveldb-1.20/util/env.o
276  [12/30/2017 10:11AM]:   CXX(target) Release/obj.target/leveldb/deps/leveldb/leveldb-1.20/util/filter_policy.o
277  [12/30/2017 10:11AM]:   CXX(target) Release/obj.target/leveldb/deps/leveldb/leveldb-1.20/util/hash.o
278  [12/30/2017 10:11AM]: ../deps/leveldb/leveldb-1.20/util/hash.cc: In function uint32_t leveldb::Hash(const char*, size_t, uint32_t):
279  [12/30/2017 10:11AM]: ../deps/leveldb/leveldb-1.20/util/hash.cc:37:9: warning: this statement may fall through [-Wimplicit-fallthrough=]
280  [12/30/2017 10:11AM]:        h += static_cast<unsigned char>(data[2]) << 16;
281  [12/30/2017 10:11AM]:        ~~^~~~~~~~~~~~~~~~~~~~~~~~~~~~~~~~~~~~~~~~~~~~
282  [12/30/2017 10:11AM]: ../deps/leveldb/leveldb-1.20/util/hash.cc:39:5: note: here
283  [12/30/2017 10:11AM]: ../deps/leveldb/leveldb-1.20/util/hash.cc:40:9: warning: this statement may fall through [-Wimplicit-fallthrough=]
284  [12/30/2017 10:11AM]:        h += static_cast<unsigned char>(data[1]) << 8;
285  [12/30/2017 10:11AM]:        ~~^~~~~~~~~~~~~~~~~~~~~~~~~~~~~~~~~~~~~~~~~~~
286  [12/30/2017 10:11AM]: ../deps/leveldb/leveldb-1.20/util/hash.cc:42:5: note: here
287  [12/30/2017 10:11AM]:   CXX(target) Release/obj.target/leveldb/deps/leveldb/leveldb-1.20/util/logging.o
288  [12/30/2017 10:11AM]:   CXX(target) Release/obj.target/leveldb/deps/leveldb/leveldb-1.20/util/options.o
289  [12/30/2017 10:11AM]:   CXX(target) Release/obj.target/leveldb/deps/leveldb/leveldb-1.20/util/status.o
290  [12/30/2017 10:11AM]:   CXX(target) Release/obj.target/leveldb/deps/leveldb/leveldb-1.20/port/port_posix.o
291  [12/30/2017 10:11AM]:   CXX(target) Release/obj.target/leveldb/deps/leveldb/leveldb-1.20/util/env_posix.o
292  [12/30/2017 10:11AM]:   AR(target) Release/obj.target/deps/leveldb/leveldb.a
293  [12/30/2017 10:11AM]:   CXX(target) Release/obj.target/snappy/deps/snappy/snappy-1.1.4/snappy-sinksource.o
294  [12/30/2017 10:11AM]:   CXX(target) Release/obj.target/snappy/deps/snappy/snappy-1.1.4/snappy-stubs-internal.o
295  [12/30/2017 10:11AM]:   CXX(target) Release/obj.target/snappy/deps/snappy/snappy-1.1.4/snappy.o
296  [12/30/2017 10:11AM]:   AR(target) Release/obj.target/deps/snappy/snappy.a
297  [12/30/2017 10:11AM]:   CXX(target) Release/obj.target/leveldown/src/batch.o
298  [12/30/2017 10:11AM]:                  from ../src/batch.cc:3:
299  [12/30/2017 10:11AM]:                  from ../src/batch.cc:1:
300  [12/30/2017 10:11AM]:   CXX(target) Release/obj.target/leveldown/src/batch_async.o
301  [12/30/2017 10:11AM]:                  from ../src/database.h:16,
302  [12/30/2017 10:11AM]:                  from ../src/batch.h:9,
303  [12/30/2017 10:11AM]:                  from ../src/batch_async.cc:8:
304  [12/30/2017 10:11AM]:                  from ../src/batch.h:5,
305  [12/30/2017 10:11AM]:   CXX(target) Release/obj.target/leveldown/src/database.o
306  [12/30/2017 10:11AM]:                  from ../src/leveldown.h:11,
307  [12/30/2017 10:11AM]:                  from ../src/database.cc:12:
308  [12/30/2017 10:11AM]:                  from ../src/database.cc:6:
309  [12/30/2017 10:11AM]:   CXX(target) Release/obj.target/leveldown/src/database_async.o
310  [12/30/2017 10:11AM]:                  from ../src/database_async.cc:12:
311  [12/30/2017 10:11AM]:                  from ../src/database_async.cc:6:
312  [12/30/2017 10:11AM]:   CXX(target) Release/obj.target/leveldown/src/iterator.o
313  [12/30/2017 10:11AM]:                  from ../src/iterator.cc:9:
314  [12/30/2017 10:11AM]:                  from ../src/iterator.cc:6:
315  [12/30/2017 10:11AM]:   CXX(target) Release/obj.target/leveldown/src/iterator_async.o
316  [12/30/2017 10:11AM]:                  from ../src/iterator_async.cc:9:
317  [12/30/2017 10:11AM]:                  from ../src/iterator_async.cc:6:
318  [12/30/2017 10:11AM]:   CXX(target) Release/obj.target/leveldown/src/leveldown.o
319  [12/30/2017 10:11AM]:                  from ../src/leveldown.cc:8:
320  [12/30/2017 10:11AM]:                  from ../src/leveldown.cc:6:
321  [12/30/2017 10:11AM]:   CXX(target) Release/obj.target/leveldown/src/leveldown_async.o
322  [12/30/2017 10:11AM]:                  from ../src/leveldown_async.cc:8:
323  [12/30/2017 10:11AM]:                  from ../src/leveldown.h:8,
324  [12/30/2017 10:11AM]:   SOLINK_MODULE(target) Release/obj.target/leveldown.node
325  [12/30/2017 10:11AM]:   COPY Release/leveldown.node
326  [12/30/2017 10:11AM]: make: Leaving directory /pkg/src/browser-laptop/node_modules/leveldown/build
327  [12/30/2017 10:11AM]: > [email protected] install /pkg/src/browser-laptop/node_modules/prova-lib/node_modules/secp256k1
328  [12/30/2017 10:11AM]: > prebuild-install || node-gyp rebuild || echo Secp256k1 bindings compilation fail. Pure JS implementation will be used.
329  [12/30/2017 10:11AM]: make: Entering directory /pkg/src/browser-laptop/node_modules/prova-lib/node_modules/secp256k1/build
330  [12/30/2017 10:11AM]:   CXX(target) Release/obj.target/secp256k1/src/addon.o
331  [12/30/2017 10:11AM]: In file included from ../../../../nan/nan.h:192:0,
332  [12/30/2017 10:11AM]:                  from ../src/addon.cc:2:
333  [12/30/2017 10:11AM]: ../../../../nan/nan_maybe_43_inl.h: In function Nan::Maybe<bool> Nan::ForceSet(v8::Local<v8::Object>, v8::Local<v8::Value>, v8::Local<v8::Value>, v8::PropertyAttribute):
334  [12/30/2017 10:11AM]: ../../../../nan/nan_maybe_43_inl.h:112:73: warning: v8::Maybe<bool> v8::Object::ForceSet(v8::Local<v8::Context>, v8::Local<v8::Value>, v8::Local<v8::Value>, v8::PropertyAttribute) is deprecated: Use CreateDataProperty / DefineOwnProperty [-Wdeprecated-declarations]
335  [12/30/2017 10:11AM]:                  from ../src/addon.cc:1:
336  [12/30/2017 10:11AM]:   CXX(target) Release/obj.target/secp256k1/src/privatekey.o
337  [12/30/2017 10:11AM]:                  from ../src/privatekey.cc:2:
338  [12/30/2017 10:11AM]:                  from ../src/privatekey.cc:1:
339  [12/30/2017 10:11AM]:   CXX(target) Release/obj.target/secp256k1/src/publickey.o
340  [12/30/2017 10:11AM]:                  from ../src/publickey.cc:3:
341  [12/30/2017 10:11AM]:                  from ../src/publickey.cc:2:
342  [12/30/2017 10:11AM]:   CXX(target) Release/obj.target/secp256k1/src/signature.o
343  [12/30/2017 10:11AM]:                  from ../src/signature.cc:2:
344  [12/30/2017 10:11AM]:                  from ../src/signature.cc:1:
345  [12/30/2017 10:11AM]:   CXX(target) Release/obj.target/secp256k1/src/ecdsa.o
346  [12/30/2017 10:11AM]:                  from ../src/ecdsa.cc:2:
347  [12/30/2017 10:11AM]:                  from ../src/ecdsa.cc:1:
348  [12/30/2017 10:11AM]:   CXX(target) Release/obj.target/secp256k1/src/ecdh.o
349  [12/30/2017 10:11AM]:                  from ../src/ecdh.cc:2:
350  [12/30/2017 10:11AM]:                  from ../src/ecdh.cc:1:
351  [12/30/2017 10:11AM]:   CC(target) Release/obj.target/secp256k1/src/secp256k1-src/src/secp256k1.o
352  [12/30/2017 10:11AM]: ../src/secp256k1-src/src/secp256k1.c: In function secp256k1_ec_pubkey_parse:
353  [12/30/2017 10:11AM]: ../src/secp256k1-src/src/secp256k1.c:22:8: warning: nonnull argument pubkey compared to NULL [-Wnonnull-compare]
354  [12/30/2017 10:11AM]:      if (EXPECT(!(cond), 0)) { \
355  [12/30/2017 10:11AM]: ../src/secp256k1-src/src/secp256k1.c:154:5: note: in expansion of macro ARG_CHECK
356  [12/30/2017 10:11AM]:      ARG_CHECK(pubkey != NULL);
357  [12/30/2017 10:11AM]: ../src/secp256k1-src/src/secp256k1.c:22:8: warning: nonnull argument input compared to NULL [-Wnonnull-compare]
358  [12/30/2017 10:11AM]: ../src/secp256k1-src/src/secp256k1.c:156:5: note: in expansion of macro ARG_CHECK
359  [12/30/2017 10:11AM]:      ARG_CHECK(input != NULL);
360  [12/30/2017 10:11AM]: ../src/secp256k1-src/src/secp256k1.c: In function secp256k1_ec_pubkey_serialize:
361  [12/30/2017 10:11AM]: ../src/secp256k1-src/src/secp256k1.c:22:8: warning: nonnull argument output compared to NULL [-Wnonnull-compare]
362  [12/30/2017 10:11AM]: ../src/secp256k1-src/src/secp256k1.c:175:5: note: in expansion of macro ARG_CHECK
363  [12/30/2017 10:11AM]: ../src/secp256k1-src/src/secp256k1.c:22:8: warning: nonnull argument outputlen compared to NULL [-Wnonnull-compare]
364  [12/30/2017 10:11AM]: ../src/secp256k1-src/src/secp256k1.c:171:5: note: in expansion of macro ARG_CHECK
365  [12/30/2017 10:11AM]:      ARG_CHECK(outputlen != NULL);
366  [12/30/2017 10:11AM]: ../src/secp256k1-src/src/secp256k1.c:177:5: note: in expansion of macro ARG_CHECK
367  [12/30/2017 10:11AM]: ../src/secp256k1-src/src/secp256k1.c: In function secp256k1_ecdsa_signature_parse_der:
368  [12/30/2017 10:11AM]: ../src/secp256k1-src/src/secp256k1.c:22:8: warning: nonnull argument sig compared to NULL [-Wnonnull-compare]
369  [12/30/2017 10:11AM]: ../src/secp256k1-src/src/secp256k1.c:216:5: note: in expansion of macro ARG_CHECK
370  [12/30/2017 10:11AM]:      ARG_CHECK(sig != NULL);
371  [12/30/2017 10:11AM]: ../src/secp256k1-src/src/secp256k1.c:217:5: note: in expansion of macro ARG_CHECK
372  [12/30/2017 10:11AM]: ../src/secp256k1-src/src/secp256k1.c: In function secp256k1_ecdsa_signature_parse_compact:
373  [12/30/2017 10:11AM]: ../src/secp256k1-src/src/secp256k1.c:234:5: note: in expansion of macro ARG_CHECK
374  [12/30/2017 10:11AM]: ../src/secp256k1-src/src/secp256k1.c:22:8: warning: nonnull argument input64 compared to NULL [-Wnonnull-compare]
375  [12/30/2017 10:11AM]: ../src/secp256k1-src/src/secp256k1.c:235:5: note: in expansion of macro ARG_CHECK
376  [12/30/2017 10:11AM]:      ARG_CHECK(input64 != NULL);
377  [12/30/2017 10:11AM]: ../src/secp256k1-src/src/secp256k1.c: In function secp256k1_ecdsa_signature_serialize_der:
378  [12/30/2017 10:11AM]: ../src/secp256k1-src/src/secp256k1.c:253:5: note: in expansion of macro ARG_CHECK
379  [12/30/2017 10:11AM]: ../src/secp256k1-src/src/secp256k1.c:254:5: note: in expansion of macro ARG_CHECK
380  [12/30/2017 10:11AM]: ../src/secp256k1-src/src/secp256k1.c:255:5: note: in expansion of macro ARG_CHECK
381  [12/30/2017 10:11AM]: ../src/secp256k1-src/src/secp256k1.c: In function secp256k1_ecdsa_signature_serialize_compact:
382  [12/30/2017 10:11AM]: ../src/secp256k1-src/src/secp256k1.c:22:8: warning: nonnull argument output64 compared to NULL [-Wnonnull-compare]
383  [12/30/2017 10:11AM]: ../src/secp256k1-src/src/secp256k1.c:265:5: note: in expansion of macro ARG_CHECK
384  [12/30/2017 10:11AM]:      ARG_CHECK(output64 != NULL);
385  [12/30/2017 10:11AM]: ../src/secp256k1-src/src/secp256k1.c:266:5: note: in expansion of macro ARG_CHECK
386  [12/30/2017 10:11AM]: ../src/secp256k1-src/src/secp256k1.c: In function secp256k1_ecdsa_signature_normalize:
387  [12/30/2017 10:11AM]: ../src/secp256k1-src/src/secp256k1.c:22:8: warning: nonnull argument sigin compared to NULL [-Wnonnull-compare]
388  [12/30/2017 10:11AM]: ../src/secp256k1-src/src/secp256k1.c:279:5: note: in expansion of macro ARG_CHECK
389  [12/30/2017 10:11AM]: ../src/secp256k1-src/src/secp256k1.c: In function secp256k1_ecdsa_verify:
390  [12/30/2017 10:11AM]: ../src/secp256k1-src/src/secp256k1.c:300:5: note: in expansion of macro ARG_CHECK
391  [12/30/2017 10:11AM]: ../src/secp256k1-src/src/secp256k1.c:22:8: warning: nonnull argument msg32 compared to NULL [-Wnonnull-compare]
392  [12/30/2017 10:11AM]: ../src/secp256k1-src/src/secp256k1.c:299:5: note: in expansion of macro ARG_CHECK
393  [12/30/2017 10:11AM]: ../src/secp256k1-src/src/secp256k1.c:301:5: note: in expansion of macro ARG_CHECK
394  [12/30/2017 10:11AM]: ../src/secp256k1-src/src/secp256k1.c: In function secp256k1_ecdsa_sign:
395  [12/30/2017 10:11AM]: ../src/secp256k1-src/src/secp256k1.c:22:8: warning: nonnull argument signature compared to NULL [-Wnonnull-compare]
396  [12/30/2017 10:11AM]: ../src/secp256k1-src/src/secp256k1.c:353:5: note: in expansion of macro ARG_CHECK
397  [12/30/2017 10:11AM]: ../src/secp256k1-src/src/secp256k1.c:352:5: note: in expansion of macro ARG_CHECK
398  [12/30/2017 10:11AM]: ../src/secp256k1-src/src/secp256k1.c:22:8: warning: nonnull argument seckey compared to NULL [-Wnonnull-compare]
399  [12/30/2017 10:11AM]: ../src/secp256k1-src/src/secp256k1.c:354:5: note: in expansion of macro ARG_CHECK
400  [12/30/2017 10:11AM]: ../src/secp256k1-src/src/secp256k1.c: In function secp256k1_ec_seckey_verify:
401  [12/30/2017 10:11AM]: ../src/secp256k1-src/src/secp256k1.c:396:5: note: in expansion of macro ARG_CHECK
402  [12/30/2017 10:11AM]: ../src/secp256k1-src/src/secp256k1.c: In function secp256k1_ec_pubkey_create:
403  [12/30/2017 10:11AM]: ../src/secp256k1-src/src/secp256k1.c:411:5: note: in expansion of macro ARG_CHECK
404  [12/30/2017 10:11AM]: ../src/secp256k1-src/src/secp256k1.c:414:5: note: in expansion of macro ARG_CHECK
405  [12/30/2017 10:11AM]: ../src/secp256k1-src/src/secp256k1.c: In function secp256k1_ec_privkey_negate:
406  [12/30/2017 10:11AM]: ../src/secp256k1-src/src/secp256k1.c:430:5: note: in expansion of macro ARG_CHECK
407  [12/30/2017 10:11AM]: ../src/secp256k1-src/src/secp256k1.c: In function secp256k1_ec_pubkey_negate:
408  [12/30/2017 10:11AM]: ../src/secp256k1-src/src/secp256k1.c:443:5: note: in expansion of macro ARG_CHECK
409  [12/30/2017 10:11AM]: ../src/secp256k1-src/src/secp256k1.c: In function secp256k1_ec_privkey_tweak_add:
410  [12/30/2017 10:11AM]: ../src/secp256k1-src/src/secp256k1.c:460:5: note: in expansion of macro ARG_CHECK
411  [12/30/2017 10:11AM]: ../src/secp256k1-src/src/secp256k1.c:22:8: warning: nonnull argument tweak compared to NULL [-Wnonnull-compare]
412  [12/30/2017 10:11AM]: ../src/secp256k1-src/src/secp256k1.c:461:5: note: in expansion of macro ARG_CHECK
413  [12/30/2017 10:11AM]: ../src/secp256k1-src/src/secp256k1.c: In function secp256k1_ec_pubkey_tweak_add:
414  [12/30/2017 10:11AM]: ../src/secp256k1-src/src/secp256k1.c:484:5: note: in expansion of macro ARG_CHECK
415  [12/30/2017 10:11AM]: ../src/secp256k1-src/src/secp256k1.c:485:5: note: in expansion of macro ARG_CHECK
416  [12/30/2017 10:11AM]: ../src/secp256k1-src/src/secp256k1.c: In function secp256k1_ec_privkey_tweak_mul:
417  [12/30/2017 10:11AM]: ../src/secp256k1-src/src/secp256k1.c:507:5: note: in expansion of macro ARG_CHECK
418  [12/30/2017 10:11AM]: ../src/secp256k1-src/src/secp256k1.c:508:5: note: in expansion of macro ARG_CHECK
419  [12/30/2017 10:11AM]: ../src/secp256k1-src/src/secp256k1.c: In function secp256k1_ec_pubkey_tweak_mul:
420  [12/30/2017 10:11AM]: ../src/secp256k1-src/src/secp256k1.c:530:5: note: in expansion of macro ARG_CHECK
421  [12/30/2017 10:11AM]: ../src/secp256k1-src/src/secp256k1.c:531:5: note: in expansion of macro ARG_CHECK
422  [12/30/2017 10:11AM]: ../src/secp256k1-src/src/secp256k1.c: In function secp256k1_ec_pubkey_combine:
423  [12/30/2017 10:11AM]: ../src/secp256k1-src/src/secp256k1.c:22:8: warning: nonnull argument pubnonce compared to NULL [-Wnonnull-compare]
424  [12/30/2017 10:11AM]: ../src/secp256k1-src/src/secp256k1.c:559:5: note: in expansion of macro ARG_CHECK
425  [12/30/2017 10:11AM]: ../src/secp256k1-src/src/secp256k1.c:22:8: warning: nonnull argument pubnonces compared to NULL [-Wnonnull-compare]
426  [12/30/2017 10:11AM]: ../src/secp256k1-src/src/secp256k1.c:562:5: note: in expansion of macro ARG_CHECK
427  [12/30/2017 10:11AM]: ../src/secp256k1-src/src/secp256k1.c: In function secp256k1_ecdsa_recoverable_signature_parse_compact:
428  [12/30/2017 10:11AM]: ../src/secp256k1-src/src/modules/recovery/main_impl.h:44:5: note: in expansion of macro ARG_CHECK
429  [12/30/2017 10:11AM]: ../src/secp256k1-src/src/modules/recovery/main_impl.h:45:5: note: in expansion of macro ARG_CHECK
430  [12/30/2017 10:11AM]: ../src/secp256k1-src/src/secp256k1.c: In function secp256k1_ecdsa_recoverable_signature_serialize_compact:
431  [12/30/2017 10:11AM]: ../src/secp256k1-src/src/modules/recovery/main_impl.h:64:5: note: in expansion of macro ARG_CHECK
432  [12/30/2017 10:11AM]: ../src/secp256k1-src/src/secp256k1.c:22:8: warning: nonnull argument recid compared to NULL [-Wnonnull-compare]
433  [12/30/2017 10:11AM]: ../src/secp256k1-src/src/modules/recovery/main_impl.h:66:5: note: in expansion of macro ARG_CHECK
434  [12/30/2017 10:11AM]: ../src/secp256k1-src/src/modules/recovery/main_impl.h:65:5: note: in expansion of macro ARG_CHECK
435  [12/30/2017 10:11AM]: ../src/secp256k1-src/src/secp256k1.c: In function secp256k1_ecdsa_recoverable_signature_convert:
436  [12/30/2017 10:11AM]: ../src/secp256k1-src/src/modules/recovery/main_impl.h:79:5: note: in expansion of macro ARG_CHECK
437  [12/30/2017 10:11AM]: ../src/secp256k1-src/src/modules/recovery/main_impl.h:80:5: note: in expansion of macro ARG_CHECK
438  [12/30/2017 10:11AM]: ../src/secp256k1-src/src/secp256k1.c: In function secp256k1_ecdsa_sign_recoverable:
439  [12/30/2017 10:11AM]: ../src/secp256k1-src/src/modules/recovery/main_impl.h:132:5: note: in expansion of macro ARG_CHECK
440  [12/30/2017 10:11AM]: ../src/secp256k1-src/src/modules/recovery/main_impl.h:131:5: note: in expansion of macro ARG_CHECK
441  [12/30/2017 10:11AM]: ../src/secp256k1-src/src/modules/recovery/main_impl.h:133:5: note: in expansion of macro ARG_CHECK
442  [12/30/2017 10:11AM]: ../src/secp256k1-src/src/secp256k1.c: In function secp256k1_ecdsa_recover:
443  [12/30/2017 10:11AM]: ../src/secp256k1-src/src/modules/recovery/main_impl.h:179:5: note: in expansion of macro ARG_CHECK
444  [12/30/2017 10:11AM]: ../src/secp256k1-src/src/modules/recovery/main_impl.h:178:5: note: in expansion of macro ARG_CHECK
445  [12/30/2017 10:11AM]: ../src/secp256k1-src/src/modules/recovery/main_impl.h:177:5: note: in expansion of macro ARG_CHECK
446  [12/30/2017 10:11AM]:   CC(target) Release/obj.target/secp256k1/src/secp256k1-src/contrib/lax_der_parsing.o
447  [12/30/2017 10:11AM]:   CC(target) Release/obj.target/secp256k1/src/secp256k1-src/contrib/lax_der_privatekey_parsing.o
448  [12/30/2017 10:11AM]:   SOLINK_MODULE(target) Release/obj.target/secp256k1.node
449  [12/30/2017 10:11AM]: make: Leaving directory /pkg/src/browser-laptop/node_modules/prova-lib/node_modules/secp256k1/build
450  [12/30/2017 10:11AM]: > [email protected] install /pkg/src/browser-laptop/node_modules/secp256k1
451  [12/30/2017 10:11AM]: (node:1158) MaxListenersExceededWarning: Possible EventEmitter memory leak detected. 11 SIGINT listeners added. Use emitter.setMaxListeners() to increase limit
452  [12/30/2017 10:11AM]: make: Entering directory /pkg/src/browser-laptop/node_modules/secp256k1/build
453  [12/30/2017 10:12AM]: ../src/secp256k1-src/src/secp256k1.c:433:5: note: in expansion of macro ARG_CHECK
454  [12/30/2017 10:12AM]: ../src/secp256k1-src/src/secp256k1.c:434:5: note: in expansion of macro ARG_CHECK
455  [12/30/2017 10:12AM]: ../src/secp256k1-src/src/secp256k1.c:457:5: note: in expansion of macro ARG_CHECK
456  [12/30/2017 10:12AM]: ../src/secp256k1-src/src/secp256k1.c:458:5: note: in expansion of macro ARG_CHECK
457  [12/30/2017 10:12AM]: ../src/secp256k1-src/src/secp256k1.c:480:5: note: in expansion of macro ARG_CHECK
458  [12/30/2017 10:12AM]: ../src/secp256k1-src/src/secp256k1.c:481:5: note: in expansion of macro ARG_CHECK
459  [12/30/2017 10:12AM]: ../src/secp256k1-src/src/secp256k1.c:503:5: note: in expansion of macro ARG_CHECK
460  [12/30/2017 10:12AM]: ../src/secp256k1-src/src/secp256k1.c:504:5: note: in expansion of macro ARG_CHECK
461  [12/30/2017 10:12AM]: ../src/secp256k1-src/src/secp256k1.c:532:5: note: in expansion of macro ARG_CHECK
462  [12/30/2017 10:12AM]: ../src/secp256k1-src/src/secp256k1.c:535:5: note: in expansion of macro ARG_CHECK
463  [12/30/2017 10:12AM]: make: Leaving directory /pkg/src/browser-laptop/node_modules/secp256k1/build
464  [12/30/2017 10:12AM]: > [email protected] install /pkg/src/browser-laptop/node_modules/spectron/node_modules/electron-chromedriver
465  [12/30/2017 10:12AM]: > node ./download-chromedriver.js
466  [12/30/2017 10:12AM]: > [email protected] install /pkg/src/browser-laptop/node_modules/ad-block
467  [12/30/2017 10:12AM]: make: Entering directory /pkg/src/browser-laptop/node_modules/ad-block/build
468  [12/30/2017 10:12AM]:   CXX(target) Release/obj.target/ad-block/addon.o
469  [12/30/2017 10:12AM]:   CXX(target) Release/obj.target/ad-block/ad_block_client_wrap.o
470  [12/30/2017 10:12AM]: ../ad_block_client_wrap.cc: In static member function static void ad_block_client_wrap::AdBlockClientWrap::New(const v8::FunctionCallbackInfo<v8::Value>&):
471  [12/30/2017 10:12AM]: ../ad_block_client_wrap.cc:117:59: warning: v8::Local<v8::Object> v8::Function::NewInstance(int, v8::Local<v8::Value>*) const is deprecated: Use maybe version [-Wdeprecated-declarations]
472  [12/30/2017 10:12AM]:                  from /pkg/src/.node-gyp/4.5.9/src/node_buffer.h:4,
473  [12/30/2017 10:12AM]:                  from ../ad_block_client_wrap.cc:6:
474  [12/30/2017 10:12AM]:   CXX(target) Release/obj.target/ad-block/ad_block_client.o
475  [12/30/2017 10:12AM]: ../ad_block_client.cc: In function void parseFilter(const char*, const char*, Filter*, BloomFilter*, BloomFilter*, HashSet<Filter>*, HashSet<Filter>*, HashSet<CosmeticFilter>*):
476  [12/30/2017 10:12AM]: ../ad_block_client.cc:313:29: warning: this statement may fall through [-Wimplicit-fallthrough=]
477  [12/30/2017 10:12AM]:            if (*(p+1) == # || *(p+1) == @) {
478  [12/30/2017 10:12AM]:                ~~~~~~~~~~~~~~^~~~~~~~~~~~~~~~
479  [12/30/2017 10:12AM]: ../ad_block_client.cc:328:9: note: here
480  [12/30/2017 10:12AM]:   CXX(target) Release/obj.target/ad-block/cosmetic_filter.o
481  [12/30/2017 10:12AM]:   CXX(target) Release/obj.target/ad-block/filter.o
482  [12/30/2017 10:12AM]:   CXX(target) Release/obj.target/ad-block/node_modules/bloom-filter-cpp/BloomFilter.o
483  [12/30/2017 10:12AM]:   CXX(target) Release/obj.target/ad-block/node_modules/bloom-filter-cpp/hashFn.o
484  [12/30/2017 10:12AM]:   CXX(target) Release/obj.target/ad-block/node_modules/hashset-cpp/HashSet.o
485  [12/30/2017 10:12AM]:   SOLINK_MODULE(target) Release/obj.target/ad-block.node
486  [12/30/2017 10:12AM]:   COPY Release/ad-block.node
487  [12/30/2017 10:12AM]: make: Leaving directory /pkg/src/browser-laptop/node_modules/ad-block/build
488  [12/30/2017 10:12AM]: > [email protected] install /pkg/src/browser-laptop/node_modules/electron-chromedriver
489  [12/30/2017 10:12AM]: > [email protected] install /pkg/src/browser-laptop/node_modules/keytar
490  [12/30/2017 10:12AM]: make: Entering directory /pkg/src/browser-laptop/node_modules/keytar/build
491  [12/30/2017 10:12AM]:   CXX(target) Release/obj.target/keytar/src/main.o
492  [12/30/2017 10:12AM]:   CXX(target) Release/obj.target/keytar/src/keytar_posix.o
493  [12/30/2017 10:12AM]:   SOLINK_MODULE(target) Release/obj.target/keytar.node
494  [12/30/2017 10:12AM]:   COPY Release/keytar.node
495  [12/30/2017 10:12AM]: make: Leaving directory /pkg/src/browser-laptop/node_modules/keytar/build
496  [12/30/2017 10:12AM]: > [email protected] install /pkg/src/browser-laptop/node_modules/nsp/node_modules/git-validate
497  [12/30/2017 10:12AM]: > [email protected] install /pkg/src/browser-laptop/node_modules/pre-commit
498  [12/30/2017 10:12AM]: pre-commit: Detected an existing git pre-commit hook
499  [12/30/2017 10:12AM]: pre-commit: Old pre-commit hook backuped to pre-commit.old
500  [12/30/2017 10:12AM]: > [email protected] install /pkg/src/browser-laptop/node_modules/pre-push
501  [12/30/2017 10:12AM]: pre-push: Detected an existing git pre-push hook
502  [12/30/2017 10:12AM]: pre-push: Old pre-push hook backuped to pre-push.old
503  [12/30/2017 10:12AM]: > [email protected] install /pkg/src/browser-laptop/node_modules/tracking-protection
504  [12/30/2017 10:12AM]: make: Entering directory /pkg/src/browser-laptop/node_modules/tracking-protection/build
505  [12/30/2017 10:12AM]: test.target.mk:137: warning: overriding recipe for target Release/test
506  [12/30/2017 10:12AM]: node_modules/cppunitlite/test.target.mk:125: warning: ignoring old recipe for target Release/test
507  [12/30/2017 10:12AM]:   CXX(target) Release/obj.target/CppUnitLite/node_modules/cppunitlite/src/Failure.o
508  [12/30/2017 10:12AM]:   CXX(target) Release/obj.target/CppUnitLite/node_modules/cppunitlite/src/SimpleString.o
509  [12/30/2017 10:12AM]:   CXX(target) Release/obj.target/CppUnitLite/node_modules/cppunitlite/src/Test.o
510  [12/30/2017 10:12AM]:   CXX(target) Release/obj.target/CppUnitLite/node_modules/cppunitlite/src/TestResult.o
511  [12/30/2017 10:12AM]:   CXX(target) Release/obj.target/CppUnitLite/node_modules/cppunitlite/src/TestRegistry.o
512  [12/30/2017 10:12AM]:   AR(target) Release/obj.target/node_modules/cppunitlite/CppUnitLite.a
513  [12/30/2017 10:12AM]:   CXX(target) Release/obj.target/hashset-cpp/node_modules/hashset-cpp/addon.o
514  [12/30/2017 10:12AM]:   CXX(target) Release/obj.target/hashset-cpp/node_modules/hashset-cpp/HashSetWrap.o
515  [12/30/2017 10:12AM]: ../node_modules/hashset-cpp/HashSetWrap.cpp: In static member function static void HashSetWrap::HashSetWrap::New(const v8::FunctionCallbackInfo<v8::Value>&):
516  [12/30/2017 10:12AM]: ../node_modules/hashset-cpp/HashSetWrap.cpp:61:59: warning: v8::Local<v8::Object> v8::Function::NewInstance(int, v8::Local<v8::Value>*) const is deprecated: Use maybe version [-Wdeprecated-declarations]
517  [12/30/2017 10:12AM]:                  from ../node_modules/hashset-cpp/HashSetWrap.h:9,
518  [12/30/2017 10:12AM]:                  from ../node_modules/hashset-cpp/HashSetWrap.cpp:6:
519  [12/30/2017 10:12AM]:   CXX(target) Release/obj.target/hashset-cpp/node_modules/hashset-cpp/HashSet.o
520  [12/30/2017 10:12AM]:   SOLINK_MODULE(target) Release/obj.target/node_modules/hashset-cpp/hashset-cpp.node
521  [12/30/2017 10:12AM]:   CXX(target) Release/obj.target/sample/main.o
522  [12/30/2017 10:12AM]:   CXX(target) Release/obj.target/sample/TPParser.o
523  [12/30/2017 10:12AM]:   CXX(target) Release/obj.target/sample/node_modules/hashset-cpp/HashSet.o
524  [12/30/2017 10:12AM]:   LINK(target) Release/sample
525  [12/30/2017 10:12AM]:   CXX(target) Release/obj.target/test/test/test-main.o
526  [12/30/2017 10:12AM]: g++: warning: ..: linker input file unused because linking not done
527  [12/30/2017 10:12AM]:   CXX(target) Release/obj.target/test/test/tracking-protection-test.o
528  [12/30/2017 10:12AM]:   CXX(target) Release/obj.target/test/TPParser.o
529  [12/30/2017 10:12AM]:   CXX(target) Release/obj.target/test/node_modules/hashset-cpp/HashSet.o
530  [12/30/2017 10:12AM]:   CXX(target) Release/obj.target/test/node_modules/cppunitlite/test/StackMain.o
531  [12/30/2017 10:12AM]:   CXX(target) Release/obj.target/test/node_modules/cppunitlite/test/StackTest.o
532  [12/30/2017 10:12AM]:   CXX(target) Release/obj.target/tp_node_addon/TPParser.o
533  [12/30/2017 10:12AM]:   CXX(target) Release/obj.target/tp_node_addon/node_addon/TPParserWrap.o
534  [12/30/2017 10:12AM]: ../node_addon/TPParserWrap.cpp: In static member function static void TPParserWrap::CTPParserWrap::New(const v8::FunctionCallbackInfo<v8::Value>&):
535  [12/30/2017 10:12AM]: ../node_addon/TPParserWrap.cpp:70:67: warning: v8::Local<v8::Object> v8::Function::NewInstance(int, v8::Local<v8::Value>*) const is deprecated: Use maybe version [-Wdeprecated-declarations]
536  [12/30/2017 10:12AM]:              args.GetReturnValue().Set(cons->NewInstance(argc, argv));
537  [12/30/2017 10:12AM]:                                                                    ^
538  [12/30/2017 10:12AM]:                  from ../node_addon/TPParserWrap.cpp:6:
539  [12/30/2017 10:12AM]:   CXX(target) Release/obj.target/tp_node_addon/node_addon/addon.o
540  [12/30/2017 10:12AM]:   SOLINK_MODULE(target) Release/obj.target/tp_node_addon.node
541  [12/30/2017 10:12AM]:   COPY Release/tp_node_addon.node
542  [12/30/2017 10:12AM]:   CXX(target) Release/obj.target/tracking-protection/TPParser.o
543  [12/30/2017 10:12AM]:   AR(target) Release/obj.target/tracking-protection.a
544  [12/30/2017 10:12AM]:   COPY Release/tracking-protection.a
545  [12/30/2017 10:12AM]: make: Leaving directory /pkg/src/browser-laptop/node_modules/tracking-protection/build
546  [12/30/2017 10:12AM]: > [email protected] postinstall /pkg/src/browser-laptop/node_modules/bat-client/node_modules/tldjs
547  [12/30/2017 10:12AM]: > node ./bin/postinstall.js
548  [12/30/2017 10:12AM]: > [email protected] postinstall /pkg/src/browser-laptop/node_modules/bat-publisher/node_modules/tldjs
549  [12/30/2017 10:12AM]: > [email protected] postinstall /pkg/src/browser-laptop/node_modules/spawn-sync
550  [12/30/2017 10:12AM]: > [email protected] postinstall /pkg/src/browser-laptop/node_modules/electron-prebuilt
551  [12/30/2017 10:12AM]: Downloading brave-v4.5.9-linux-x64.zip
552  [12/30/2017 10:12AM]: [>                                            ] 0.0% (0 B/s)
553  [12/30/2017 10:12AM]: Downloading brave-v4.5.9-linux-x64.zip
554  [12/30/2017 10:12AM]: [>                                            ] 0.0% of 54.83 MB (0 B/s)
555  [12/30/2017 10:12AM]: [>                                            ] 1.2% of 54.83 MB (677.4 kB/s)
556  [12/30/2017 10:12AM]: [=>                                           ] 4.5% of 54.83 MB (2.47 MB/s)
557  [12/30/2017 10:12AM]: [=====>                                       ] 14.8% of 54.83 MB (6.48 MB/s)
558  [12/30/2017 10:12AM]: [================>                            ] 37.9% of 54.83 MB (13.87 MB/s)
559  [12/30/2017 10:12AM]: [==============================>              ] 69.4% of 54.83 MB (21.75 MB/s)
560  [12/30/2017 10:12AM]: [============================================>] 100.0% of 54.83 MB (27.41 MB/s)
561  [12/30/2017 10:12AM]: > [email protected] postinstall /pkg/src/browser-laptop/node_modules/flow-bin
562  [12/30/2017 10:12AM]:   ✔ flow binary test passed successfully
563  [12/30/2017 10:12AM]: > [email protected] postinstall /pkg/src/browser-laptop
564  [12/30/2017 10:12AM]: > npm run download-sync-client && webpack
565  [12/30/2017 10:12AM]: > [email protected] download-sync-client /pkg/src/browser-laptop
566  [12/30/2017 10:12AM]: > node ./tools/downloadSyncClient
567  [12/30/2017 10:12AM]: writing sync bundle to /pkg/src/browser-laptop/app/extensions/brave/content/scripts/sync.js
568  [12/30/2017 10:13AM]: Hash: 83f5e1a7f89d2558c3d99e36516c33a871b00d20d031c5c981f8db651281
569  [12/30/2017 10:13AM]:     Hash: 83f5e1a7f89d2558c3d9
570  [12/30/2017 10:13AM]:     Version: webpack 1.15.0
571  [12/30/2017 10:13AM]:                                      Asset       Size  Chunks             Chunk Names
572  [12/30/2017 10:13AM]:       de46bc0216c15ce3302139b3c2af4884.svg  789 bytes          [emitted]
573  [12/30/2017 10:13AM]:       41943a7d37ac5c61823a2a17c4e06070.svg  733 bytes          [emitted]
574  [12/30/2017 10:13AM]:     af7ae505a9eed503f8b8e6982036873e.woff2    77.2 kB          [emitted]
575  [12/30/2017 10:13AM]:      fee66e712a8a08eef5805a46892932ad.woff      98 kB          [emitted]
576  [12/30/2017 10:13AM]:       b06871f281fee6b241d60582ae9369b9.ttf     166 kB          [emitted]
577  [12/30/2017 10:13AM]:       912ec66d7572ff821749319396470bde.svg     444 kB          [emitted]
578  [12/30/2017 10:13AM]:       2ad15189f9772058209b9036ebf8bda1.svg    1.34 kB          [emitted]
579  [12/30/2017 10:13AM]:       292a09c3abb7e423680bb8be4de82460.svg  768 bytes          [emitted]
580  [12/30/2017 10:13AM]:       f9c5944d81cb03f5601faa8815856fc4.svg     1.3 kB          [emitted]
581  [12/30/2017 10:13AM]:       a42c3b4a1de787c14f05edf1ec49c9fd.svg    1.72 kB          [emitted]
582  [12/30/2017 10:13AM]:       dfd0990bd610a78a34d31bd751d140bd.svg    1.72 kB          [emitted]
583  [12/30/2017 10:13AM]:       b6dd4b1292cfd4470e58486c56ad0832.svg    3.69 kB          [emitted]
584  [12/30/2017 10:13AM]:       f3b9223a9b686682b28b618d9f28817e.svg  792 bytes          [emitted]
585  [12/30/2017 10:13AM]:       59023652f84793c67f7775cea1b33195.svg  670 bytes          [emitted]
586  [12/30/2017 10:13AM]:       fbb1a0acb7d12f9e64c82a8cc82aeb66.svg  615 bytes          [emitted]
587  [12/30/2017 10:13AM]:       7e57f5ffe33356122ffb083eecf8f2cf.svg    1.13 kB          [emitted]
588  [12/30/2017 10:13AM]:       ab6512b7dac5700b20f7de361aa47884.svg    1.03 kB          [emitted]
589  [12/30/2017 10:13AM]:       aa1e37293df5a3c347ea3784959aa105.svg  776 bytes          [emitted]
590  [12/30/2017 10:13AM]:       d50f42f7ea312cabab88d8eda5bb14a9.svg    2.88 kB          [emitted]
591  [12/30/2017 10:13AM]:       24e964b96ac35120541941897f6a01e3.svg  869 bytes          [emitted]
592  [12/30/2017 10:13AM]:       222f169694e4d1e956fce5a4fb5ad23d.svg  626 bytes          [emitted]
593  [12/30/2017 10:13AM]:       e606b7f6bbecaced0044c1052a99b7a9.svg    1.06 kB          [emitted]
594  [12/30/2017 10:13AM]:       eb1972095e43719a327e7fc4dd7691a4.svg    1.82 kB          [emitted]
595  [12/30/2017 10:13AM]:       7e7925a41b22d080e00c8d7309745420.svg  378 bytes          [emitted]
596  [12/30/2017 10:13AM]:       196262d2122e55e514d47f9e44b66520.svg  431 bytes          [emitted]
597  [12/30/2017 10:13AM]:       4bb98a05900622845d2e66b433711e32.png    2.93 kB          [emitted]
598  [12/30/2017 10:13AM]:       b6190b89305d7ca6eb2b6a84fb68d7bf.png     2.7 kB          [emitted]
599  [12/30/2017 10:13AM]:       4126c044e93c3caa1faaca0f4ec04e1e.png    11.1 kB          [emitted]
600  [12/30/2017 10:13AM]:       80c2dca1e4c4e1e3f495563a6952ee12.png    25.1 kB          [emitted]
601  [12/30/2017 10:13AM]:       4134ecd741d7d7b79fd1bb41ca3ad4d5.svg  472 bytes          [emitted]
602  [12/30/2017 10:13AM]:       89f9f5560225e5eee776ab6ae8f9f0b3.svg  840 bytes          [emitted]
603  [12/30/2017 10:13AM]:       f5ff01ecdaca34dc1cac01191958b4b3.svg  494 bytes          [emitted]
604  [12/30/2017 10:13AM]:       adc4e1913e1d98de46263c2dad9b914c.svg  820 bytes          [emitted]
605  [12/30/2017 10:13AM]:       bd7efdfbcb45f934ff13bfe5f5de5330.svg  990 bytes          [emitted]
606  [12/30/2017 10:13AM]:       e877f09f64a2ce7ec153e0efdd4ed1a1.svg  861 bytes          [emitted]
607  [12/30/2017 10:13AM]:       21db55dd9ae45888ef8d007135d7e243.svg    1.56 kB          [emitted]
608  [12/30/2017 10:13AM]:       d7876d48e80112e766d737346a616707.svg     1.5 kB          [emitted]
609  [12/30/2017 10:13AM]:       247d2a2d16b90d7364981e7224620a2a.svg  976 bytes          [emitted]
610  [12/30/2017 10:13AM]:       c74aae1d7c31e27b75eb9c779b6fab4c.svg    1.03 kB          [emitted]
611  [12/30/2017 10:13AM]:       674f50d287a8c48dc19ba404d20fe713.eot     166 kB          [emitted]
612  [12/30/2017 10:13AM]:       14ad83ede0f899bd6a66a37194df85c6.svg  934 bytes          [emitted]
613  [12/30/2017 10:13AM]:       493bc2b131dc439f27e05c4d3f4e93e7.png    12.1 kB          [emitted]
614  [12/30/2017 10:13AM]:       392507919f6ec931361b489a56c65ce9.svg  816 bytes          [emitted]
615  [12/30/2017 10:13AM]:       d5a535fdec793b2b9219ef7abfa185ce.svg  205 bytes          [emitted]
616  [12/30/2017 10:13AM]:       5ccced21c6505bfab561c1e015e407e1.svg  239 bytes          [emitted]
617  [12/30/2017 10:13AM]:       23b20b72da217563c4304c07c5206dd0.svg  213 bytes          [emitted]
618  [12/30/2017 10:13AM]:       e008bf562e79f9e1fd5110df9d61627d.svg  355 bytes          [emitted]
619  [12/30/2017 10:13AM]:       c11dbc2db4c1e34f10ac562b48e1d886.svg  289 bytes          [emitted]
620  [12/30/2017 10:13AM]:       430b679826c6e11b1767e7e05649e028.svg  615 bytes          [emitted]
621  [12/30/2017 10:13AM]:       2e7aa1b656ba910260191a20406af15f.svg  618 bytes          [emitted]
622  [12/30/2017 10:13AM]:       38ad268f3a41dc9191cc26857537e4c1.svg  452 bytes          [emitted]
623  [12/30/2017 10:13AM]:       a60b6ab6aaca89b5627cee5fb224ce64.svg  438 bytes          [emitted]
624  [12/30/2017 10:13AM]:       f88876b2519c8cbda6ef6fa17e83eeff.svg  687 bytes          [emitted]
625  [12/30/2017 10:13AM]:       bc90457507bcff2412ad0d500d7f92a9.svg  693 bytes          [emitted]
626  [12/30/2017 10:13AM]:       b6fb7a0b51d3af832d445c02e46d434d.png    2.13 kB          [emitted]
627  [12/30/2017 10:13AM]:       a34dd95ecb584ddb353a854a069d89a1.png    18.1 kB          [emitted]
628  [12/30/2017 10:13AM]:       0c4a088449e73ec59b36bb111c7e03b5.png    5.91 kB          [emitted]
629  [12/30/2017 10:13AM]:       69e1af008c893d635dabe4b7feb5f366.png    2.39 kB          [emitted]
630  [12/30/2017 10:13AM]:       51a0855604244165c58b5867df7d5676.png    4.69 kB          [emitted]
631  [12/30/2017 10:13AM]:       1be94b6e3fe1720c770ab40ab0c71cbe.png    7.22 kB          [emitted]
632  [12/30/2017 10:13AM]:       cd1a406ba824513a8d92a2e1418a2977.svg  418 bytes          [emitted]
633  [12/30/2017 10:13AM]:       1acaa76443941825560798bdb3936bf9.svg  437 bytes          [emitted]
634  [12/30/2017 10:13AM]:       3bad0d188335cbfe4a29bd448fa4d0e3.svg  430 bytes          [emitted]
635  [12/30/2017 10:13AM]:       f8aa9b15e2d849c26e84ec0dba7bebae.svg    1.27 kB          [emitted]
636  [12/30/2017 10:13AM]:       cbba55184f62c3df8728928b9016f9d7.svg     1.7 kB          [emitted]
637  [12/30/2017 10:13AM]:       1d10887913956d5ffe996a035b489730.svg    1.51 kB          [emitted]
638  [12/30/2017 10:13AM]:       df9d90f487acc18337a62e10623a2d87.svg    1.21 kB          [emitted]
639  [12/30/2017 10:13AM]:       4816047e6c690868e2f2dfb972e11263.svg    1.09 kB          [emitted]
640  [12/30/2017 10:13AM]:       e27fa9769059ed125a576fe851592410.svg  671 bytes          [emitted]
641  [12/30/2017 10:13AM]:       dafa0bbc64a10f10d65c8eadadd14c0a.svg  890 bytes          [emitted]
642  [12/30/2017 10:13AM]:       dba2dc28147a6dc7176d68287cb3fb74.svg    2.66 kB          [emitted]
643  [12/30/2017 10:13AM]:       8c9c38b16d3e35299481600c10f9bd19.svg  823 bytes          [emitted]
644  [12/30/2017 10:13AM]:       e61458fc4b59fafd5f6bb3a25b6d94ff.svg  824 bytes          [emitted]
645  [12/30/2017 10:13AM]:       f70c25409713b4132e79b004c03ef3cb.svg  428 bytes          [emitted]
646  [12/30/2017 10:13AM]:                        aboutPages.entry.js    4.14 MB       0  [emitted]  aboutPages
647  [12/30/2017 10:13AM]:                               app.entry.js    3.32 MB       1  [emitted]  app
648  [12/30/2017 10:13AM]:                    aboutPages.entry.js.map    5.55 MB       0  [emitted]  aboutPages
649  [12/30/2017 10:13AM]:                           app.entry.js.map     4.6 MB       1  [emitted]  app
650  [12/30/2017 10:13AM]:        [0] multi app 28 bytes {1} [built]
651  [12/30/2017 10:13AM]:        [0] multi aboutPages 28 bytes {0} [built]
652  [12/30/2017 10:13AM]:         + 911 hidden modules
653  [12/30/2017 10:13AM]:     Hash: 9e36516c33a871b00d20
654  [12/30/2017 10:13AM]:                   Asset    Size  Chunks             Chunk Names
655  [12/30/2017 10:13AM]:         lib.devTools.js  717 kB       0  [emitted]  devTools
656  [12/30/2017 10:13AM]:     lib.devTools.js.map  951 kB       0  [emitted]  devTools
657  [12/30/2017 10:13AM]:        [0] multi devTools 28 bytes {0} [built]
658  [12/30/2017 10:13AM]:         + 54 hidden modules
659  [12/30/2017 10:13AM]:     Hash: d031c5c981f8db651281
660  [12/30/2017 10:13AM]:                    webtorrentPage.entry.js     1.4 MB       0  [emitted]  main
661  [12/30/2017 10:13AM]:                webtorrentPage.entry.js.map    1.72 MB       0  [emitted]  main
662  [12/30/2017 10:13AM]:        [0] multi main 28 bytes {0} [built]
663  [12/30/2017 10:13AM]: npm WARN optional SKIPPING OPTIONAL DEPENDENCY: [email protected] (node_modules/7zip-bin-mac):
664  [12/30/2017 10:13AM]: npm WARN notsup SKIPPING OPTIONAL DEPENDENCY: Unsupported platform for [email protected]: wanted {os:darwin,arch:any} (current: {os:linux,arch:x64})
665  [12/30/2017 10:13AM]: npm WARN optional SKIPPING OPTIONAL DEPENDENCY: [email protected] (node_modules/fsevents):
666  [12/30/2017 10:13AM]: npm WARN notsup SKIPPING OPTIONAL DEPENDENCY: Unsupported platform for [email protected]: wanted {os:darwin,arch:any} (current: {os:linux,arch:x64})
667  [12/30/2017 10:13AM]: added 2260 packages in 223.146s
668  [12/30/2017 10:13AM]: > [email protected] build-package /pkg/src/browser-laptop
669  [12/30/2017 10:13AM]: > node ./tools/buildPackage.js
670  [12/30/2017 10:13AM]: Building version 0.19.70 in Brave-linux-x64 with Electron 4.5.9
671  [12/30/2017 10:13AM]: echo cleaning up target...&&rm -Rf Brave-linux-x64&&rm -Rf dist&&rm -f Brave.tar.bz2&&echo done&&echo starting build...&&./node_modules/.bin/webpack&&npm run checks&&node ./node_modules/electron-packager/cli.js . Brave --overwrite --ignore=pre-commit|pre-push|test/|docs/|tools/|signcode-tf|rx|nslog|eslint|cppunitlite|caniuse-db|cross-env|spectron|\.(0|13ctype|APACHE2|BSD|DOCS|DS_Store|LESSER|Makefile|a|ac|aff|after|am|arcconfig|arclint|babelrc|bat|before|bnf|brave-gyp|c|cardinalrc|cc|cfg|closure-compiler|cmake|cmd|covignore|cpp|csv|cxx|d|def|deps|dic|dll|dntrc|dockerignore|dsp|editorconfig|editorconfig~|el|enc|entitlements|eot|esprima|flow|flowconfig|gitattributes|githug|gitignore|gitattributes|gitignore|gitkeep|gitmodules|gnu|gradle|gyp|gypi|gz|h|hbs|hxx|idl|iml|in|inc|include|info|jade|java|jsfmtrc|jshint|jshintignore|jshintrc|jslintrc|jst|js~|keep|lint|lintignore|lock|log|ls|m4|mailmap|map|markdown|md|mdown|md~|mem|min-wd|mk|mkd|mm|mustache|myspell|myspell|name|nsh|nsi|nsprc|nuspec|nvmrc|o|old|orig|otf|param|patch|pegjs|post|pre|pro|py|rej|s|sage|scss|settings|sh|skip|source-map|stamp|swo|tap|targ|template|tern-port|tern-project|testignore|tm_properties|tmp|tpl|ts|txt|un~|vscode|xcf|xml|yaml|yml)$|/deps/|Release/obj|obj.target|ad-block/(node_modules|test|perf|sample|scripts|test|vendor|ABPFilterParserData.dat)|tracking-protection/(node_modules|test|data|scripts|vendor)|tracking-protection/build/node_modules|tracking-protection/build/Release/(sample.exe|test.exe)|sqlite3/src|nsp/node_modules|electron-installer-squirrel-windows|electron-chromedriver|electron-installer-debian|node-notifier/vendor|node-gyp|npm|jsdoc|docs|sinon|electron-download|electron-rebuild|electron-packager|electron-builder|electron-prebuilt|electron-rebuild|electron-winstaller-fixed|muon-winstaller|electron-installer-redhat|flow-bin|babel$|babel-(?!polyfill|regenerator-runtime|preset-env)|jsdom-global|react-addons-perf|react-addons-test-utils|enzyme|git-rev-sync|sqlite3|uglify-js|webdriverio|webpack-dev-server --platform=linux --arch=x64 --version=4.5.9 --icon=res/app.png --asar=true --app-version=0.19.70 --build-version=4.5.9 --protocol=http --protocol-name=HTTP Handler --protocol=https --protocol-name=HTTPS Handler --product-dir-name=brave --version-string.CompanyName=Brave Software --version-string.ProductName=Brave --version-string.Copyright=Copyright 2017, Brave Software --version-string.FileDescription=Brave&&mv Brave-linux-x64/Brave Brave-linux-x64/brave&&ncp ./app/extensions Brave-linux-x64/resources/extensions&&mkdirp Brave-linux-x64/resources/app.asar.unpacked/node_modules/node-anonize2-relic-emscripten&&ncp node_modules/node-anonize2-relic-emscripten/anonize2.js.mem Brave-linux-x64/resources/app.asar.unpacked/node_modules/node-anonize2-relic-emscripten/anonize2.js.mem
672  [12/30/2017 10:14AM]: Hash: ee930c35cbf50aed4d5ba6333fa4781a8563bd4f1e68966a09cf7112cf54
673  [12/30/2017 10:14AM]:     Hash: ee930c35cbf50aed4d5b
674  [12/30/2017 10:14AM]:                        aboutPages.entry.js    4.08 MB       0  [emitted]  aboutPages
675  [12/30/2017 10:14AM]:                               app.entry.js    3.28 MB       1  [emitted]  app
676  [12/30/2017 10:14AM]:                    aboutPages.entry.js.map    5.47 MB       0  [emitted]  aboutPages
677  [12/30/2017 10:14AM]:                           app.entry.js.map    4.55 MB       1  [emitted]  app
678  [12/30/2017 10:14AM]:     ERROR in aboutPages.entry.js from UglifyJs
679  [12/30/2017 10:14AM]:     SyntaxError: Name expected [./app/renderer/components/styles/global.js:5,6]
680  [12/30/2017 10:14AM]:     ERROR in app.entry.js from UglifyJs
681  [12/30/2017 10:14AM]:     Hash: a6333fa4781a8563bd4f
682  [12/30/2017 10:14AM]:     ERROR in lib.devTools.js from UglifyJs
683  [12/30/2017 10:14AM]:     SyntaxError: Unexpected token: operator (>) [./js/constants/config.js:46,13]
684  [12/30/2017 10:14AM]:     Hash: 1e68966a09cf7112cf54
685  [12/30/2017 10:14AM]:                    webtorrentPage.entry.js    1.35 MB       0  [emitted]  main
686  [12/30/2017 10:14AM]:                webtorrentPage.entry.js.map    1.66 MB       0  [emitted]  main
687  [12/30/2017 10:14AM]:     ERROR in webtorrentPage.entry.js from UglifyJs
688  [12/30/2017 10:14AM]:     SyntaxError: Name expected [./app/renderer/components/styles/commonStyles.js:5,6]
689  [12/30/2017 10:14AM]: > [email protected] checks /pkg/src/browser-laptop
690  [12/30/2017 10:14AM]: > [email protected] check-security /pkg/src/browser-laptop
691  [12/30/2017 10:14AM]: (+) 6 vulnerabilities found
692  [12/30/2017 10:14AM]: ┌───────────────┬─────────────────────────────────────────────────────────────────┐
693  [12/30/2017 10:14AM]: │               │ Regular Expression Denial of Service                            │
694  [12/30/2017 10:14AM]: ├───────────────┼─────────────────────────────────────────────────────────────────┤
695  [12/30/2017 10:14AM]: │ Name          │ moment                                                          │
696  [12/30/2017 10:14AM]: │ CVSS          │ 7.5 (High)697  [12/30/2017 10:14AM]: │ Patched       │ >=2.19.3                                                        │
698  [12/30/2017 10:14AM]: │ Path          │ [email protected] > [email protected] > [email protected] > [email protected]699  [12/30/2017 10:14AM]: │ More Info     │ https://nodesecurity.io/advisories/532                          │
700  [12/30/2017 10:14AM]: └───────────────┴─────────────────────────────────────────────────────────────────┘
701  [12/30/2017 10:14AM]: │ Path          │ [email protected] > [email protected] > [email protected]… │
702  [12/30/2017 10:14AM]: │ Path          │ [email protected] > [email protected]703  [12/30/2017 10:14AM]: │               │ Denial of Service                                               │
704  [12/30/2017 10:14AM]: │ Vulnerable    │ <1.1.5 || >=2.0.0 <3.3.1                                        │
705  [12/30/2017 10:14AM]: │ Patched       │ >= 1.1.5 <2.0.0 || >=3.3.1                                      │
706  [12/30/2017 10:14AM]: │ Path          │ [email protected] > [email protected] > [email protected] > [email protected]… │
707  [12/30/2017 10:14AM]: │ More Info     │ https://nodesecurity.io/advisories/550                          │
708  [12/30/2017 10:14AM]: │ Path          │ [email protected] > [email protected] > [email protected] >… │
709  [12/30/2017 10:14AM]: npm ERR! [email protected] check-security: `nsp check`
710  [12/30/2017 10:14AM]: npm ERR! Failed at the [email protected] check-security script.
711  [12/30/2017 10:14AM]: npm ERR! This is probably not a problem with npm. There is likely additional logging output above.
712  [12/30/2017 10:14AM]: npm ERR! A complete log of this run can be found in:
713  [12/30/2017 10:14AM]: npm ERR!     /pkg/src/.npm/_logs/2017-12-30T16_14_17_847Z-debug.log
714  [12/30/2017 10:14AM]: npm ERR! [email protected] checks: `npm run check-security`
715  [12/30/2017 10:14AM]: npm ERR! Failed at the [email protected] checks script.
716  [12/30/2017 10:14AM]: npm ERR!     /pkg/src/.npm/_logs/2017-12-30T16_14_17_859Z-debug.log
717  [12/30/2017 10:14AM]: buildPackage failed { Error: Command failed: echo cleaning up target...&&rm -Rf Brave-linux-x64&&rm -Rf dist&&rm -f Brave.tar.bz2&&echo done&&echo starting build...&&./node_modules/.bin/webpack&&npm run checks&&node ./node_modules/electron-packager/cli.js . Brave --overwrite --ignore=pre-commit|pre-push|test/|docs/|tools/|signcode-tf|rx|nslog|eslint|cppunitlite|caniuse-db|cross-env|spectron|\.(0|13ctype|APACHE2|BSD|DOCS|DS_Store|LESSER|Makefile|a|ac|aff|after|am|arcconfig|arclint|babelrc|bat|before|bnf|brave-gyp|c|cardinalrc|cc|cfg|closure-compiler|cmake|cmd|covignore|cpp|csv|cxx|d|def|deps|dic|dll|dntrc|dockerignore|dsp|editorconfig|editorconfig~|el|enc|entitlements|eot|esprima|flow|flowconfig|gitattributes|githug|gitignore|gitattributes|gitignore|gitkeep|gitmodules|gnu|gradle|gyp|gypi|gz|h|hbs|hxx|idl|iml|in|inc|include|info|jade|java|jsfmtrc|jshint|jshintignore|jshintrc|jslintrc|jst|js~|keep|lint|lintignore|lock|log|ls|m4|mailmap|map|markdown|md|mdown|md~|mem|min-wd|mk|mkd|mm|mustache|myspell|myspell|name|nsh|nsi|nsprc|nuspec|nvmrc|o|old|orig|otf|param|patch|pegjs|post|pre|pro|py|rej|s|sage|scss|settings|sh|skip|source-map|stamp|swo|tap|targ|template|tern-port|tern-project|testignore|tm_properties|tmp|tpl|ts|txt|un~|vscode|xcf|xml|yaml|yml)$|/deps/|Release/obj|obj.target|ad-block/(node_modules|test|perf|sample|scripts|test|vendor|ABPFilterParserData.dat)|tracking-protection/(node_modules|test|data|scripts|vendor)|tracking-protection/build/node_modules|tracking-protection/build/Release/(sample.exe|test.exe)|sqlite3/src|nsp/node_modules|electron-installer-squirrel-windows|electron-chromedriver|electron-installer-debian|node-notifier/vendor|node-gyp|npm|jsdoc|docs|sinon|electron-download|electron-rebuild|electron-packager|electron-builder|electron-prebuilt|electron-rebuild|electron-winstaller-fixed|muon-winstaller|electron-installer-redhat|flow-bin|babel$|babel-(?!polyfill|regenerator-runtime|preset-env)|jsdom-global|react-addons-perf|react-addons-test-utils|enzyme|git-rev-sync|sqlite3|uglify-js|webdriverio|webpack-dev-server --platform=linux --arch=x64 --version=4.5.9 --icon=res/app.png --asar=true --app-version=0.19.70 --build-version=4.5.9 --protocol=http --protocol-name=HTTP Handler --protocol=https --protocol-name=HTTPS Handler --product-dir-name=brave --version-string.CompanyName=Brave Software --version-string.ProductName=Brave --version-string.Copyright=Copyright 2017, Brave Software --version-string.FileDescription=Brave&&mv Brave-linux-x64/Brave Brave-linux-x64/brave&&ncp ./app/extensions Brave-linux-x64/resources/extensions&&mkdirp Brave-linux-x64/resources/app.asar.unpacked/node_modules/node-anonize2-relic-emscripten&&ncp node_modules/node-anonize2-relic-emscripten/anonize2.js.mem Brave-linux-x64/resources/app.asar.unpacked/node_modules/node-anonize2-relic-emscripten/anonize2.js.mem
718  [12/30/2017 10:14AM]:     at ChildProcess.exithandler (child_process.js:272:12)
719  [12/30/2017 10:14AM]:     at ChildProcess.emit (events.js:159:13)
720  [12/30/2017 10:14AM]:     at maybeClose (internal/child_process.js:943:16)
721  [12/30/2017 10:14AM]:     at Process.ChildProcess._handle.onexit (internal/child_process.js:220:5)
722  [12/30/2017 10:14AM]:   cmd: echo cleaning up target...&&rm -Rf Brave-linux-x64&&rm -Rf dist&&rm -f Brave.tar.bz2&&echo done&&echo starting build...&&./node_modules/.bin/webpack&&npm run checks&&node ./node_modules/electron-packager/cli.js . Brave --overwrite --ignore=pre-commit|pre-push|test/|docs/|tools/|signcode-tf|rx|nslog|eslint|cppunitlite|caniuse-db|cross-env|spectron|\\.(0|13ctype|APACHE2|BSD|DOCS|DS_Store|LESSER|Makefile|a|ac|aff|after|am|arcconfig|arclint|babelrc|bat|before|bnf|brave-gyp|c|cardinalrc|cc|cfg|closure-compiler|cmake|cmd|covignore|cpp|csv|cxx|d|def|deps|dic|dll|dntrc|dockerignore|dsp|editorconfig|editorconfig~|el|enc|entitlements|eot|esprima|flow|flowconfig|gitattributes|githug|gitignore|gitattributes|gitignore|gitkeep|gitmodules|gnu|gradle|gyp|gypi|gz|h|hbs|hxx|idl|iml|in|inc|include|info|jade|java|jsfmtrc|jshint|jshintignore|jshintrc|jslintrc|jst|js~|keep|lint|lintignore|lock|log|ls|m4|mailmap|map|markdown|md|mdown|md~|mem|min-wd|mk|mkd|mm|mustache|myspell|myspell|name|nsh|nsi|nsprc|nuspec|nvmrc|o|old|orig|otf|param|patch|pegjs|post|pre|pro|py|rej|s|sage|scss|settings|sh|skip|source-map|stamp|swo|tap|targ|template|tern-port|tern-project|testignore|tm_properties|tmp|tpl|ts|txt|un~|vscode|xcf|xml|yaml|yml)$|/deps/|Release/obj|obj.target|ad-block/(node_modules|test|perf|sample|scripts|test|vendor|ABPFilterParserData.dat)|tracking-protection/(node_modules|test|data|scripts|vendor)|tracking-protection/build/node_modules|tracking-protection/build/Release/(sample.exe|test.exe)|sqlite3/src|nsp/node_modules|electron-installer-squirrel-windows|electron-chromedriver|electron-installer-debian|node-notifier/vendor|node-gyp|npm|jsdoc|docs|sinon|electron-download|electron-rebuild|electron-packager|electron-builder|electron-prebuilt|electron-rebuild|electron-winstaller-fixed|muon-winstaller|electron-installer-redhat|flow-bin|babel$|babel-(?!polyfill|regenerator-runtime|preset-env)|jsdom-global|react-addons-perf|react-addons-test-utils|enzyme|git-rev-sync|sqlite3|uglify-js|webdriverio|webpack-dev-server --platform=linux --arch=x64 --version=4.5.9 --icon=res/app.png --asar=true --app-version=0.19.70 --build-version=4.5.9 --protocol=http --protocol-name=HTTP Handler --protocol=https --protocol-name=HTTPS Handler --product-dir-name=brave --version-string.CompanyName=Brave Software --version-string.ProductName=Brave --version-string.Copyright=Copyright 2017, Brave Software --version-string.FileDescription=Brave&&mv Brave-linux-x64/Brave Brave-linux-x64/brave&&ncp ./app/extensions Brave-linux-x64/resources/extensions&&mkdirp Brave-linux-x64/resources/app.asar.unpacked/node_modules/node-anonize2-relic-emscripten&&ncp node_modules/node-anonize2-relic-emscripten/anonize2.js.mem Brave-linux-x64/resources/app.asar.unpacked/node_modules/node-anonize2-relic-emscripten/anonize2.js.mem }
723  [12/30/2017 10:14AM]: npm ERR! [email protected] build-package: `node ./tools/buildPackage.js`
724  [12/30/2017 10:14AM]: npm ERR! Failed at the [email protected] build-package script.
725  [12/30/2017 10:14AM]: npm ERR!     /pkg/src/.npm/_logs/2017-12-30T16_14_17_896Z-debug.log
726  [12/30/2017 10:14AM]: ==> ERROR: A failure occurred in build().
727  [12/30/2017 10:14AM]: rm: cannot remove **.pkg.**: No such file or directory
728  [12/30/2017 10:14AM]: [\^/\^/^\^/^\^/\^/\^/^\^/^\^/]  BUILD FAILED  [\^/\^/^\^/^\^/\^/\^/^\^/^\^/]