Build Record

Build Number: 7669

Transaction: 3767
Package: brave
Version: 0.19.80dev-1
Start: 01/05/2018 01:30PM
Finish: 01/05/2018 01:34PM
Result: failed
 brave/PKGBUILD CHANGED

Build Log

  1 [01/05/2018 01:30PM]: [\^/\^/^\^/^\^/\^/\^/^\^/^\^/]  SETTING UP ENVIRONMENT  [\^/\^/^\^/^\^/\^/\^/^\^/^\^/]
  2  [01/05/2018 01:30PM]: [\^/\^/^\^/^\^/\^/\^/^\^/^\^/]  ADDING UPSTREAM PGP KEYS TO KEYRING  [\^/\^/^\^/^\^/\^/\^/^\^/^\^/]
  3  [01/05/2018 01:30PM]: gpg: WARNING: unsafe ownership on homedir /tmp/antbs/.gnupg
  4  [01/05/2018 01:30PM]: gpg: keybox /tmp/antbs/.gnupg/pubring.kbx created
  5  [01/05/2018 01:30PM]: gpg: key 23EFEFE93C4CFFFE: 1 signature not checked due to a missing key
  6  [01/05/2018 01:30PM]: gpg: /tmp/antbs/.gnupg/trustdb.gpg: trustdb created
  7  [01/05/2018 01:30PM]: gpg: key 23EFEFE93C4CFFFE: public key Italo A. Casas <[email protected]> imported
  8  [01/05/2018 01:30PM]: gpg: key B63B535A4C206CA9: 8 signatures not checked due to missing keys
  9  [01/05/2018 01:30PM]: gpg: key B63B535A4C206CA9: public key Evan Lucas <[email protected]> imported
 10  [01/05/2018 01:30PM]: gpg: key E73BC641CC11F4C8: 14 signatures not checked due to missing keys
 11  [01/05/2018 01:30PM]: gpg: key E73BC641CC11F4C8: public key Myles Borins <[email protected]> imported
 12  [01/05/2018 01:30PM]: gpg: key C273792F7D83545D: 2 signatures not checked due to missing keys
 13  [01/05/2018 01:30PM]: gpg: key C273792F7D83545D: public key Rod Vagg <[email protected]> imported
 14  [01/05/2018 01:30PM]: gpg: key C97EC7A07EDE3FC1: 19 signatures not checked due to missing keys
 15  [01/05/2018 01:30PM]: gpg: key C97EC7A07EDE3FC1: public key keybase.io/jasnell <[email protected]> imported
 16  [01/05/2018 01:30PM]: gpg: key 09FE44734EB7990E: public key Jeremiah Senkpiel <[email protected]> imported
 17  [01/05/2018 01:30PM]: gpg: key 7434390BDBE9B9C5: public key Colin Ihrig <[email protected]> imported
 18  [01/05/2018 01:30PM]: gpg: key 61B7B526D98F0353: 24 signatures not checked due to missing keys
 19  [01/05/2018 01:30PM]: gpg: key 61B7B526D98F0353: public key Mozilla Software Releases <[email protected]> imported
 20  [01/05/2018 01:30PM]: gpg: key 61B7B526D98F0353: Mozilla Software Releases <[email protected]> not changed
 21  [01/05/2018 01:30PM]: gpg: no ultimately trusted keys found
 22  [01/05/2018 01:30PM]: gpg: Total number processed: 9
 23  [01/05/2018 01:30PM]: gpg:               imported: 8
 24  [01/05/2018 01:30PM]: gpg:              unchanged: 1
 25  [01/05/2018 01:30PM]: [\^/\^/^\^/^\^/\^/\^/^\^/^\^/]  SYNCING REPO DATABASES  [\^/\^/^\^/^\^/\^/\^/^\^/^\^/]
 26  [01/05/2018 01:30PM]: :: Synchronizing package databases...
 27  [01/05/2018 01:30PM]: downloading antergos-staging.db...
 28  [01/05/2018 01:30PM]: downloading antergos.db...
 29  [01/05/2018 01:30PM]: downloading core.db...
 30  [01/05/2018 01:30PM]: downloading community.db...
 31  [01/05/2018 01:30PM]: :: Starting full system upgrade...
 32  [01/05/2018 01:30PM]: looking for conflicting packages...
 33  [01/05/2018 01:30PM]: Packages (1) subversion-1.9.7-4
 34  [01/05/2018 01:30PM]: Total Download Size:    6.44 MiB
 35  [01/05/2018 01:30PM]: Total Installed Size:  34.55 MiB
 36  [01/05/2018 01:30PM]: Net Upgrade Size:       0.00 MiB
 37  [01/05/2018 01:30PM]: :: Proceed with installation? [Y/n]
 38  [01/05/2018 01:30PM]: downloading subversion-1.9.7-4-x86_64.pkg.tar.xz...
 39  [01/05/2018 01:30PM]: checking package integrity...
 40  [01/05/2018 01:30PM]: checking for file conflicts...
 41  [01/05/2018 01:30PM]: :: Processing package changes...
 42  [01/05/2018 01:30PM]: :: Running post-transaction hooks...
 43  [01/05/2018 01:30PM]: (1/3) Warn about old perl modules
 44  [01/05/2018 01:30PM]: (2/3) Creating temporary files...
 45  [01/05/2018 01:30PM]: (3/3) Arming ConditionNeedsUpdate...
 46  [01/05/2018 01:30PM]: [\^/\^/^\^/^\^/\^/\^/^\^/^\^/]  TRYING BUILD  [\^/\^/^\^/^\^/\^/\^/^\^/^\^/]
 47  [01/05/2018 01:30PM]: [\^/\^/^\^/^\^/\^/\^/^\^/^\^/]  UPDATING SOURCE CHECKSUMS  [\^/\^/^\^/^\^/\^/\^/^\^/^\^/]
 48  [01/05/2018 01:30PM]: ==> Generating checksums for source files...
 49  [01/05/2018 01:30PM]: ==> Making package: brave 0.19.80dev-1 (Fri Jan  5 19:30:34 UTC 2018)
 50  [01/05/2018 01:30PM]: ==> Checking runtime dependencies...
 51  [01/05/2018 01:30PM]: ==> Installing missing dependencies...
 52  [01/05/2018 01:30PM]: :: There are 10 providers available for ttf-font:
 53  [01/05/2018 01:30PM]:    1) ttf-google-fonts-typewolf
 54  [01/05/2018 01:30PM]:    2) noto-fonts  3) noto-fonts-extra  4) ttf-bitstream-vera  5) ttf-croscore  6) ttf-dejavu  7) ttf-freefont
 55  [01/05/2018 01:30PM]:    8) ttf-droid  9) ttf-liberation  10) ttf-ubuntu-font-family
 56  [01/05/2018 01:30PM]: Enter a number (default=1):
 57  [01/05/2018 01:30PM]: warning: dependency cycle detected:
 58  [01/05/2018 01:30PM]: warning: harfbuzz will be installed before its freetype2 dependency
 59  [01/05/2018 01:30PM]: Packages (71) atk-2.26.1-1  avahi-0.7-2  cairo-1.15.10-1  compositeproto-0.4.2-3  damageproto-1.2.1-3  dbus-glib-0.108-1  fixesproto-5.0+9+g4292ec1-1  fontconfig-2.12.6+5+g665584a-1  freetype2-2.8.1-1  gdk-pixbuf2-2.36.11-1  graphite-1:1.3.10-1  gtk-update-icon-cache-3.22.26+47+g3a1a7135a2-3  harfbuzz-1.7.4-1  hicolor-icon-theme-0.17-1  icu-60.2-1  inputproto-2.3.2-1  jasper-2.0.14-1  js-24.2.0-4  kbproto-1.0.7-1  libcroco-0.6.12+4+g9ad7287-1  libcups-2.2.6-1  libdaemon-0.14-3  libdatrie-0.2.10-2  libfontenc-1.1.3-1  libjpeg-turbo-1.5.3-1  libpng-1.6.34-2  librsvg-2:2.41.2-1  libthai-0.1.27-1  libtiff-4.0.9-1  libx11-1.6.5-1  libxau-1.0.8-2  libxcb-1.12-1  libxcomposite-0.4.4-2  libxcursor-1.1.15-1  libxdamage-1.1.4-2  libxdmcp-1.1.2-1  libxext-1.3.3-1  libxfixes-5.0.3-1  libxft-2.3.2-1  libxi-1.7.9-1  libxinerama-1.1.3-2  libxml2-2.9.7+4+g72182550-2  libxrandr-1.5.1-1  libxrender-0.9.10-1  lzo-2.10-1  nspr-4.17-1  pango-1.40.14-1  pixman-0.34.0-1  polkit-0.113+34+g29ba7af-1  randrproto-1.5.0-1  recordproto-1.14.2-2  renderproto-0.11.1-3  scrnsaverproto-1.2.2-2  shared-mime-info-1.9-1  xcb-proto-1.12-3  xextproto-7.3.0-1  xineramaproto-1.2.1-3  xorg-fonts-encodings-1.0.4-4  xorg-mkfontdir-1.0.7-8  xorg-mkfontscale-1.1.2-1  xproto-7.0.31-1  alsa-lib-1.1.5-1  desktop-file-utils-0.23-1  gconf-3.2.6-5  gtk2-2.24.31-1  libgnome-keyring-3.12.0-2  libnotify-0.7.7-1  libxss-1.2.2-2  libxtst-1.2.3-1  nss-3.34.1-1  ttf-google-fonts-typewolf-17.11.git+2e2caa2-1
 60  [01/05/2018 01:30PM]: Total Download Size:     0.54 MiB
 61  [01/05/2018 01:30PM]: Total Installed Size:  314.49 MiB
 62  [01/05/2018 01:30PM]: downloading libxinerama-1.1.3-2-x86_64.pkg.tar.xz...
 63  [01/05/2018 01:30PM]: downloading gdk-pixbuf2-2.36.11-1-x86_64.pkg.tar.xz...
 64  [01/05/2018 01:30PM]: Optional dependencies for harfbuzz
 65  [01/05/2018 01:30PM]:     cairo: hb-view program [pending]
 66  [01/05/2018 01:30PM]: warning: directory permissions differ on /var/
 67  [01/05/2018 01:30PM]: filesystem: 777  package: 755
 68  [01/05/2018 01:30PM]:   Fontconfig configuration is done via /etc/fonts/conf.avail and conf.d.
 69  [01/05/2018 01:30PM]:   Read /etc/fonts/conf.d/README for more information.
 70  [01/05/2018 01:30PM]:   Configuration via /etc/fonts/local.conf is still possible,
 71  [01/05/2018 01:30PM]:   but is no longer recommended for options available in conf.avail.
 72  [01/05/2018 01:30PM]:   Main systemwide configuration should be done by symlinks
 73  [01/05/2018 01:30PM]:   (especially for autohinting, sub-pixel and lcdfilter):
 74  [01/05/2018 01:30PM]:   ln -s ../conf.avail/XX-foo.conf
 75  [01/05/2018 01:30PM]:   Check also https://wiki.archlinux.org/index.php/Font_Configuration
 76  [01/05/2018 01:30PM]:   and https://wiki.archlinux.org/index.php/Fonts.
 77  [01/05/2018 01:30PM]: Rebuilding fontconfig cache... done.
 78  [01/05/2018 01:30PM]: Optional dependencies for libxcursor
 79  [01/05/2018 01:30PM]:     gnome-themes-standard: fallback icon theme
 80  [01/05/2018 01:30PM]: installing compositeproto...
 81  [01/05/2018 01:30PM]: installing shared-mime-info...
 82  [01/05/2018 01:30PM]: Optional dependencies for libtiff
 83  [01/05/2018 01:30PM]:     freeglut: for using tiffgt
 84  [01/05/2018 01:30PM]: Optional dependencies for avahi
 85  [01/05/2018 01:30PM]:     gtk3: avahi-discover, avahi-discover-standalone, bshell, bssh, bvnc
 86  [01/05/2018 01:30PM]:     gtk2: gtk2 bindings [pending]
 87  [01/05/2018 01:30PM]:     pygtk: avahi-bookmarks
 88  [01/05/2018 01:30PM]:     python2-twisted: avahi-bookmarks
 89  [01/05/2018 01:30PM]:     nss-mdns: NSS support for mDNS
 90  [01/05/2018 01:30PM]:     python-gobject: avahi-discover
 91  [01/05/2018 01:30PM]:     python-dbus: avahi-discover
 92  [01/05/2018 01:30PM]: Optional dependencies for jasper
 93  [01/05/2018 01:30PM]:     jasper-doc: documentation
 94  [01/05/2018 01:30PM]: installing hicolor-icon-theme...
 95  [01/05/2018 01:30PM]: installing gtk-update-icon-cache...
 96  [01/05/2018 01:30PM]: installing desktop-file-utils...
 97  [01/05/2018 01:30PM]: Optional dependencies for gtk2
 98  [01/05/2018 01:30PM]:     gnome-themes-standard: Default widget theme
 99  [01/05/2018 01:30PM]:     adwaita-icon-theme: Default icon theme
100  [01/05/2018 01:30PM]: Optional dependencies for alsa-lib
101  [01/05/2018 01:30PM]:     python2: for python smixer plugin [installed]
102  [01/05/2018 01:30PM]: installing xorg-fonts-encodings...
103  [01/05/2018 01:30PM]: installing xorg-mkfontscale...
104  [01/05/2018 01:30PM]: Creating X fontdir indices... done.
105  [01/05/2018 01:30PM]: installing ttf-google-fonts-typewolf...
106  [01/05/2018 01:30PM]: installing libgnome-keyring...
107  [01/05/2018 01:30PM]: Optional dependencies for libgnome-keyring
108  [01/05/2018 01:30PM]:     gnome-keyring: key storage service (or use any other service implementing org.freedesktop.secrets)
109  [01/05/2018 01:30PM]: ( 1/10) Updating fontconfig cache...
110  [01/05/2018 01:30PM]: ( 2/10) Probing GDK-Pixbuf loader modules...
111  [01/05/2018 01:30PM]: ( 3/10) Updating GIO module cache...
112  [01/05/2018 01:30PM]: ( 4/10) Probing GTK2 input method modules...
113  [01/05/2018 01:30PM]: ( 5/10) Updating icon theme caches...
114  [01/05/2018 01:30PM]: ( 6/10) Updating system user accounts...
115  [01/05/2018 01:30PM]: ( 7/10) Arming ConditionNeedsUpdate...
116  [01/05/2018 01:30PM]: ( 8/10) Updating the desktop file MIME type cache...
117  [01/05/2018 01:30PM]: ( 9/10) Updating the MIME type database...
118  [01/05/2018 01:30PM]: (10/10) Updating X fontdir indices...
119  [01/05/2018 01:30PM]: Packages (7) c-ares-1.13.0-1  http-parser-2.7.1-1  libuv-1.18.0-1  nodejs-9.3.0-1  openssl-1.0-1.0.2.n-1  semver-5.4.1-1  npm-5.6.0-1
120  [01/05/2018 01:30PM]: Total Installed Size:  45.87 MiB
121  [01/05/2018 01:30PM]: Optional dependencies for openssl-1.0
122  [01/05/2018 01:30PM]:     ca-certificates [installed]
123  [01/05/2018 01:30PM]: Optional dependencies for nodejs
124  [01/05/2018 01:30PM]:     npm: nodejs package manager [pending]
125  [01/05/2018 01:30PM]: Optional dependencies for npm
126  [01/05/2018 01:30PM]:     python2: for node-gyp [installed]
127  [01/05/2018 01:30PM]:   -> Cloning browser-laptop git repo...
128  [01/05/2018 01:30PM]: Cloning into bare repository /pkg/browser-laptop...
129  [01/05/2018 01:30PM]: ==> Validating source files with md5sums...
130  [01/05/2018 01:30PM]:     brave.desktop ... Passed
131  [01/05/2018 01:30PM]:     browser-laptop ... Skipped
132  [01/05/2018 01:30PM]:   -> Creating working copy of browser-laptop git repo...
133  [01/05/2018 01:30PM]: Cloning into browser-laptop...
134  [01/05/2018 01:30PM]: Switched to a new branch makepkg
135  [01/05/2018 01:31PM]: > [email protected] install /pkg/src/browser-laptop/node_modules/dtrace-provider
136  [01/05/2018 01:31PM]: > [email protected] install /pkg/src/browser-laptop/node_modules/sha3
137  [01/05/2018 01:31PM]: make: Entering directory /pkg/src/browser-laptop/node_modules/sha3/build
138  [01/05/2018 01:31PM]:   CXX(target) Release/obj.target/sha3/src/addon.o
139  [01/05/2018 01:31PM]: In file included from ../../nan/nan.h:192:0,
140  [01/05/2018 01:31PM]:                  from ../src/addon.cpp:4:
141  [01/05/2018 01:31PM]: ../../nan/nan_maybe_43_inl.h: In function Nan::Maybe<bool> Nan::ForceSet(v8::Local<v8::Object>, v8::Local<v8::Value>, v8::Local<v8::Value>, v8::PropertyAttribute):
142  [01/05/2018 01:31PM]: ../../nan/nan_maybe_43_inl.h:112:73: warning: v8::Maybe<bool> v8::Object::ForceSet(v8::Local<v8::Context>, v8::Local<v8::Value>, v8::Local<v8::Value>, v8::PropertyAttribute) is deprecated: Use CreateDataProperty / DefineOwnProperty [-Wdeprecated-declarations]
143  [01/05/2018 01:31PM]:    return obj->ForceSet(isolate->GetCurrentContext(), key, value, attribs);
144  [01/05/2018 01:31PM]:                                                                          ^
145  [01/05/2018 01:31PM]: In file included from /pkg/src/.node-gyp/4.5.13/deps/v8/include/v8.h:26:0,
146  [01/05/2018 01:31PM]:                  from /pkg/src/.node-gyp/4.5.13/src/node.h:42,
147  [01/05/2018 01:31PM]:                  from ../src/addon.cpp:1:
148  [01/05/2018 01:31PM]: /pkg/src/.node-gyp/4.5.13/deps/v8/include/v8.h:3115:29: note: declared here
149  [01/05/2018 01:31PM]:                  Maybe<bool> ForceSet(Local<Context> context, Local<Value> key,
150  [01/05/2018 01:31PM]:                              ^
151  [01/05/2018 01:31PM]: /pkg/src/.node-gyp/4.5.13/deps/v8/include/v8config.h:318:3: note: in definition of macro V8_DEPRECATED
152  [01/05/2018 01:31PM]:    declarator __attribute__((deprecated(message)))
153  [01/05/2018 01:31PM]: ../src/addon.cpp: In static member function static Nan::NAN_METHOD_RETURN_TYPE SHA3Hash::New(Nan::NAN_METHOD_ARGS_TYPE):
154  [01/05/2018 01:31PM]: ../src/addon.cpp:49:23: warning: new of type SHA3Hash with extended alignment 32 [-Waligned-new=]
155  [01/05/2018 01:31PM]: ../src/addon.cpp:49:23: note: uses void* operator new(std::size_t), which does not have an alignment parameter
156  [01/05/2018 01:31PM]: ../src/addon.cpp:49:23: note: use -faligned-new to enable C++17 over-aligned new support
157  [01/05/2018 01:31PM]: ../src/addon.cpp:59:58: warning: v8::Local<v8::Object> v8::Function::NewInstance(int, v8::Local<v8::Value>*) const is deprecated: Use maybe version [-Wdeprecated-declarations]
158  [01/05/2018 01:31PM]:     info.GetReturnValue().Set(cons->NewInstance(argc, argv));
159  [01/05/2018 01:31PM]:                                                           ^
160  [01/05/2018 01:31PM]: /pkg/src/.node-gyp/4.5.13/deps/v8/include/v8.h:3844:31: note: declared here
161  [01/05/2018 01:31PM]:                  Local<Object> NewInstance(int argc, Local<Value> argv[]) const);
162  [01/05/2018 01:31PM]:                                ^
163  [01/05/2018 01:31PM]:   CXX(target) Release/obj.target/sha3/src/displayIntermediateValues.o
164  [01/05/2018 01:31PM]:   CXX(target) Release/obj.target/sha3/src/KeccakF-1600-reference.o
165  [01/05/2018 01:31PM]:   CXX(target) Release/obj.target/sha3/src/KeccakNISTInterface.o
166  [01/05/2018 01:31PM]:   CXX(target) Release/obj.target/sha3/src/KeccakSponge.o
167  [01/05/2018 01:31PM]:   SOLINK_MODULE(target) Release/obj.target/sha3.node
168  [01/05/2018 01:31PM]: make: Leaving directory /pkg/src/browser-laptop/node_modules/sha3/build
169  [01/05/2018 01:31PM]: > [email protected] install /pkg/src/browser-laptop/node_modules/bufferutil
170  [01/05/2018 01:31PM]: > prebuild-install || node-gyp rebuild
171  [01/05/2018 01:31PM]: /pkg/src/browser-laptop/node_modules/node-abi/index.js:45
172  [01/05/2018 01:31PM]:   throw new Error(Could not detect abi for version  + target +  and runtime  + runtime + .  Updating node-abi might help solve this issue if it is a new release of  + runtime)
173  [01/05/2018 01:31PM]: Error: Could not detect abi for version 4.5.13 and runtime electron.  Updating node-abi might help solve this issue if it is a new release of electron
174  [01/05/2018 01:31PM]:     at getAbi (/pkg/src/browser-laptop/node_modules/node-abi/index.js:45:9)
175  [01/05/2018 01:31PM]:     at module.exports (/pkg/src/browser-laptop/node_modules/prebuild-install/rc.js:57:12)
176  [01/05/2018 01:31PM]:     at Object.<anonymous> (/pkg/src/browser-laptop/node_modules/prebuild-install/bin.js:9:25)
177  [01/05/2018 01:31PM]:     at Module._compile (module.js:660:30)
178  [01/05/2018 01:31PM]:     at Object.Module._extensions..js (module.js:671:10)
179  [01/05/2018 01:31PM]:     at Module.load (module.js:573:32)
180  [01/05/2018 01:31PM]:     at tryModuleLoad (module.js:513:12)
181  [01/05/2018 01:31PM]:     at Function.Module._load (module.js:505:3)
182  [01/05/2018 01:31PM]:     at Function.Module.runMain (module.js:701:10)
183  [01/05/2018 01:31PM]:     at startup (bootstrap_node.js:194:16)
184  [01/05/2018 01:31PM]: make: Entering directory /pkg/src/browser-laptop/node_modules/bufferutil/build
185  [01/05/2018 01:31PM]:   CXX(target) Release/obj.target/bufferutil/src/bufferutil.o
186  [01/05/2018 01:31PM]: In file included from ../node_modules/nan/nan.h:192:0,
187  [01/05/2018 01:31PM]:                  from ../src/bufferutil.cc:7:
188  [01/05/2018 01:31PM]: ../node_modules/nan/nan_maybe_43_inl.h: In function Nan::Maybe<bool> Nan::ForceSet(v8::Local<v8::Object>, v8::Local<v8::Value>, v8::Local<v8::Value>, v8::PropertyAttribute):
189  [01/05/2018 01:31PM]: ../node_modules/nan/nan_maybe_43_inl.h:112:73: warning: v8::Maybe<bool> v8::Object::ForceSet(v8::Local<v8::Context>, v8::Local<v8::Value>, v8::Local<v8::Value>, v8::PropertyAttribute) is deprecated: Use CreateDataProperty / DefineOwnProperty [-Wdeprecated-declarations]
190  [01/05/2018 01:31PM]:                  from ../node_modules/nan/nan.h:49,
191  [01/05/2018 01:31PM]:   SOLINK_MODULE(target) Release/obj.target/bufferutil.node
192  [01/05/2018 01:31PM]:   COPY Release/bufferutil.node
193  [01/05/2018 01:31PM]: make: Leaving directory /pkg/src/browser-laptop/node_modules/bufferutil/build
194  [01/05/2018 01:31PM]: > [email protected] install /pkg/src/browser-laptop/node_modules/leveldown
195  [01/05/2018 01:31PM]: make: Entering directory /pkg/src/browser-laptop/node_modules/leveldown/build
196  [01/05/2018 01:31PM]:   CXX(target) Release/obj.target/leveldb/deps/leveldb/leveldb-1.20/db/builder.o
197  [01/05/2018 01:31PM]:   CXX(target) Release/obj.target/leveldb/deps/leveldb/leveldb-1.20/db/db_impl.o
198  [01/05/2018 01:32PM]:   CXX(target) Release/obj.target/leveldb/deps/leveldb/leveldb-1.20/db/db_iter.o
199  [01/05/2018 01:32PM]:   CXX(target) Release/obj.target/leveldb/deps/leveldb/leveldb-1.20/db/filename.o
200  [01/05/2018 01:32PM]:   CXX(target) Release/obj.target/leveldb/deps/leveldb/leveldb-1.20/db/dbformat.o
201  [01/05/2018 01:32PM]:   CXX(target) Release/obj.target/leveldb/deps/leveldb/leveldb-1.20/db/log_reader.o
202  [01/05/2018 01:32PM]:   CXX(target) Release/obj.target/leveldb/deps/leveldb/leveldb-1.20/db/log_writer.o
203  [01/05/2018 01:32PM]:   CXX(target) Release/obj.target/leveldb/deps/leveldb/leveldb-1.20/db/memtable.o
204  [01/05/2018 01:32PM]:   CXX(target) Release/obj.target/leveldb/deps/leveldb/leveldb-1.20/db/repair.o
205  [01/05/2018 01:32PM]:   CXX(target) Release/obj.target/leveldb/deps/leveldb/leveldb-1.20/db/table_cache.o
206  [01/05/2018 01:32PM]:   CXX(target) Release/obj.target/leveldb/deps/leveldb/leveldb-1.20/db/version_edit.o
207  [01/05/2018 01:32PM]:   CXX(target) Release/obj.target/leveldb/deps/leveldb/leveldb-1.20/db/version_set.o
208  [01/05/2018 01:32PM]:   CXX(target) Release/obj.target/leveldb/deps/leveldb/leveldb-1.20/db/write_batch.o
209  [01/05/2018 01:32PM]:   CXX(target) Release/obj.target/leveldb/deps/leveldb/leveldb-1.20/helpers/memenv/memenv.o
210  [01/05/2018 01:32PM]:   CXX(target) Release/obj.target/leveldb/deps/leveldb/leveldb-1.20/port/port_posix_sse.o
211  [01/05/2018 01:32PM]:   CXX(target) Release/obj.target/leveldb/deps/leveldb/leveldb-1.20/table/block.o
212  [01/05/2018 01:32PM]:   CXX(target) Release/obj.target/leveldb/deps/leveldb/leveldb-1.20/table/block_builder.o
213  [01/05/2018 01:32PM]:   CXX(target) Release/obj.target/leveldb/deps/leveldb/leveldb-1.20/table/filter_block.o
214  [01/05/2018 01:32PM]:   CXX(target) Release/obj.target/leveldb/deps/leveldb/leveldb-1.20/table/format.o
215  [01/05/2018 01:32PM]:   CXX(target) Release/obj.target/leveldb/deps/leveldb/leveldb-1.20/table/iterator.o
216  [01/05/2018 01:32PM]:   CXX(target) Release/obj.target/leveldb/deps/leveldb/leveldb-1.20/table/merger.o
217  [01/05/2018 01:32PM]:   CXX(target) Release/obj.target/leveldb/deps/leveldb/leveldb-1.20/table/table.o
218  [01/05/2018 01:32PM]:   CXX(target) Release/obj.target/leveldb/deps/leveldb/leveldb-1.20/table/table_builder.o
219  [01/05/2018 01:32PM]:   CXX(target) Release/obj.target/leveldb/deps/leveldb/leveldb-1.20/table/two_level_iterator.o
220  [01/05/2018 01:32PM]:   CXX(target) Release/obj.target/leveldb/deps/leveldb/leveldb-1.20/util/arena.o
221  [01/05/2018 01:32PM]:   CXX(target) Release/obj.target/leveldb/deps/leveldb/leveldb-1.20/util/bloom.o
222  [01/05/2018 01:32PM]:   CXX(target) Release/obj.target/leveldb/deps/leveldb/leveldb-1.20/util/cache.o
223  [01/05/2018 01:32PM]:   CXX(target) Release/obj.target/leveldb/deps/leveldb/leveldb-1.20/util/coding.o
224  [01/05/2018 01:32PM]:   CXX(target) Release/obj.target/leveldb/deps/leveldb/leveldb-1.20/util/comparator.o
225  [01/05/2018 01:32PM]:   CXX(target) Release/obj.target/leveldb/deps/leveldb/leveldb-1.20/util/crc32c.o
226  [01/05/2018 01:32PM]:   CXX(target) Release/obj.target/leveldb/deps/leveldb/leveldb-1.20/util/env.o
227  [01/05/2018 01:32PM]:   CXX(target) Release/obj.target/leveldb/deps/leveldb/leveldb-1.20/util/filter_policy.o
228  [01/05/2018 01:32PM]:   CXX(target) Release/obj.target/leveldb/deps/leveldb/leveldb-1.20/util/hash.o
229  [01/05/2018 01:32PM]: ../deps/leveldb/leveldb-1.20/util/hash.cc: In function uint32_t leveldb::Hash(const char*, size_t, uint32_t):
230  [01/05/2018 01:32PM]: ../deps/leveldb/leveldb-1.20/util/hash.cc:37:9: warning: this statement may fall through [-Wimplicit-fallthrough=]
231  [01/05/2018 01:32PM]:        h += static_cast<unsigned char>(data[2]) << 16;
232  [01/05/2018 01:32PM]:        ~~^~~~~~~~~~~~~~~~~~~~~~~~~~~~~~~~~~~~~~~~~~~~
233  [01/05/2018 01:32PM]: ../deps/leveldb/leveldb-1.20/util/hash.cc:39:5: note: here
234  [01/05/2018 01:32PM]: ../deps/leveldb/leveldb-1.20/util/hash.cc:40:9: warning: this statement may fall through [-Wimplicit-fallthrough=]
235  [01/05/2018 01:32PM]:        h += static_cast<unsigned char>(data[1]) << 8;
236  [01/05/2018 01:32PM]:        ~~^~~~~~~~~~~~~~~~~~~~~~~~~~~~~~~~~~~~~~~~~~~
237  [01/05/2018 01:32PM]: ../deps/leveldb/leveldb-1.20/util/hash.cc:42:5: note: here
238  [01/05/2018 01:32PM]:   CXX(target) Release/obj.target/leveldb/deps/leveldb/leveldb-1.20/util/logging.o
239  [01/05/2018 01:32PM]:   CXX(target) Release/obj.target/leveldb/deps/leveldb/leveldb-1.20/util/options.o
240  [01/05/2018 01:32PM]:   CXX(target) Release/obj.target/leveldb/deps/leveldb/leveldb-1.20/util/status.o
241  [01/05/2018 01:32PM]:   CXX(target) Release/obj.target/leveldb/deps/leveldb/leveldb-1.20/port/port_posix.o
242  [01/05/2018 01:32PM]:   CXX(target) Release/obj.target/leveldb/deps/leveldb/leveldb-1.20/util/env_posix.o
243  [01/05/2018 01:32PM]:   AR(target) Release/obj.target/deps/leveldb/leveldb.a
244  [01/05/2018 01:32PM]:   CXX(target) Release/obj.target/snappy/deps/snappy/snappy-1.1.4/snappy-sinksource.o
245  [01/05/2018 01:32PM]:   CXX(target) Release/obj.target/snappy/deps/snappy/snappy-1.1.4/snappy-stubs-internal.o
246  [01/05/2018 01:32PM]:   CXX(target) Release/obj.target/snappy/deps/snappy/snappy-1.1.4/snappy.o
247  [01/05/2018 01:32PM]:   AR(target) Release/obj.target/deps/snappy/snappy.a
248  [01/05/2018 01:32PM]:   CXX(target) Release/obj.target/leveldown/src/batch.o
249  [01/05/2018 01:32PM]:                  from ../src/batch.cc:3:
250  [01/05/2018 01:32PM]:                  from ../src/batch.cc:1:
251  [01/05/2018 01:32PM]:   CXX(target) Release/obj.target/leveldown/src/batch_async.o
252  [01/05/2018 01:32PM]:                  from ../src/database.h:16,
253  [01/05/2018 01:32PM]:                  from ../src/batch.h:9,
254  [01/05/2018 01:32PM]:                  from ../src/batch_async.cc:8:
255  [01/05/2018 01:32PM]:                  from ../src/batch.h:5,
256  [01/05/2018 01:32PM]:   CXX(target) Release/obj.target/leveldown/src/database.o
257  [01/05/2018 01:32PM]:                  from ../src/leveldown.h:11,
258  [01/05/2018 01:32PM]:                  from ../src/database.cc:12:
259  [01/05/2018 01:32PM]:                  from ../src/database.cc:6:
260  [01/05/2018 01:32PM]:   CXX(target) Release/obj.target/leveldown/src/database_async.o
261  [01/05/2018 01:32PM]:                  from ../src/database_async.cc:12:
262  [01/05/2018 01:32PM]:                  from ../src/database_async.cc:6:
263  [01/05/2018 01:32PM]:   CXX(target) Release/obj.target/leveldown/src/iterator.o
264  [01/05/2018 01:32PM]:                  from ../src/iterator.cc:9:
265  [01/05/2018 01:32PM]:                  from ../src/iterator.cc:6:
266  [01/05/2018 01:32PM]:   CXX(target) Release/obj.target/leveldown/src/iterator_async.o
267  [01/05/2018 01:32PM]:                  from ../src/iterator_async.cc:9:
268  [01/05/2018 01:32PM]:                  from ../src/iterator_async.cc:6:
269  [01/05/2018 01:32PM]:   CXX(target) Release/obj.target/leveldown/src/leveldown.o
270  [01/05/2018 01:32PM]:                  from ../src/leveldown.cc:8:
271  [01/05/2018 01:32PM]:                  from ../src/leveldown.cc:6:
272  [01/05/2018 01:32PM]:   CXX(target) Release/obj.target/leveldown/src/leveldown_async.o
273  [01/05/2018 01:32PM]:                  from ../src/leveldown_async.cc:8:
274  [01/05/2018 01:32PM]:                  from ../src/leveldown.h:8,
275  [01/05/2018 01:32PM]:   SOLINK_MODULE(target) Release/obj.target/leveldown.node
276  [01/05/2018 01:32PM]:   COPY Release/leveldown.node
277  [01/05/2018 01:32PM]: make: Leaving directory /pkg/src/browser-laptop/node_modules/leveldown/build
278  [01/05/2018 01:32PM]: > [email protected] install /pkg/src/browser-laptop/node_modules/prova-lib/node_modules/secp256k1
279  [01/05/2018 01:32PM]: > prebuild-install || node-gyp rebuild || echo Secp256k1 bindings compilation fail. Pure JS implementation will be used.
280  [01/05/2018 01:32PM]: make: Entering directory /pkg/src/browser-laptop/node_modules/prova-lib/node_modules/secp256k1/build
281  [01/05/2018 01:32PM]:   CXX(target) Release/obj.target/secp256k1/src/addon.o
282  [01/05/2018 01:32PM]: In file included from ../../../../nan/nan.h:192:0,
283  [01/05/2018 01:32PM]:                  from ../src/addon.cc:2:
284  [01/05/2018 01:32PM]: ../../../../nan/nan_maybe_43_inl.h: In function Nan::Maybe<bool> Nan::ForceSet(v8::Local<v8::Object>, v8::Local<v8::Value>, v8::Local<v8::Value>, v8::PropertyAttribute):
285  [01/05/2018 01:32PM]: ../../../../nan/nan_maybe_43_inl.h:112:73: warning: v8::Maybe<bool> v8::Object::ForceSet(v8::Local<v8::Context>, v8::Local<v8::Value>, v8::Local<v8::Value>, v8::PropertyAttribute) is deprecated: Use CreateDataProperty / DefineOwnProperty [-Wdeprecated-declarations]
286  [01/05/2018 01:32PM]:                  from ../src/addon.cc:1:
287  [01/05/2018 01:32PM]:   CXX(target) Release/obj.target/secp256k1/src/privatekey.o
288  [01/05/2018 01:32PM]:                  from ../src/privatekey.cc:2:
289  [01/05/2018 01:32PM]:                  from ../src/privatekey.cc:1:
290  [01/05/2018 01:32PM]:   CXX(target) Release/obj.target/secp256k1/src/publickey.o
291  [01/05/2018 01:32PM]:                  from ../src/publickey.cc:3:
292  [01/05/2018 01:32PM]:                  from ../src/publickey.cc:2:
293  [01/05/2018 01:32PM]:   CXX(target) Release/obj.target/secp256k1/src/signature.o
294  [01/05/2018 01:32PM]:                  from ../src/signature.cc:2:
295  [01/05/2018 01:32PM]:                  from ../src/signature.cc:1:
296  [01/05/2018 01:32PM]:   CXX(target) Release/obj.target/secp256k1/src/ecdsa.o
297  [01/05/2018 01:32PM]:                  from ../src/ecdsa.cc:2:
298  [01/05/2018 01:32PM]:                  from ../src/ecdsa.cc:1:
299  [01/05/2018 01:32PM]:   CXX(target) Release/obj.target/secp256k1/src/ecdh.o
300  [01/05/2018 01:32PM]:                  from ../src/ecdh.cc:2:
301  [01/05/2018 01:32PM]:                  from ../src/ecdh.cc:1:
302  [01/05/2018 01:32PM]:   CC(target) Release/obj.target/secp256k1/src/secp256k1-src/src/secp256k1.o
303  [01/05/2018 01:32PM]: ../src/secp256k1-src/src/secp256k1.c: In function secp256k1_ec_pubkey_parse:
304  [01/05/2018 01:32PM]: ../src/secp256k1-src/src/secp256k1.c:22:8: warning: nonnull argument pubkey compared to NULL [-Wnonnull-compare]
305  [01/05/2018 01:32PM]:      if (EXPECT(!(cond), 0)) { \
306  [01/05/2018 01:32PM]: ../src/secp256k1-src/src/secp256k1.c:154:5: note: in expansion of macro ARG_CHECK
307  [01/05/2018 01:32PM]:      ARG_CHECK(pubkey != NULL);
308  [01/05/2018 01:32PM]: ../src/secp256k1-src/src/secp256k1.c:22:8: warning: nonnull argument input compared to NULL [-Wnonnull-compare]
309  [01/05/2018 01:32PM]: ../src/secp256k1-src/src/secp256k1.c:156:5: note: in expansion of macro ARG_CHECK
310  [01/05/2018 01:32PM]:      ARG_CHECK(input != NULL);
311  [01/05/2018 01:32PM]: ../src/secp256k1-src/src/secp256k1.c: In function secp256k1_ec_pubkey_serialize:
312  [01/05/2018 01:32PM]: ../src/secp256k1-src/src/secp256k1.c:22:8: warning: nonnull argument output compared to NULL [-Wnonnull-compare]
313  [01/05/2018 01:32PM]: ../src/secp256k1-src/src/secp256k1.c:175:5: note: in expansion of macro ARG_CHECK
314  [01/05/2018 01:32PM]: ../src/secp256k1-src/src/secp256k1.c:22:8: warning: nonnull argument outputlen compared to NULL [-Wnonnull-compare]
315  [01/05/2018 01:32PM]: ../src/secp256k1-src/src/secp256k1.c:171:5: note: in expansion of macro ARG_CHECK
316  [01/05/2018 01:32PM]:      ARG_CHECK(outputlen != NULL);
317  [01/05/2018 01:32PM]: ../src/secp256k1-src/src/secp256k1.c:177:5: note: in expansion of macro ARG_CHECK
318  [01/05/2018 01:32PM]: ../src/secp256k1-src/src/secp256k1.c: In function secp256k1_ecdsa_signature_parse_der:
319  [01/05/2018 01:32PM]: ../src/secp256k1-src/src/secp256k1.c:22:8: warning: nonnull argument sig compared to NULL [-Wnonnull-compare]
320  [01/05/2018 01:32PM]: ../src/secp256k1-src/src/secp256k1.c:216:5: note: in expansion of macro ARG_CHECK
321  [01/05/2018 01:32PM]:      ARG_CHECK(sig != NULL);
322  [01/05/2018 01:32PM]: ../src/secp256k1-src/src/secp256k1.c:217:5: note: in expansion of macro ARG_CHECK
323  [01/05/2018 01:32PM]: ../src/secp256k1-src/src/secp256k1.c: In function secp256k1_ecdsa_signature_parse_compact:
324  [01/05/2018 01:32PM]: ../src/secp256k1-src/src/secp256k1.c:234:5: note: in expansion of macro ARG_CHECK
325  [01/05/2018 01:32PM]: ../src/secp256k1-src/src/secp256k1.c:22:8: warning: nonnull argument input64 compared to NULL [-Wnonnull-compare]
326  [01/05/2018 01:32PM]: ../src/secp256k1-src/src/secp256k1.c:235:5: note: in expansion of macro ARG_CHECK
327  [01/05/2018 01:32PM]:      ARG_CHECK(input64 != NULL);
328  [01/05/2018 01:32PM]: ../src/secp256k1-src/src/secp256k1.c: In function secp256k1_ecdsa_signature_serialize_der:
329  [01/05/2018 01:32PM]: ../src/secp256k1-src/src/secp256k1.c:253:5: note: in expansion of macro ARG_CHECK
330  [01/05/2018 01:32PM]: ../src/secp256k1-src/src/secp256k1.c:254:5: note: in expansion of macro ARG_CHECK
331  [01/05/2018 01:32PM]: ../src/secp256k1-src/src/secp256k1.c:255:5: note: in expansion of macro ARG_CHECK
332  [01/05/2018 01:32PM]: ../src/secp256k1-src/src/secp256k1.c: In function secp256k1_ecdsa_signature_serialize_compact:
333  [01/05/2018 01:32PM]: ../src/secp256k1-src/src/secp256k1.c:22:8: warning: nonnull argument output64 compared to NULL [-Wnonnull-compare]
334  [01/05/2018 01:32PM]: ../src/secp256k1-src/src/secp256k1.c:265:5: note: in expansion of macro ARG_CHECK
335  [01/05/2018 01:32PM]:      ARG_CHECK(output64 != NULL);
336  [01/05/2018 01:32PM]: ../src/secp256k1-src/src/secp256k1.c:266:5: note: in expansion of macro ARG_CHECK
337  [01/05/2018 01:32PM]: ../src/secp256k1-src/src/secp256k1.c: In function secp256k1_ecdsa_signature_normalize:
338  [01/05/2018 01:32PM]: ../src/secp256k1-src/src/secp256k1.c:22:8: warning: nonnull argument sigin compared to NULL [-Wnonnull-compare]
339  [01/05/2018 01:32PM]: ../src/secp256k1-src/src/secp256k1.c:279:5: note: in expansion of macro ARG_CHECK
340  [01/05/2018 01:32PM]: ../src/secp256k1-src/src/secp256k1.c: In function secp256k1_ecdsa_verify:
341  [01/05/2018 01:32PM]: ../src/secp256k1-src/src/secp256k1.c:300:5: note: in expansion of macro ARG_CHECK
342  [01/05/2018 01:32PM]: ../src/secp256k1-src/src/secp256k1.c:22:8: warning: nonnull argument msg32 compared to NULL [-Wnonnull-compare]
343  [01/05/2018 01:32PM]: ../src/secp256k1-src/src/secp256k1.c:299:5: note: in expansion of macro ARG_CHECK
344  [01/05/2018 01:32PM]: ../src/secp256k1-src/src/secp256k1.c:301:5: note: in expansion of macro ARG_CHECK
345  [01/05/2018 01:32PM]: ../src/secp256k1-src/src/secp256k1.c: In function secp256k1_ecdsa_sign:
346  [01/05/2018 01:32PM]: ../src/secp256k1-src/src/secp256k1.c:22:8: warning: nonnull argument signature compared to NULL [-Wnonnull-compare]
347  [01/05/2018 01:32PM]: ../src/secp256k1-src/src/secp256k1.c:353:5: note: in expansion of macro ARG_CHECK
348  [01/05/2018 01:32PM]: ../src/secp256k1-src/src/secp256k1.c:352:5: note: in expansion of macro ARG_CHECK
349  [01/05/2018 01:32PM]: ../src/secp256k1-src/src/secp256k1.c:22:8: warning: nonnull argument seckey compared to NULL [-Wnonnull-compare]
350  [01/05/2018 01:32PM]: ../src/secp256k1-src/src/secp256k1.c:354:5: note: in expansion of macro ARG_CHECK
351  [01/05/2018 01:32PM]: ../src/secp256k1-src/src/secp256k1.c: In function secp256k1_ec_seckey_verify:
352  [01/05/2018 01:32PM]: ../src/secp256k1-src/src/secp256k1.c:396:5: note: in expansion of macro ARG_CHECK
353  [01/05/2018 01:32PM]: ../src/secp256k1-src/src/secp256k1.c: In function secp256k1_ec_pubkey_create:
354  [01/05/2018 01:32PM]: ../src/secp256k1-src/src/secp256k1.c:411:5: note: in expansion of macro ARG_CHECK
355  [01/05/2018 01:32PM]: ../src/secp256k1-src/src/secp256k1.c:414:5: note: in expansion of macro ARG_CHECK
356  [01/05/2018 01:32PM]: ../src/secp256k1-src/src/secp256k1.c: In function secp256k1_ec_privkey_negate:
357  [01/05/2018 01:32PM]: ../src/secp256k1-src/src/secp256k1.c:430:5: note: in expansion of macro ARG_CHECK
358  [01/05/2018 01:32PM]: ../src/secp256k1-src/src/secp256k1.c: In function secp256k1_ec_pubkey_negate:
359  [01/05/2018 01:32PM]: ../src/secp256k1-src/src/secp256k1.c:443:5: note: in expansion of macro ARG_CHECK
360  [01/05/2018 01:32PM]: ../src/secp256k1-src/src/secp256k1.c: In function secp256k1_ec_privkey_tweak_add:
361  [01/05/2018 01:32PM]: ../src/secp256k1-src/src/secp256k1.c:460:5: note: in expansion of macro ARG_CHECK
362  [01/05/2018 01:32PM]: ../src/secp256k1-src/src/secp256k1.c:22:8: warning: nonnull argument tweak compared to NULL [-Wnonnull-compare]
363  [01/05/2018 01:32PM]: ../src/secp256k1-src/src/secp256k1.c:461:5: note: in expansion of macro ARG_CHECK
364  [01/05/2018 01:32PM]: ../src/secp256k1-src/src/secp256k1.c: In function secp256k1_ec_pubkey_tweak_add:
365  [01/05/2018 01:32PM]: ../src/secp256k1-src/src/secp256k1.c:484:5: note: in expansion of macro ARG_CHECK
366  [01/05/2018 01:32PM]: ../src/secp256k1-src/src/secp256k1.c:485:5: note: in expansion of macro ARG_CHECK
367  [01/05/2018 01:32PM]: ../src/secp256k1-src/src/secp256k1.c: In function secp256k1_ec_privkey_tweak_mul:
368  [01/05/2018 01:32PM]: ../src/secp256k1-src/src/secp256k1.c:507:5: note: in expansion of macro ARG_CHECK
369  [01/05/2018 01:32PM]: ../src/secp256k1-src/src/secp256k1.c:508:5: note: in expansion of macro ARG_CHECK
370  [01/05/2018 01:32PM]: ../src/secp256k1-src/src/secp256k1.c: In function secp256k1_ec_pubkey_tweak_mul:
371  [01/05/2018 01:32PM]: ../src/secp256k1-src/src/secp256k1.c:530:5: note: in expansion of macro ARG_CHECK
372  [01/05/2018 01:32PM]: ../src/secp256k1-src/src/secp256k1.c:531:5: note: in expansion of macro ARG_CHECK
373  [01/05/2018 01:32PM]: ../src/secp256k1-src/src/secp256k1.c: In function secp256k1_ec_pubkey_combine:
374  [01/05/2018 01:32PM]: ../src/secp256k1-src/src/secp256k1.c:22:8: warning: nonnull argument pubnonce compared to NULL [-Wnonnull-compare]
375  [01/05/2018 01:32PM]: ../src/secp256k1-src/src/secp256k1.c:559:5: note: in expansion of macro ARG_CHECK
376  [01/05/2018 01:32PM]: ../src/secp256k1-src/src/secp256k1.c:22:8: warning: nonnull argument pubnonces compared to NULL [-Wnonnull-compare]
377  [01/05/2018 01:32PM]: ../src/secp256k1-src/src/secp256k1.c:562:5: note: in expansion of macro ARG_CHECK
378  [01/05/2018 01:32PM]: ../src/secp256k1-src/src/secp256k1.c: In function secp256k1_ecdsa_recoverable_signature_parse_compact:
379  [01/05/2018 01:32PM]: ../src/secp256k1-src/src/modules/recovery/main_impl.h:44:5: note: in expansion of macro ARG_CHECK
380  [01/05/2018 01:32PM]: ../src/secp256k1-src/src/modules/recovery/main_impl.h:45:5: note: in expansion of macro ARG_CHECK
381  [01/05/2018 01:32PM]: ../src/secp256k1-src/src/secp256k1.c: In function secp256k1_ecdsa_recoverable_signature_serialize_compact:
382  [01/05/2018 01:32PM]: ../src/secp256k1-src/src/modules/recovery/main_impl.h:64:5: note: in expansion of macro ARG_CHECK
383  [01/05/2018 01:32PM]: ../src/secp256k1-src/src/secp256k1.c:22:8: warning: nonnull argument recid compared to NULL [-Wnonnull-compare]
384  [01/05/2018 01:32PM]: ../src/secp256k1-src/src/modules/recovery/main_impl.h:66:5: note: in expansion of macro ARG_CHECK
385  [01/05/2018 01:32PM]: ../src/secp256k1-src/src/modules/recovery/main_impl.h:65:5: note: in expansion of macro ARG_CHECK
386  [01/05/2018 01:32PM]: ../src/secp256k1-src/src/secp256k1.c: In function secp256k1_ecdsa_recoverable_signature_convert:
387  [01/05/2018 01:32PM]: ../src/secp256k1-src/src/modules/recovery/main_impl.h:79:5: note: in expansion of macro ARG_CHECK
388  [01/05/2018 01:32PM]: ../src/secp256k1-src/src/modules/recovery/main_impl.h:80:5: note: in expansion of macro ARG_CHECK
389  [01/05/2018 01:32PM]: ../src/secp256k1-src/src/secp256k1.c: In function secp256k1_ecdsa_sign_recoverable:
390  [01/05/2018 01:32PM]: ../src/secp256k1-src/src/modules/recovery/main_impl.h:132:5: note: in expansion of macro ARG_CHECK
391  [01/05/2018 01:32PM]: ../src/secp256k1-src/src/modules/recovery/main_impl.h:131:5: note: in expansion of macro ARG_CHECK
392  [01/05/2018 01:32PM]: ../src/secp256k1-src/src/modules/recovery/main_impl.h:133:5: note: in expansion of macro ARG_CHECK
393  [01/05/2018 01:32PM]: ../src/secp256k1-src/src/secp256k1.c: In function secp256k1_ecdsa_recover:
394  [01/05/2018 01:32PM]: ../src/secp256k1-src/src/modules/recovery/main_impl.h:179:5: note: in expansion of macro ARG_CHECK
395  [01/05/2018 01:32PM]: ../src/secp256k1-src/src/modules/recovery/main_impl.h:178:5: note: in expansion of macro ARG_CHECK
396  [01/05/2018 01:32PM]: ../src/secp256k1-src/src/modules/recovery/main_impl.h:177:5: note: in expansion of macro ARG_CHECK
397  [01/05/2018 01:32PM]:   CC(target) Release/obj.target/secp256k1/src/secp256k1-src/contrib/lax_der_parsing.o
398  [01/05/2018 01:32PM]:   CC(target) Release/obj.target/secp256k1/src/secp256k1-src/contrib/lax_der_privatekey_parsing.o
399  [01/05/2018 01:32PM]:   SOLINK_MODULE(target) Release/obj.target/secp256k1.node
400  [01/05/2018 01:32PM]: make: Leaving directory /pkg/src/browser-laptop/node_modules/prova-lib/node_modules/secp256k1/build
401  [01/05/2018 01:32PM]: > [email protected] install /pkg/src/browser-laptop/node_modules/secp256k1
402  [01/05/2018 01:32PM]: make: Entering directory /pkg/src/browser-laptop/node_modules/secp256k1/build
403  [01/05/2018 01:32PM]: ../src/secp256k1-src/src/secp256k1.c:433:5: note: in expansion of macro ARG_CHECK
404  [01/05/2018 01:32PM]: ../src/secp256k1-src/src/secp256k1.c:434:5: note: in expansion of macro ARG_CHECK
405  [01/05/2018 01:32PM]: ../src/secp256k1-src/src/secp256k1.c:457:5: note: in expansion of macro ARG_CHECK
406  [01/05/2018 01:32PM]: ../src/secp256k1-src/src/secp256k1.c:458:5: note: in expansion of macro ARG_CHECK
407  [01/05/2018 01:32PM]: ../src/secp256k1-src/src/secp256k1.c:480:5: note: in expansion of macro ARG_CHECK
408  [01/05/2018 01:32PM]: ../src/secp256k1-src/src/secp256k1.c:481:5: note: in expansion of macro ARG_CHECK
409  [01/05/2018 01:32PM]: ../src/secp256k1-src/src/secp256k1.c:503:5: note: in expansion of macro ARG_CHECK
410  [01/05/2018 01:32PM]: ../src/secp256k1-src/src/secp256k1.c:504:5: note: in expansion of macro ARG_CHECK
411  [01/05/2018 01:32PM]: ../src/secp256k1-src/src/secp256k1.c:532:5: note: in expansion of macro ARG_CHECK
412  [01/05/2018 01:32PM]: ../src/secp256k1-src/src/secp256k1.c:535:5: note: in expansion of macro ARG_CHECK
413  [01/05/2018 01:32PM]: make: Leaving directory /pkg/src/browser-laptop/node_modules/secp256k1/build
414  [01/05/2018 01:32PM]: > [email protected] install /pkg/src/browser-laptop/node_modules/spectron/node_modules/electron-chromedriver
415  [01/05/2018 01:32PM]: > node ./download-chromedriver.js
416  [01/05/2018 01:32PM]: > [email protected] install /pkg/src/browser-laptop/node_modules/electron-chromedriver
417  [01/05/2018 01:32PM]: > [email protected] install /pkg/src/browser-laptop/node_modules/keytar
418  [01/05/2018 01:33PM]: make: Entering directory /pkg/src/browser-laptop/node_modules/keytar/build
419  [01/05/2018 01:33PM]:   CXX(target) Release/obj.target/keytar/src/main.o
420  [01/05/2018 01:33PM]:   CXX(target) Release/obj.target/keytar/src/keytar_posix.o
421  [01/05/2018 01:33PM]:   SOLINK_MODULE(target) Release/obj.target/keytar.node
422  [01/05/2018 01:33PM]:   COPY Release/keytar.node
423  [01/05/2018 01:33PM]: make: Leaving directory /pkg/src/browser-laptop/node_modules/keytar/build
424  [01/05/2018 01:33PM]: > [email protected] install /pkg/src/browser-laptop/node_modules/nsp/node_modules/git-validate
425  [01/05/2018 01:33PM]: > [email protected] install /pkg/src/browser-laptop/node_modules/pre-commit
426  [01/05/2018 01:33PM]: (node:1181) MaxListenersExceededWarning: Possible EventEmitter memory leak detected. 11 SIGINT listeners added. Use emitter.setMaxListeners() to increase limit
427  [01/05/2018 01:33PM]: pre-commit: Detected an existing git pre-commit hook
428  [01/05/2018 01:33PM]: pre-commit: Old pre-commit hook backuped to pre-commit.old
429  [01/05/2018 01:33PM]: > [email protected] install /pkg/src/browser-laptop/node_modules/pre-push
430  [01/05/2018 01:33PM]: pre-push: Detected an existing git pre-push hook
431  [01/05/2018 01:33PM]: pre-push: Old pre-push hook backuped to pre-push.old
432  [01/05/2018 01:33PM]: > [email protected] postinstall /pkg/src/browser-laptop/node_modules/bat-publisher/node_modules/tldjs
433  [01/05/2018 01:33PM]: > node ./bin/postinstall.js
434  [01/05/2018 01:33PM]: > [email protected] postinstall /pkg/src/browser-laptop/node_modules/spawn-sync
435  [01/05/2018 01:33PM]: > [email protected] postinstall /pkg/src/browser-laptop/node_modules/electron-prebuilt
436  [01/05/2018 01:33PM]: Downloading brave-v4.5.13-linux-x64.zip
437  [01/05/2018 01:33PM]: [>                                            ] 0.0% (0 B/s)
438  [01/05/2018 01:33PM]: Downloading brave-v4.5.13-linux-x64.zip
439  [01/05/2018 01:33PM]: [>                                            ] 0.0% of 54.91 MB (0 B/s)
440  [01/05/2018 01:33PM]: [>                                            ] 0.4% of 54.91 MB (224.79 kB/s)
441  [01/05/2018 01:33PM]: [>                                            ] 1.3% of 54.91 MB (729.62 kB/s)
442  [01/05/2018 01:33PM]: [>                                            ] 3.4% of 54.91 MB (1.47 MB/s)
443  [01/05/2018 01:33PM]: [==>                                          ] 7.5% of 54.91 MB (2.74 MB/s)
444  [01/05/2018 01:33PM]: [=====>                                       ] 14.8% of 54.91 MB (4.66 MB/s)
445  [01/05/2018 01:33PM]: [==========>                                  ] 26.0% of 54.91 MB (7.13 MB/s)
446  [01/05/2018 01:33PM]: [===================>                         ] 46.0% of 54.91 MB (11.22 MB/s)
447  [01/05/2018 01:33PM]: [==========================>                  ] 61.7% of 54.91 MB (13.56 MB/s)
448  [01/05/2018 01:33PM]: [===========================>                 ] 64.3% of 54.91 MB (12.83 MB/s)
449  [01/05/2018 01:33PM]: [==============================>              ] 70.4% of 54.91 MB (12.88 MB/s)
450  [01/05/2018 01:33PM]: [====================================>        ] 82.8% of 54.91 MB (13.99 MB/s)
451  [01/05/2018 01:33PM]: [============================================>] 100.0% of 54.91 MB (15.69 MB/s)
452  [01/05/2018 01:33PM]: > [email protected] postinstall /pkg/src/browser-laptop/node_modules/flow-bin
453  [01/05/2018 01:33PM]:   ✔ flow binary test passed successfully
454  [01/05/2018 01:33PM]: > [email protected] postinstall /pkg/src/browser-laptop
455  [01/05/2018 01:33PM]: > npm run download-sync-client && webpack
456  [01/05/2018 01:33PM]: > [email protected] download-sync-client /pkg/src/browser-laptop
457  [01/05/2018 01:33PM]: > node ./tools/downloadSyncClient
458  [01/05/2018 01:33PM]: writing sync bundle to /pkg/src/browser-laptop/app/extensions/brave/content/scripts/sync.js
459  [01/05/2018 01:33PM]: Hash: 0ad761d47f91d5260fb7db008d581aaf341525fada8873207db89a05aecd
460  [01/05/2018 01:33PM]:     Hash: 0ad761d47f91d5260fb7
461  [01/05/2018 01:33PM]:     Version: webpack 1.15.0
462  [01/05/2018 01:33PM]:                                      Asset       Size  Chunks             Chunk Names
463  [01/05/2018 01:33PM]:       de46bc0216c15ce3302139b3c2af4884.svg  789 bytes          [emitted]
464  [01/05/2018 01:33PM]:       41943a7d37ac5c61823a2a17c4e06070.svg  733 bytes          [emitted]
465  [01/05/2018 01:33PM]:     af7ae505a9eed503f8b8e6982036873e.woff2    77.2 kB          [emitted]
466  [01/05/2018 01:33PM]:      fee66e712a8a08eef5805a46892932ad.woff      98 kB          [emitted]
467  [01/05/2018 01:33PM]:       b06871f281fee6b241d60582ae9369b9.ttf     166 kB          [emitted]
468  [01/05/2018 01:33PM]:       912ec66d7572ff821749319396470bde.svg     444 kB          [emitted]
469  [01/05/2018 01:33PM]:       2ad15189f9772058209b9036ebf8bda1.svg    1.34 kB          [emitted]
470  [01/05/2018 01:33PM]:       292a09c3abb7e423680bb8be4de82460.svg  768 bytes          [emitted]
471  [01/05/2018 01:33PM]:       f9c5944d81cb03f5601faa8815856fc4.svg     1.3 kB          [emitted]
472  [01/05/2018 01:33PM]:       a42c3b4a1de787c14f05edf1ec49c9fd.svg    1.72 kB          [emitted]
473  [01/05/2018 01:33PM]:       dfd0990bd610a78a34d31bd751d140bd.svg    1.72 kB          [emitted]
474  [01/05/2018 01:33PM]:       b6dd4b1292cfd4470e58486c56ad0832.svg    3.69 kB          [emitted]
475  [01/05/2018 01:33PM]:       f3b9223a9b686682b28b618d9f28817e.svg  792 bytes          [emitted]
476  [01/05/2018 01:33PM]:       59023652f84793c67f7775cea1b33195.svg  670 bytes          [emitted]
477  [01/05/2018 01:33PM]:       fbb1a0acb7d12f9e64c82a8cc82aeb66.svg  615 bytes          [emitted]
478  [01/05/2018 01:33PM]:       7e57f5ffe33356122ffb083eecf8f2cf.svg    1.13 kB          [emitted]
479  [01/05/2018 01:33PM]:       ab6512b7dac5700b20f7de361aa47884.svg    1.03 kB          [emitted]
480  [01/05/2018 01:33PM]:       aa1e37293df5a3c347ea3784959aa105.svg  776 bytes          [emitted]
481  [01/05/2018 01:33PM]:       d50f42f7ea312cabab88d8eda5bb14a9.svg    2.88 kB          [emitted]
482  [01/05/2018 01:33PM]:       24e964b96ac35120541941897f6a01e3.svg  869 bytes          [emitted]
483  [01/05/2018 01:33PM]:       222f169694e4d1e956fce5a4fb5ad23d.svg  626 bytes          [emitted]
484  [01/05/2018 01:33PM]:       e606b7f6bbecaced0044c1052a99b7a9.svg    1.06 kB          [emitted]
485  [01/05/2018 01:33PM]:       eb1972095e43719a327e7fc4dd7691a4.svg    1.82 kB          [emitted]
486  [01/05/2018 01:33PM]:       7e7925a41b22d080e00c8d7309745420.svg  378 bytes          [emitted]
487  [01/05/2018 01:33PM]:       196262d2122e55e514d47f9e44b66520.svg  431 bytes          [emitted]
488  [01/05/2018 01:33PM]:       4bb98a05900622845d2e66b433711e32.png    2.93 kB          [emitted]
489  [01/05/2018 01:33PM]:       b6190b89305d7ca6eb2b6a84fb68d7bf.png     2.7 kB          [emitted]
490  [01/05/2018 01:33PM]:       4126c044e93c3caa1faaca0f4ec04e1e.png    11.1 kB          [emitted]
491  [01/05/2018 01:33PM]:       80c2dca1e4c4e1e3f495563a6952ee12.png    25.1 kB          [emitted]
492  [01/05/2018 01:33PM]:       4134ecd741d7d7b79fd1bb41ca3ad4d5.svg  472 bytes          [emitted]
493  [01/05/2018 01:33PM]:       89f9f5560225e5eee776ab6ae8f9f0b3.svg  840 bytes          [emitted]
494  [01/05/2018 01:33PM]:       f5ff01ecdaca34dc1cac01191958b4b3.svg  494 bytes          [emitted]
495  [01/05/2018 01:33PM]:       adc4e1913e1d98de46263c2dad9b914c.svg  820 bytes          [emitted]
496  [01/05/2018 01:33PM]:       bd7efdfbcb45f934ff13bfe5f5de5330.svg  990 bytes          [emitted]
497  [01/05/2018 01:33PM]:       e877f09f64a2ce7ec153e0efdd4ed1a1.svg  861 bytes          [emitted]
498  [01/05/2018 01:33PM]:       21db55dd9ae45888ef8d007135d7e243.svg    1.56 kB          [emitted]
499  [01/05/2018 01:33PM]:       d7876d48e80112e766d737346a616707.svg     1.5 kB          [emitted]
500  [01/05/2018 01:33PM]:       247d2a2d16b90d7364981e7224620a2a.svg  976 bytes          [emitted]
501  [01/05/2018 01:33PM]:       c74aae1d7c31e27b75eb9c779b6fab4c.svg    1.03 kB          [emitted]
502  [01/05/2018 01:33PM]:       674f50d287a8c48dc19ba404d20fe713.eot     166 kB          [emitted]
503  [01/05/2018 01:33PM]:       14ad83ede0f899bd6a66a37194df85c6.svg  934 bytes          [emitted]
504  [01/05/2018 01:33PM]:       493bc2b131dc439f27e05c4d3f4e93e7.png    12.1 kB          [emitted]
505  [01/05/2018 01:33PM]:       392507919f6ec931361b489a56c65ce9.svg  816 bytes          [emitted]
506  [01/05/2018 01:33PM]:       d5a535fdec793b2b9219ef7abfa185ce.svg  205 bytes          [emitted]
507  [01/05/2018 01:33PM]:       5ccced21c6505bfab561c1e015e407e1.svg  239 bytes          [emitted]
508  [01/05/2018 01:33PM]:       23b20b72da217563c4304c07c5206dd0.svg  213 bytes          [emitted]
509  [01/05/2018 01:33PM]:       e008bf562e79f9e1fd5110df9d61627d.svg  355 bytes          [emitted]
510  [01/05/2018 01:33PM]:       c11dbc2db4c1e34f10ac562b48e1d886.svg  289 bytes          [emitted]
511  [01/05/2018 01:33PM]:       430b679826c6e11b1767e7e05649e028.svg  615 bytes          [emitted]
512  [01/05/2018 01:33PM]:       2e7aa1b656ba910260191a20406af15f.svg  618 bytes          [emitted]
513  [01/05/2018 01:33PM]:       38ad268f3a41dc9191cc26857537e4c1.svg  452 bytes          [emitted]
514  [01/05/2018 01:33PM]:       a60b6ab6aaca89b5627cee5fb224ce64.svg  438 bytes          [emitted]
515  [01/05/2018 01:33PM]:       f88876b2519c8cbda6ef6fa17e83eeff.svg  687 bytes          [emitted]
516  [01/05/2018 01:33PM]:       bc90457507bcff2412ad0d500d7f92a9.svg  693 bytes          [emitted]
517  [01/05/2018 01:33PM]:       b6fb7a0b51d3af832d445c02e46d434d.png    2.13 kB          [emitted]
518  [01/05/2018 01:33PM]:       a34dd95ecb584ddb353a854a069d89a1.png    18.1 kB          [emitted]
519  [01/05/2018 01:33PM]:       0c4a088449e73ec59b36bb111c7e03b5.png    5.91 kB          [emitted]
520  [01/05/2018 01:33PM]:       69e1af008c893d635dabe4b7feb5f366.png    2.39 kB          [emitted]
521  [01/05/2018 01:33PM]:       51a0855604244165c58b5867df7d5676.png    4.69 kB          [emitted]
522  [01/05/2018 01:33PM]:       1be94b6e3fe1720c770ab40ab0c71cbe.png    7.22 kB          [emitted]
523  [01/05/2018 01:33PM]:       cd1a406ba824513a8d92a2e1418a2977.svg  418 bytes          [emitted]
524  [01/05/2018 01:33PM]:       1acaa76443941825560798bdb3936bf9.svg  437 bytes          [emitted]
525  [01/05/2018 01:33PM]:       3bad0d188335cbfe4a29bd448fa4d0e3.svg  430 bytes          [emitted]
526  [01/05/2018 01:33PM]:       f8aa9b15e2d849c26e84ec0dba7bebae.svg    1.27 kB          [emitted]
527  [01/05/2018 01:33PM]:       cbba55184f62c3df8728928b9016f9d7.svg     1.7 kB          [emitted]
528  [01/05/2018 01:33PM]:       1d10887913956d5ffe996a035b489730.svg    1.51 kB          [emitted]
529  [01/05/2018 01:33PM]:       df9d90f487acc18337a62e10623a2d87.svg    1.21 kB          [emitted]
530  [01/05/2018 01:33PM]:       4816047e6c690868e2f2dfb972e11263.svg    1.09 kB          [emitted]
531  [01/05/2018 01:33PM]:       e27fa9769059ed125a576fe851592410.svg  671 bytes          [emitted]
532  [01/05/2018 01:33PM]:       dafa0bbc64a10f10d65c8eadadd14c0a.svg  890 bytes          [emitted]
533  [01/05/2018 01:33PM]:       dba2dc28147a6dc7176d68287cb3fb74.svg    2.66 kB          [emitted]
534  [01/05/2018 01:33PM]:       8c9c38b16d3e35299481600c10f9bd19.svg  823 bytes          [emitted]
535  [01/05/2018 01:33PM]:       e61458fc4b59fafd5f6bb3a25b6d94ff.svg  824 bytes          [emitted]
536  [01/05/2018 01:33PM]:       f70c25409713b4132e79b004c03ef3cb.svg  428 bytes          [emitted]
537  [01/05/2018 01:33PM]:                        aboutPages.entry.js     4.2 MB       0  [emitted]  aboutPages
538  [01/05/2018 01:33PM]:                               app.entry.js    3.32 MB       1  [emitted]  app
539  [01/05/2018 01:33PM]:                    aboutPages.entry.js.map    5.62 MB       0  [emitted]  aboutPages
540  [01/05/2018 01:33PM]:                           app.entry.js.map     4.6 MB       1  [emitted]  app
541  [01/05/2018 01:33PM]:        [0] multi app 28 bytes {1} [built]
542  [01/05/2018 01:33PM]:        [0] multi aboutPages 28 bytes {0} [built]
543  [01/05/2018 01:33PM]:         + 919 hidden modules
544  [01/05/2018 01:33PM]:     Hash: db008d581aaf341525fa
545  [01/05/2018 01:33PM]:                   Asset    Size  Chunks             Chunk Names
546  [01/05/2018 01:33PM]:         lib.devTools.js  717 kB       0  [emitted]  devTools
547  [01/05/2018 01:33PM]:     lib.devTools.js.map  952 kB       0  [emitted]  devTools
548  [01/05/2018 01:33PM]:        [0] multi devTools 28 bytes {0} [built]
549  [01/05/2018 01:33PM]:         + 54 hidden modules
550  [01/05/2018 01:33PM]:     Hash: da8873207db89a05aecd
551  [01/05/2018 01:33PM]:                    webtorrentPage.entry.js     1.4 MB       0  [emitted]  main
552  [01/05/2018 01:33PM]:                webtorrentPage.entry.js.map    1.72 MB       0  [emitted]  main
553  [01/05/2018 01:33PM]:        [0] multi main 28 bytes {0} [built]
554  [01/05/2018 01:33PM]: npm WARN optional SKIPPING OPTIONAL DEPENDENCY: [email protected] (node_modules/7zip-bin-mac):
555  [01/05/2018 01:33PM]: npm WARN notsup SKIPPING OPTIONAL DEPENDENCY: Unsupported platform for [email protected]: wanted {os:darwin,arch:any} (current: {os:linux,arch:x64})
556  [01/05/2018 01:33PM]: npm WARN optional SKIPPING OPTIONAL DEPENDENCY: [email protected] (node_modules/fsevents):
557  [01/05/2018 01:33PM]: npm WARN notsup SKIPPING OPTIONAL DEPENDENCY: Unsupported platform for [email protected]: wanted {os:darwin,arch:any} (current: {os:linux,arch:x64})
558  [01/05/2018 01:33PM]: added 2317 packages in 179.626s
559  [01/05/2018 01:33PM]: > [email protected] build-package /pkg/src/browser-laptop
560  [01/05/2018 01:33PM]: > node ./tools/buildPackage.js
561  [01/05/2018 01:33PM]: Building version 0.19.80 in Brave-linux-x64 with Electron 4.5.13
562  [01/05/2018 01:33PM]: echo cleaning up target...&&rm -Rf Brave-linux-x64&&rm -Rf dist&&rm -f Brave.tar.bz2&&echo done&&echo starting build...&&./node_modules/.bin/webpack&&npm run checks&&node ./node_modules/electron-packager/cli.js . Brave --overwrite --ignore=pre-commit|pre-push|test/|docs/|tools/|signcode-tf|rx|nslog|eslint|cppunitlite|caniuse-db|cross-env|spectron|\.(0|13ctype|APACHE2|BSD|DOCS|DS_Store|LESSER|Makefile|a|ac|aff|after|am|arcconfig|arclint|babelrc|bat|before|bnf|brave-gyp|c|cardinalrc|cc|cfg|closure-compiler|cmake|cmd|covignore|cpp|csv|cxx|d|def|deps|dic|dll|dntrc|dockerignore|dsp|editorconfig|editorconfig~|el|enc|entitlements|eot|esprima|flow|flowconfig|gitattributes|githug|gitignore|gitattributes|gitignore|gitkeep|gitmodules|gnu|gradle|gyp|gypi|gz|h|hbs|hxx|idl|iml|in|inc|include|info|jade|java|jsfmtrc|jshint|jshintignore|jshintrc|jslintrc|jst|js~|keep|lint|lintignore|lock|log|ls|m4|mailmap|map|markdown|md|mdown|md~|mem|min-wd|mk|mkd|mm|mustache|myspell|myspell|name|nsh|nsi|nsprc|nuspec|nvmrc|o|old|orig|otf|param|patch|pegjs|post|pre|pro|py|rej|s|sage|scss|settings|sh|skip|source-map|stamp|swo|tap|targ|template|tern-port|tern-project|testignore|tm_properties|tmp|tpl|ts|txt|un~|vscode|xcf|xml|yaml|yml)$|/deps/|Release/obj|obj.target|ad-block/(node_modules|test|perf|sample|scripts|test|vendor|ABPFilterParserData.dat)|tracking-protection/(node_modules|test|data|scripts|vendor)|tracking-protection/build/node_modules|tracking-protection/build/Release/(sample.exe|test.exe)|sqlite3/src|nsp/node_modules|electron-installer-squirrel-windows|electron-chromedriver|electron-installer-debian|node-notifier/vendor|node-gyp|npm|jsdoc|docs|sinon|electron-download|electron-rebuild|electron-packager|electron-builder|electron-prebuilt|electron-rebuild|electron-winstaller-fixed|muon-winstaller|electron-installer-redhat|flow-bin|babel$|babel-(?!polyfill|regenerator-runtime|preset-env)|jsdom-global|react-addons-perf|react-addons-test-utils|enzyme|git-rev-sync|sqlite3|uglify-js|webdriverio|webpack-dev-server --platform=linux --arch=x64 --version=4.5.13 --icon=res/app.png --asar=true --app-version=0.19.80 --build-version=4.5.13 --protocol=http --protocol-name=HTTP Handler --protocol=https --protocol-name=HTTPS Handler --product-dir-name=brave --version-string.CompanyName=Brave Software --version-string.ProductName=Brave --version-string.Copyright=Copyright 2017, Brave Software --version-string.FileDescription=Brave&&mv Brave-linux-x64/Brave Brave-linux-x64/brave&&ncp ./app/extensions Brave-linux-x64/resources/extensions&&mkdirp Brave-linux-x64/resources/app.asar.unpacked/node_modules/node-anonize2-relic-emscripten&&ncp node_modules/node-anonize2-relic-emscripten/anonize2.js.mem Brave-linux-x64/resources/app.asar.unpacked/node_modules/node-anonize2-relic-emscripten/anonize2.js.mem
563  [01/05/2018 01:34PM]: Hash: 0673606d35680cc10839ed3ba6c84a03a643f880344503f66c6a3ab49da8
564  [01/05/2018 01:34PM]:     Hash: 0673606d35680cc10839
565  [01/05/2018 01:34PM]:                        aboutPages.entry.js    4.14 MB       0  [emitted]  aboutPages
566  [01/05/2018 01:34PM]:                               app.entry.js    3.28 MB       1  [emitted]  app
567  [01/05/2018 01:34PM]:                    aboutPages.entry.js.map    5.53 MB       0  [emitted]  aboutPages
568  [01/05/2018 01:34PM]:                           app.entry.js.map    4.55 MB       1  [emitted]  app
569  [01/05/2018 01:34PM]:     ERROR in aboutPages.entry.js from UglifyJs
570  [01/05/2018 01:34PM]:     SyntaxError: Name expected [./app/renderer/components/styles/global.js:5,6]
571  [01/05/2018 01:34PM]:     ERROR in app.entry.js from UglifyJs
572  [01/05/2018 01:34PM]:     Hash: ed3ba6c84a03a643f880
573  [01/05/2018 01:34PM]:     ERROR in lib.devTools.js from UglifyJs
574  [01/05/2018 01:34PM]:     SyntaxError: Unexpected token: operator (>) [./js/constants/config.js:46,13]
575  [01/05/2018 01:34PM]:     Hash: 344503f66c6a3ab49da8
576  [01/05/2018 01:34PM]:                    webtorrentPage.entry.js    1.35 MB       0  [emitted]  main
577  [01/05/2018 01:34PM]:                webtorrentPage.entry.js.map    1.66 MB       0  [emitted]  main
578  [01/05/2018 01:34PM]:     ERROR in webtorrentPage.entry.js from UglifyJs
579  [01/05/2018 01:34PM]:     SyntaxError: Name expected [./app/renderer/components/styles/commonStyles.js:5,6]
580  [01/05/2018 01:34PM]: > [email protected] checks /pkg/src/browser-laptop
581  [01/05/2018 01:34PM]: > [email protected] check-security /pkg/src/browser-laptop
582  [01/05/2018 01:34PM]: (+) 8 vulnerabilities found
583  [01/05/2018 01:34PM]: ┌───────────────┬─────────────────────────────────────────────────────────────────┐
584  [01/05/2018 01:34PM]: │               │ Regular Expression Denial of Service                            │
585  [01/05/2018 01:34PM]: ├───────────────┼─────────────────────────────────────────────────────────────────┤
586  [01/05/2018 01:34PM]: │ Name          │ moment                                                          │
587  [01/05/2018 01:34PM]: │ CVSS          │ 7.5 (High)588  [01/05/2018 01:34PM]: │ Patched       │ >=2.19.3                                                        │
589  [01/05/2018 01:34PM]: │ Path          │ [email protected] > [email protected] > [email protected] > [email protected]… │
590  [01/05/2018 01:34PM]: │ More Info     │ https://nodesecurity.io/advisories/532                          │
591  [01/05/2018 01:34PM]: └───────────────┴─────────────────────────────────────────────────────────────────┘
592  [01/05/2018 01:34PM]: │ Path          │ [email protected] > [email protected] > [email protected] > meta… │
593  [01/05/2018 01:34PM]: │ Path          │ [email protected] > [email protected] > [email protected]… │
594  [01/05/2018 01:34PM]: │ Path          │ [email protected] > [email protected] > [email protected] > chro… │
595  [01/05/2018 01:34PM]: │ Path          │ [email protected] > [email protected]596  [01/05/2018 01:34PM]: │               │ Denial of Service                                               │
597  [01/05/2018 01:34PM]: │ Vulnerable    │ <1.1.5 || >=2.0.0 <3.3.1                                        │
598  [01/05/2018 01:34PM]: │ Patched       │ >= 1.1.5 <2.0.0 || >=3.3.1                                      │
599  [01/05/2018 01:34PM]: │ Path          │ [email protected] > [email protected] > [email protected] > [email protected]… │
600  [01/05/2018 01:34PM]: │ More Info     │ https://nodesecurity.io/advisories/550                          │
601  [01/05/2018 01:34PM]: │ Path          │ [email protected] > [email protected] > [email protected] >… │
602  [01/05/2018 01:34PM]: npm ERR! [email protected] check-security: `nsp check`
603  [01/05/2018 01:34PM]: npm ERR! Failed at the [email protected] check-security script.
604  [01/05/2018 01:34PM]: npm ERR! This is probably not a problem with npm. There is likely additional logging output above.
605  [01/05/2018 01:34PM]: npm ERR! A complete log of this run can be found in:
606  [01/05/2018 01:34PM]: npm ERR!     /pkg/src/.npm/_logs/2018-01-05T19_34_44_596Z-debug.log
607  [01/05/2018 01:34PM]: npm ERR! [email protected] checks: `npm run check-security`
608  [01/05/2018 01:34PM]: npm ERR! Failed at the [email protected] checks script.
609  [01/05/2018 01:34PM]: npm ERR!     /pkg/src/.npm/_logs/2018-01-05T19_34_44_606Z-debug.log
610  [01/05/2018 01:34PM]: buildPackage failed { Error: Command failed: echo cleaning up target...&&rm -Rf Brave-linux-x64&&rm -Rf dist&&rm -f Brave.tar.bz2&&echo done&&echo starting build...&&./node_modules/.bin/webpack&&npm run checks&&node ./node_modules/electron-packager/cli.js . Brave --overwrite --ignore=pre-commit|pre-push|test/|docs/|tools/|signcode-tf|rx|nslog|eslint|cppunitlite|caniuse-db|cross-env|spectron|\.(0|13ctype|APACHE2|BSD|DOCS|DS_Store|LESSER|Makefile|a|ac|aff|after|am|arcconfig|arclint|babelrc|bat|before|bnf|brave-gyp|c|cardinalrc|cc|cfg|closure-compiler|cmake|cmd|covignore|cpp|csv|cxx|d|def|deps|dic|dll|dntrc|dockerignore|dsp|editorconfig|editorconfig~|el|enc|entitlements|eot|esprima|flow|flowconfig|gitattributes|githug|gitignore|gitattributes|gitignore|gitkeep|gitmodules|gnu|gradle|gyp|gypi|gz|h|hbs|hxx|idl|iml|in|inc|include|info|jade|java|jsfmtrc|jshint|jshintignore|jshintrc|jslintrc|jst|js~|keep|lint|lintignore|lock|log|ls|m4|mailmap|map|markdown|md|mdown|md~|mem|min-wd|mk|mkd|mm|mustache|myspell|myspell|name|nsh|nsi|nsprc|nuspec|nvmrc|o|old|orig|otf|param|patch|pegjs|post|pre|pro|py|rej|s|sage|scss|settings|sh|skip|source-map|stamp|swo|tap|targ|template|tern-port|tern-project|testignore|tm_properties|tmp|tpl|ts|txt|un~|vscode|xcf|xml|yaml|yml)$|/deps/|Release/obj|obj.target|ad-block/(node_modules|test|perf|sample|scripts|test|vendor|ABPFilterParserData.dat)|tracking-protection/(node_modules|test|data|scripts|vendor)|tracking-protection/build/node_modules|tracking-protection/build/Release/(sample.exe|test.exe)|sqlite3/src|nsp/node_modules|electron-installer-squirrel-windows|electron-chromedriver|electron-installer-debian|node-notifier/vendor|node-gyp|npm|jsdoc|docs|sinon|electron-download|electron-rebuild|electron-packager|electron-builder|electron-prebuilt|electron-rebuild|electron-winstaller-fixed|muon-winstaller|electron-installer-redhat|flow-bin|babel$|babel-(?!polyfill|regenerator-runtime|preset-env)|jsdom-global|react-addons-perf|react-addons-test-utils|enzyme|git-rev-sync|sqlite3|uglify-js|webdriverio|webpack-dev-server --platform=linux --arch=x64 --version=4.5.13 --icon=res/app.png --asar=true --app-version=0.19.80 --build-version=4.5.13 --protocol=http --protocol-name=HTTP Handler --protocol=https --protocol-name=HTTPS Handler --product-dir-name=brave --version-string.CompanyName=Brave Software --version-string.ProductName=Brave --version-string.Copyright=Copyright 2017, Brave Software --version-string.FileDescription=Brave&&mv Brave-linux-x64/Brave Brave-linux-x64/brave&&ncp ./app/extensions Brave-linux-x64/resources/extensions&&mkdirp Brave-linux-x64/resources/app.asar.unpacked/node_modules/node-anonize2-relic-emscripten&&ncp node_modules/node-anonize2-relic-emscripten/anonize2.js.mem Brave-linux-x64/resources/app.asar.unpacked/node_modules/node-anonize2-relic-emscripten/anonize2.js.mem
611  [01/05/2018 01:34PM]:     at ChildProcess.exithandler (child_process.js:272:12)
612  [01/05/2018 01:34PM]:     at ChildProcess.emit (events.js:159:13)
613  [01/05/2018 01:34PM]:     at maybeClose (internal/child_process.js:943:16)
614  [01/05/2018 01:34PM]:     at Process.ChildProcess._handle.onexit (internal/child_process.js:220:5)
615  [01/05/2018 01:34PM]:   cmd: echo cleaning up target...&&rm -Rf Brave-linux-x64&&rm -Rf dist&&rm -f Brave.tar.bz2&&echo done&&echo starting build...&&./node_modules/.bin/webpack&&npm run checks&&node ./node_modules/electron-packager/cli.js . Brave --overwrite --ignore=pre-commit|pre-push|test/|docs/|tools/|signcode-tf|rx|nslog|eslint|cppunitlite|caniuse-db|cross-env|spectron|\\.(0|13ctype|APACHE2|BSD|DOCS|DS_Store|LESSER|Makefile|a|ac|aff|after|am|arcconfig|arclint|babelrc|bat|before|bnf|brave-gyp|c|cardinalrc|cc|cfg|closure-compiler|cmake|cmd|covignore|cpp|csv|cxx|d|def|deps|dic|dll|dntrc|dockerignore|dsp|editorconfig|editorconfig~|el|enc|entitlements|eot|esprima|flow|flowconfig|gitattributes|githug|gitignore|gitattributes|gitignore|gitkeep|gitmodules|gnu|gradle|gyp|gypi|gz|h|hbs|hxx|idl|iml|in|inc|include|info|jade|java|jsfmtrc|jshint|jshintignore|jshintrc|jslintrc|jst|js~|keep|lint|lintignore|lock|log|ls|m4|mailmap|map|markdown|md|mdown|md~|mem|min-wd|mk|mkd|mm|mustache|myspell|myspell|name|nsh|nsi|nsprc|nuspec|nvmrc|o|old|orig|otf|param|patch|pegjs|post|pre|pro|py|rej|s|sage|scss|settings|sh|skip|source-map|stamp|swo|tap|targ|template|tern-port|tern-project|testignore|tm_properties|tmp|tpl|ts|txt|un~|vscode|xcf|xml|yaml|yml)$|/deps/|Release/obj|obj.target|ad-block/(node_modules|test|perf|sample|scripts|test|vendor|ABPFilterParserData.dat)|tracking-protection/(node_modules|test|data|scripts|vendor)|tracking-protection/build/node_modules|tracking-protection/build/Release/(sample.exe|test.exe)|sqlite3/src|nsp/node_modules|electron-installer-squirrel-windows|electron-chromedriver|electron-installer-debian|node-notifier/vendor|node-gyp|npm|jsdoc|docs|sinon|electron-download|electron-rebuild|electron-packager|electron-builder|electron-prebuilt|electron-rebuild|electron-winstaller-fixed|muon-winstaller|electron-installer-redhat|flow-bin|babel$|babel-(?!polyfill|regenerator-runtime|preset-env)|jsdom-global|react-addons-perf|react-addons-test-utils|enzyme|git-rev-sync|sqlite3|uglify-js|webdriverio|webpack-dev-server --platform=linux --arch=x64 --version=4.5.13 --icon=res/app.png --asar=true --app-version=0.19.80 --build-version=4.5.13 --protocol=http --protocol-name=HTTP Handler --protocol=https --protocol-name=HTTPS Handler --product-dir-name=brave --version-string.CompanyName=Brave Software --version-string.ProductName=Brave --version-string.Copyright=Copyright 2017, Brave Software --version-string.FileDescription=Brave&&mv Brave-linux-x64/Brave Brave-linux-x64/brave&&ncp ./app/extensions Brave-linux-x64/resources/extensions&&mkdirp Brave-linux-x64/resources/app.asar.unpacked/node_modules/node-anonize2-relic-emscripten&&ncp node_modules/node-anonize2-relic-emscripten/anonize2.js.mem Brave-linux-x64/resources/app.asar.unpacked/node_modules/node-anonize2-relic-emscripten/anonize2.js.mem }
616  [01/05/2018 01:34PM]: npm ERR! [email protected] build-package: `node ./tools/buildPackage.js`
617  [01/05/2018 01:34PM]: npm ERR! Failed at the [email protected] build-package script.
618  [01/05/2018 01:34PM]: npm ERR!     /pkg/src/.npm/_logs/2018-01-05T19_34_44_627Z-debug.log
619  [01/05/2018 01:34PM]: ==> ERROR: A failure occurred in build().
620  [01/05/2018 01:34PM]: rm: cannot remove **.pkg.**: No such file or directory
621  [01/05/2018 01:34PM]: [\^/\^/^\^/^\^/\^/\^/^\^/^\^/]  BUILD FAILED  [\^/\^/^\^/^\^/\^/\^/^\^/^\^/]