Build Record

Build Number: 7759

Transaction: 3835
Package: brave
Version: 0.19.122dev-1
Start: 02/07/2018 04:10PM
Finish: 02/07/2018 04:15PM
Result: failed

Build Log

  1 [02/07/2018 04:11PM]: [\^/\^/^\^/^\^/\^/\^/^\^/^\^/]  SETTING UP ENVIRONMENT  [\^/\^/^\^/^\^/\^/\^/^\^/^\^/]
  2  [02/07/2018 04:11PM]: [\^/\^/^\^/^\^/\^/\^/^\^/^\^/]  ADDING UPSTREAM PGP KEYS TO KEYRING  [\^/\^/^\^/^\^/\^/\^/^\^/^\^/]
  3  [02/07/2018 04:11PM]: gpg: WARNING: unsafe ownership on homedir /tmp/antbs/.gnupg
  4  [02/07/2018 04:11PM]: gpg: keybox /tmp/antbs/.gnupg/pubring.kbx created
  5  [02/07/2018 04:11PM]: gpg: key 23EFEFE93C4CFFFE: 1 signature not checked due to a missing key
  6  [02/07/2018 04:11PM]: gpg: /tmp/antbs/.gnupg/trustdb.gpg: trustdb created
  7  [02/07/2018 04:11PM]: gpg: key 23EFEFE93C4CFFFE: public key Italo A. Casas <[email protected]> imported
  8  [02/07/2018 04:11PM]: gpg: key B63B535A4C206CA9: 8 signatures not checked due to missing keys
  9  [02/07/2018 04:11PM]: gpg: key B63B535A4C206CA9: public key Evan Lucas <[email protected]> imported
 10  [02/07/2018 04:11PM]: gpg: key E73BC641CC11F4C8: 14 signatures not checked due to missing keys
 11  [02/07/2018 04:11PM]: gpg: key E73BC641CC11F4C8: public key Myles Borins <[email protected]> imported
 12  [02/07/2018 04:11PM]: gpg: key C273792F7D83545D: 2 signatures not checked due to missing keys
 13  [02/07/2018 04:11PM]: gpg: key C273792F7D83545D: public key Rod Vagg <[email protected]> imported
 14  [02/07/2018 04:11PM]: gpg: key C97EC7A07EDE3FC1: 19 signatures not checked due to missing keys
 15  [02/07/2018 04:11PM]: gpg: key C97EC7A07EDE3FC1: public key keybase.io/jasnell <[email protected]> imported
 16  [02/07/2018 04:11PM]: gpg: key 09FE44734EB7990E: public key Jeremiah Senkpiel <[email protected]> imported
 17  [02/07/2018 04:11PM]: gpg: key 7434390BDBE9B9C5: public key Colin Ihrig <[email protected]> imported
 18  [02/07/2018 04:11PM]: gpg: key 61B7B526D98F0353: 24 signatures not checked due to missing keys
 19  [02/07/2018 04:11PM]: gpg: key 61B7B526D98F0353: public key Mozilla Software Releases <[email protected]> imported
 20  [02/07/2018 04:11PM]: gpg: key 61B7B526D98F0353: Mozilla Software Releases <[email protected]> not changed
 21  [02/07/2018 04:11PM]: gpg: no ultimately trusted keys found
 22  [02/07/2018 04:11PM]: gpg: Total number processed: 9
 23  [02/07/2018 04:11PM]: gpg:               imported: 8
 24  [02/07/2018 04:11PM]: gpg:              unchanged: 1
 25  [02/07/2018 04:11PM]: [\^/\^/^\^/^\^/\^/\^/^\^/^\^/]  SYNCING REPO DATABASES  [\^/\^/^\^/^\^/\^/\^/^\^/^\^/]
 26  [02/07/2018 04:11PM]: :: Synchronizing package databases...
 27  [02/07/2018 04:11PM]: downloading antergos-staging.db...
 28  [02/07/2018 04:11PM]: downloading antergos.db...
 29  [02/07/2018 04:11PM]: downloading core.db...
 30  [02/07/2018 04:11PM]: downloading community.db...
 31  [02/07/2018 04:11PM]: :: Starting full system upgrade...
 32  [02/07/2018 04:11PM]: looking for conflicting packages...
 33  [02/07/2018 04:11PM]: Packages (12) bash-4.4.018-1  gcc-7.3.0-1  gcc-libs-7.3.0-1  gnupg-2.2.4-2  iana-etc-20180131-1  iproute2-4.15.0-1  libsystemd-237.0-2  libtirpc-1.0.2-3  libtool-2.4.6+40+g6ca5e224-4  pacman-mirrorlist-20180203-1  systemd-237.0-2  systemd-sysvcompat-237.0-2
 34  [02/07/2018 04:11PM]: Total Download Size:    17.27 MiB
 35  [02/07/2018 04:11PM]: Total Installed Size:  262.01 MiB
 36  [02/07/2018 04:11PM]: Net Upgrade Size:        1.08 MiB
 37  [02/07/2018 04:11PM]: :: Proceed with installation? [Y/n]
 38  [02/07/2018 04:11PM]: downloading gcc-libs-7.3.0-1-x86_64.pkg.tar.xz...
 39  [02/07/2018 04:11PM]: downloading systemd-sysvcompat-237.0-2-x86_64.pkg.tar.xz...
 40  [02/07/2018 04:11PM]: checking package integrity...
 41  [02/07/2018 04:11PM]: checking for file conflicts...
 42  [02/07/2018 04:11PM]: :: Processing package changes...
 43  [02/07/2018 04:11PM]: New optional dependencies for gnupg
 44  [02/07/2018 04:11PM]: upgrading pacman-mirrorlist...
 45  [02/07/2018 04:11PM]: warning: /etc/pacman.d/mirrorlist installed as /etc/pacman.d/mirrorlist.pacnew
 46  [02/07/2018 04:11PM]: upgrading systemd-sysvcompat...
 47  [02/07/2018 04:11PM]: :: Running post-transaction hooks...
 48  [02/07/2018 04:11PM]: (1/5) Updating udev hardware database...
 49  [02/07/2018 04:11PM]: (2/5) Updating system user accounts...
 50  [02/07/2018 04:11PM]: (3/5) Creating temporary files...
 51  [02/07/2018 04:11PM]: (4/5) Arming ConditionNeedsUpdate...
 52  [02/07/2018 04:11PM]: (5/5) Updating the info directory file...
 53  [02/07/2018 04:11PM]: [\^/\^/^\^/^\^/\^/\^/^\^/^\^/]  TRYING BUILD  [\^/\^/^\^/^\^/\^/\^/^\^/^\^/]
 54  [02/07/2018 04:11PM]: [\^/\^/^\^/^\^/\^/\^/^\^/^\^/]  UPDATING SOURCE CHECKSUMS  [\^/\^/^\^/^\^/\^/\^/^\^/^\^/]
 55  [02/07/2018 04:11PM]: ==> Generating checksums for source files...
 56  [02/07/2018 04:11PM]: ==> Making package: brave 0.19.88dev-1 (Wed Feb  7 22:11:24 UTC 2018)
 57  [02/07/2018 04:11PM]: ==> Checking runtime dependencies...
 58  [02/07/2018 04:11PM]: ==> Installing missing dependencies...
 59  [02/07/2018 04:11PM]: :: There are 10 providers available for ttf-font:
 60  [02/07/2018 04:11PM]:    1) ttf-google-fonts-typewolf
 61  [02/07/2018 04:11PM]:    2) noto-fonts  3) noto-fonts-extra  4) ttf-bitstream-vera  5) ttf-croscore  6) ttf-dejavu  7) ttf-freefont
 62  [02/07/2018 04:11PM]:    8) ttf-droid  9) ttf-liberation  10) ttf-ubuntu-font-family
 63  [02/07/2018 04:11PM]: Enter a number (default=1):
 64  [02/07/2018 04:11PM]: warning: dependency cycle detected:
 65  [02/07/2018 04:11PM]: warning: harfbuzz will be installed before its freetype2 dependency
 66  [02/07/2018 04:11PM]: Packages (71) atk-2.26.1-1  avahi-0.7-4  cairo-1.15.10-1  compositeproto-0.4.2-3  damageproto-1.2.1-3  dbus-glib-0.110-1  fixesproto-5.0+9+g4292ec1-1  fontconfig-2.12.6+5+g665584a-1  freetype2-2.9-2  gdk-pixbuf2-2.36.11-1  graphite-1:1.3.10-1  gtk-update-icon-cache-3.22.26+161+g60750b3ffd-1  harfbuzz-1.7.5-1  hicolor-icon-theme-0.17-1  icu-60.2-1  inputproto-2.3.2-1  jasper-2.0.14-1  js-24.2.0-4  kbproto-1.0.7-1  libcroco-0.6.12+4+g9ad7287-1  libcups-2.2.6-4  libdaemon-0.14-3  libdatrie-0.2.10-2  libfontenc-1.1.3-1  libjpeg-turbo-1.5.3-1  libpng-1.6.34-2  librsvg-2:2.42.2-1  libthai-0.1.27-1  libtiff-4.0.9-1  libx11-1.6.5-1  libxau-1.0.8-3  libxcb-1.12-1  libxcomposite-0.4.4-2  libxcursor-1.1.15-1  libxdamage-1.1.4-3  libxdmcp-1.1.2-1  libxext-1.3.3-1  libxfixes-5.0.3-2  libxft-2.3.2-1  libxi-1.7.9-1  libxinerama-1.1.3-2  libxml2-2.9.7+4+g72182550-2  libxrandr-1.5.1-2  libxrender-0.9.10-1  lzo-2.10-1  nspr-4.18-1  pango-1.40.14-1  pixman-0.34.0-1  polkit-0.113+34+g29ba7af-1  randrproto-1.5.0-1  recordproto-1.14.2-2  renderproto-0.11.1-3  scrnsaverproto-1.2.2-2  shared-mime-info-1.9-1  xcb-proto-1.12-3  xextproto-7.3.0-1  xineramaproto-1.2.1-3  xorg-fonts-encodings-1.0.4-4  xorg-mkfontdir-1.0.7-8  xorg-mkfontscale-1.1.2-1  xproto-7.0.31-1  alsa-lib-1.1.5-1  desktop-file-utils-0.23-1  gconf-3.2.6-5  gtk2-2.24.32-1  libgnome-keyring-3.12.0-2  libnotify-0.7.7-1  libxss-1.2.2-2  libxtst-1.2.3-1  nss-3.35-1  ttf-google-fonts-typewolf-17.11.git+2e2caa2-1
 67  [02/07/2018 04:11PM]: Total Download Size:     0.14 MiB
 68  [02/07/2018 04:11PM]: Total Installed Size:  314.46 MiB
 69  [02/07/2018 04:11PM]: downloading libxi-1.7.9-1-x86_64.pkg.tar.xz...
 70  [02/07/2018 04:11PM]: Optional dependencies for harfbuzz
 71  [02/07/2018 04:11PM]:     cairo: hb-view program [pending]
 72  [02/07/2018 04:11PM]: warning: directory permissions differ on /var/
 73  [02/07/2018 04:11PM]: filesystem: 777  package: 755
 74  [02/07/2018 04:11PM]:   Fontconfig configuration is done via /etc/fonts/conf.avail and conf.d.
 75  [02/07/2018 04:11PM]:   Read /etc/fonts/conf.d/README for more information.
 76  [02/07/2018 04:11PM]:   Configuration via /etc/fonts/local.conf is still possible,
 77  [02/07/2018 04:11PM]:   but is no longer recommended for options available in conf.avail.
 78  [02/07/2018 04:11PM]:   Main systemwide configuration should be done by symlinks
 79  [02/07/2018 04:11PM]:   (especially for autohinting, sub-pixel and lcdfilter):
 80  [02/07/2018 04:11PM]:   ln -s ../conf.avail/XX-foo.conf
 81  [02/07/2018 04:11PM]:   Check also https://wiki.archlinux.org/index.php/Font_Configuration
 82  [02/07/2018 04:11PM]:   and https://wiki.archlinux.org/index.php/Fonts.
 83  [02/07/2018 04:11PM]: Rebuilding fontconfig cache... done.
 84  [02/07/2018 04:11PM]: Optional dependencies for libxcursor
 85  [02/07/2018 04:11PM]:     gnome-themes-standard: fallback icon theme
 86  [02/07/2018 04:11PM]: installing compositeproto...
 87  [02/07/2018 04:11PM]: installing shared-mime-info...
 88  [02/07/2018 04:11PM]: Optional dependencies for libtiff
 89  [02/07/2018 04:11PM]:     freeglut: for using tiffgt
 90  [02/07/2018 04:11PM]: Optional dependencies for avahi
 91  [02/07/2018 04:11PM]:     gtk3: avahi-discover, avahi-discover-standalone, bshell, bssh, bvnc
 92  [02/07/2018 04:11PM]:     gtk2: gtk2 bindings [pending]
 93  [02/07/2018 04:11PM]:     pygtk: avahi-bookmarks
 94  [02/07/2018 04:11PM]:     python2-twisted: avahi-bookmarks
 95  [02/07/2018 04:11PM]:     nss-mdns: NSS support for mDNS
 96  [02/07/2018 04:11PM]:     python-gobject: avahi-discover
 97  [02/07/2018 04:11PM]:     python-dbus: avahi-discover
 98  [02/07/2018 04:11PM]: Optional dependencies for jasper
 99  [02/07/2018 04:11PM]:     jasper-doc: documentation
100  [02/07/2018 04:11PM]: installing hicolor-icon-theme...
101  [02/07/2018 04:11PM]: installing gtk-update-icon-cache...
102  [02/07/2018 04:11PM]: installing desktop-file-utils...
103  [02/07/2018 04:11PM]: Optional dependencies for gtk2
104  [02/07/2018 04:11PM]:     gnome-themes-standard: Default widget theme
105  [02/07/2018 04:11PM]:     adwaita-icon-theme: Default icon theme
106  [02/07/2018 04:11PM]: Optional dependencies for alsa-lib
107  [02/07/2018 04:11PM]:     python2: for python smixer plugin [installed]
108  [02/07/2018 04:11PM]: installing xorg-fonts-encodings...
109  [02/07/2018 04:11PM]: installing xorg-mkfontscale...
110  [02/07/2018 04:11PM]: Creating X fontdir indices... done.
111  [02/07/2018 04:11PM]: installing ttf-google-fonts-typewolf...
112  [02/07/2018 04:11PM]: installing libgnome-keyring...
113  [02/07/2018 04:11PM]: Optional dependencies for libgnome-keyring
114  [02/07/2018 04:11PM]:     gnome-keyring: key storage service (or use any other service implementing org.freedesktop.secrets)
115  [02/07/2018 04:11PM]: ( 1/10) Updating fontconfig cache...
116  [02/07/2018 04:11PM]: ( 2/10) Probing GDK-Pixbuf loader modules...
117  [02/07/2018 04:11PM]: ( 3/10) Updating GIO module cache...
118  [02/07/2018 04:11PM]: ( 4/10) Probing GTK2 input method modules...
119  [02/07/2018 04:11PM]: ( 5/10) Updating icon theme caches...
120  [02/07/2018 04:11PM]: ( 6/10) Updating system user accounts...
121  [02/07/2018 04:11PM]: ( 7/10) Arming ConditionNeedsUpdate...
122  [02/07/2018 04:11PM]: ( 8/10) Updating the desktop file MIME type cache...
123  [02/07/2018 04:11PM]: ( 9/10) Updating the MIME type database...
124  [02/07/2018 04:11PM]: (10/10) Updating X fontdir indices...
125  [02/07/2018 04:11PM]: Packages (7) c-ares-1.13.0-1  http-parser-2.7.1-1  libuv-1.19.1-1  nodejs-9.5.0-1  openssl-1.0-1.0.2.n-1  semver-5.5.0-1  npm-5.6.0-1
126  [02/07/2018 04:11PM]: Total Installed Size:  45.90 MiB
127  [02/07/2018 04:11PM]: Optional dependencies for openssl-1.0
128  [02/07/2018 04:11PM]:     ca-certificates [installed]
129  [02/07/2018 04:11PM]: Optional dependencies for nodejs
130  [02/07/2018 04:11PM]:     npm: nodejs package manager [pending]
131  [02/07/2018 04:11PM]: Optional dependencies for npm
132  [02/07/2018 04:11PM]:     python2: for node-gyp [installed]
133  [02/07/2018 04:11PM]:   -> Cloning browser-laptop git repo...
134  [02/07/2018 04:11PM]: Cloning into bare repository /pkg/browser-laptop...
135  [02/07/2018 04:11PM]: ==> Validating source files with md5sums...
136  [02/07/2018 04:11PM]:     brave.desktop ... Passed
137  [02/07/2018 04:11PM]:     browser-laptop ... Skipped
138  [02/07/2018 04:11PM]:   -> Creating working copy of browser-laptop git repo...
139  [02/07/2018 04:11PM]: Cloning into browser-laptop...
140  [02/07/2018 04:11PM]: Switched to a new branch makepkg
141  [02/07/2018 04:12PM]: > [email protected] install /pkg/src/browser-laptop/node_modules/dtrace-provider
142  [02/07/2018 04:12PM]: > [email protected] install /pkg/src/browser-laptop/node_modules/sha3
143  [02/07/2018 04:12PM]: make: Entering directory /pkg/src/browser-laptop/node_modules/sha3/build
144  [02/07/2018 04:12PM]:   CXX(target) Release/obj.target/sha3/src/addon.o
145  [02/07/2018 04:12PM]: In file included from ../../nan/nan.h:192:0,
146  [02/07/2018 04:12PM]:                  from ../src/addon.cpp:4:
147  [02/07/2018 04:12PM]: ../../nan/nan_maybe_43_inl.h: In function Nan::Maybe<bool> Nan::ForceSet(v8::Local<v8::Object>, v8::Local<v8::Value>, v8::Local<v8::Value>, v8::PropertyAttribute):
148  [02/07/2018 04:12PM]: ../../nan/nan_maybe_43_inl.h:112:73: warning: v8::Maybe<bool> v8::Object::ForceSet(v8::Local<v8::Context>, v8::Local<v8::Value>, v8::Local<v8::Value>, v8::PropertyAttribute) is deprecated: Use CreateDataProperty / DefineOwnProperty [-Wdeprecated-declarations]
149  [02/07/2018 04:12PM]:    return obj->ForceSet(isolate->GetCurrentContext(), key, value, attribs);
150  [02/07/2018 04:12PM]:                                                                          ^
151  [02/07/2018 04:12PM]: In file included from /pkg/src/.node-gyp/4.5.15/deps/v8/include/v8.h:26:0,
152  [02/07/2018 04:12PM]:                  from /pkg/src/.node-gyp/4.5.15/src/node.h:42,
153  [02/07/2018 04:12PM]:                  from ../src/addon.cpp:1:
154  [02/07/2018 04:12PM]: /pkg/src/.node-gyp/4.5.15/deps/v8/include/v8.h:3115:29: note: declared here
155  [02/07/2018 04:12PM]:                  Maybe<bool> ForceSet(Local<Context> context, Local<Value> key,
156  [02/07/2018 04:12PM]:                              ^
157  [02/07/2018 04:12PM]: /pkg/src/.node-gyp/4.5.15/deps/v8/include/v8config.h:318:3: note: in definition of macro V8_DEPRECATED
158  [02/07/2018 04:12PM]:    declarator __attribute__((deprecated(message)))
159  [02/07/2018 04:12PM]: ../src/addon.cpp: In static member function static Nan::NAN_METHOD_RETURN_TYPE SHA3Hash::New(Nan::NAN_METHOD_ARGS_TYPE):
160  [02/07/2018 04:12PM]: ../src/addon.cpp:49:23: warning: new of type SHA3Hash with extended alignment 32 [-Waligned-new=]
161  [02/07/2018 04:12PM]: ../src/addon.cpp:49:23: note: uses void* operator new(std::size_t), which does not have an alignment parameter
162  [02/07/2018 04:12PM]: ../src/addon.cpp:49:23: note: use -faligned-new to enable C++17 over-aligned new support
163  [02/07/2018 04:12PM]: ../src/addon.cpp:59:58: warning: v8::Local<v8::Object> v8::Function::NewInstance(int, v8::Local<v8::Value>*) const is deprecated: Use maybe version [-Wdeprecated-declarations]
164  [02/07/2018 04:12PM]:     info.GetReturnValue().Set(cons->NewInstance(argc, argv));
165  [02/07/2018 04:12PM]:                                                           ^
166  [02/07/2018 04:12PM]: /pkg/src/.node-gyp/4.5.15/deps/v8/include/v8.h:3844:31: note: declared here
167  [02/07/2018 04:12PM]:                  Local<Object> NewInstance(int argc, Local<Value> argv[]) const);
168  [02/07/2018 04:12PM]:                                ^
169  [02/07/2018 04:12PM]:   CXX(target) Release/obj.target/sha3/src/displayIntermediateValues.o
170  [02/07/2018 04:12PM]:   CXX(target) Release/obj.target/sha3/src/KeccakF-1600-reference.o
171  [02/07/2018 04:12PM]:   CXX(target) Release/obj.target/sha3/src/KeccakNISTInterface.o
172  [02/07/2018 04:12PM]:   CXX(target) Release/obj.target/sha3/src/KeccakSponge.o
173  [02/07/2018 04:12PM]:   SOLINK_MODULE(target) Release/obj.target/sha3.node
174  [02/07/2018 04:12PM]: make: Leaving directory /pkg/src/browser-laptop/node_modules/sha3/build
175  [02/07/2018 04:12PM]: > [email protected] install /pkg/src/browser-laptop/node_modules/bufferutil
176  [02/07/2018 04:12PM]: > prebuild-install || node-gyp rebuild
177  [02/07/2018 04:12PM]: /pkg/src/browser-laptop/node_modules/node-abi/index.js:45
178  [02/07/2018 04:12PM]:   throw new Error(Could not detect abi for version  + target +  and runtime  + runtime + .  Updating node-abi might help solve this issue if it is a new release of  + runtime)
179  [02/07/2018 04:12PM]: Error: Could not detect abi for version 4.5.15 and runtime electron.  Updating node-abi might help solve this issue if it is a new release of electron
180  [02/07/2018 04:12PM]:     at getAbi (/pkg/src/browser-laptop/node_modules/node-abi/index.js:45:9)
181  [02/07/2018 04:12PM]:     at module.exports (/pkg/src/browser-laptop/node_modules/prebuild-install/rc.js:57:12)
182  [02/07/2018 04:12PM]:     at Object.<anonymous> (/pkg/src/browser-laptop/node_modules/prebuild-install/bin.js:9:25)
183  [02/07/2018 04:12PM]:     at Module._compile (module.js:660:30)
184  [02/07/2018 04:12PM]:     at Object.Module._extensions..js (module.js:671:10)
185  [02/07/2018 04:12PM]:     at Module.load (module.js:573:32)
186  [02/07/2018 04:12PM]:     at tryModuleLoad (module.js:513:12)
187  [02/07/2018 04:12PM]:     at Function.Module._load (module.js:505:3)
188  [02/07/2018 04:12PM]:     at Function.Module.runMain (module.js:701:10)
189  [02/07/2018 04:12PM]:     at startup (bootstrap_node.js:190:16)
190  [02/07/2018 04:12PM]: make: Entering directory /pkg/src/browser-laptop/node_modules/bufferutil/build
191  [02/07/2018 04:12PM]:   CXX(target) Release/obj.target/bufferutil/src/bufferutil.o
192  [02/07/2018 04:12PM]: In file included from ../node_modules/nan/nan.h:192:0,
193  [02/07/2018 04:12PM]:                  from ../src/bufferutil.cc:7:
194  [02/07/2018 04:12PM]: ../node_modules/nan/nan_maybe_43_inl.h: In function Nan::Maybe<bool> Nan::ForceSet(v8::Local<v8::Object>, v8::Local<v8::Value>, v8::Local<v8::Value>, v8::PropertyAttribute):
195  [02/07/2018 04:12PM]: ../node_modules/nan/nan_maybe_43_inl.h:112:73: warning: v8::Maybe<bool> v8::Object::ForceSet(v8::Local<v8::Context>, v8::Local<v8::Value>, v8::Local<v8::Value>, v8::PropertyAttribute) is deprecated: Use CreateDataProperty / DefineOwnProperty [-Wdeprecated-declarations]
196  [02/07/2018 04:12PM]:                  from ../node_modules/nan/nan.h:49,
197  [02/07/2018 04:12PM]:   SOLINK_MODULE(target) Release/obj.target/bufferutil.node
198  [02/07/2018 04:12PM]:   COPY Release/bufferutil.node
199  [02/07/2018 04:12PM]: make: Leaving directory /pkg/src/browser-laptop/node_modules/bufferutil/build
200  [02/07/2018 04:12PM]: > [email protected] install /pkg/src/browser-laptop/node_modules/leveldown
201  [02/07/2018 04:12PM]: make: Entering directory /pkg/src/browser-laptop/node_modules/leveldown/build
202  [02/07/2018 04:12PM]:   CXX(target) Release/obj.target/leveldb/deps/leveldb/leveldb-1.20/db/builder.o
203  [02/07/2018 04:12PM]:   CXX(target) Release/obj.target/leveldb/deps/leveldb/leveldb-1.20/db/db_impl.o
204  [02/07/2018 04:12PM]:   CXX(target) Release/obj.target/leveldb/deps/leveldb/leveldb-1.20/db/db_iter.o
205  [02/07/2018 04:12PM]:   CXX(target) Release/obj.target/leveldb/deps/leveldb/leveldb-1.20/db/filename.o
206  [02/07/2018 04:12PM]:   CXX(target) Release/obj.target/leveldb/deps/leveldb/leveldb-1.20/db/dbformat.o
207  [02/07/2018 04:12PM]:   CXX(target) Release/obj.target/leveldb/deps/leveldb/leveldb-1.20/db/log_reader.o
208  [02/07/2018 04:12PM]:   CXX(target) Release/obj.target/leveldb/deps/leveldb/leveldb-1.20/db/log_writer.o
209  [02/07/2018 04:12PM]:   CXX(target) Release/obj.target/leveldb/deps/leveldb/leveldb-1.20/db/memtable.o
210  [02/07/2018 04:12PM]:   CXX(target) Release/obj.target/leveldb/deps/leveldb/leveldb-1.20/db/repair.o
211  [02/07/2018 04:12PM]:   CXX(target) Release/obj.target/leveldb/deps/leveldb/leveldb-1.20/db/table_cache.o
212  [02/07/2018 04:12PM]:   CXX(target) Release/obj.target/leveldb/deps/leveldb/leveldb-1.20/db/version_edit.o
213  [02/07/2018 04:12PM]:   CXX(target) Release/obj.target/leveldb/deps/leveldb/leveldb-1.20/db/version_set.o
214  [02/07/2018 04:12PM]:   CXX(target) Release/obj.target/leveldb/deps/leveldb/leveldb-1.20/db/write_batch.o
215  [02/07/2018 04:12PM]:   CXX(target) Release/obj.target/leveldb/deps/leveldb/leveldb-1.20/helpers/memenv/memenv.o
216  [02/07/2018 04:12PM]:   CXX(target) Release/obj.target/leveldb/deps/leveldb/leveldb-1.20/port/port_posix_sse.o
217  [02/07/2018 04:12PM]:   CXX(target) Release/obj.target/leveldb/deps/leveldb/leveldb-1.20/table/block.o
218  [02/07/2018 04:12PM]:   CXX(target) Release/obj.target/leveldb/deps/leveldb/leveldb-1.20/table/block_builder.o
219  [02/07/2018 04:13PM]:   CXX(target) Release/obj.target/leveldb/deps/leveldb/leveldb-1.20/table/filter_block.o
220  [02/07/2018 04:13PM]:   CXX(target) Release/obj.target/leveldb/deps/leveldb/leveldb-1.20/table/format.o
221  [02/07/2018 04:13PM]:   CXX(target) Release/obj.target/leveldb/deps/leveldb/leveldb-1.20/table/iterator.o
222  [02/07/2018 04:13PM]:   CXX(target) Release/obj.target/leveldb/deps/leveldb/leveldb-1.20/table/merger.o
223  [02/07/2018 04:13PM]:   CXX(target) Release/obj.target/leveldb/deps/leveldb/leveldb-1.20/table/table.o
224  [02/07/2018 04:13PM]:   CXX(target) Release/obj.target/leveldb/deps/leveldb/leveldb-1.20/table/table_builder.o
225  [02/07/2018 04:13PM]:   CXX(target) Release/obj.target/leveldb/deps/leveldb/leveldb-1.20/table/two_level_iterator.o
226  [02/07/2018 04:13PM]:   CXX(target) Release/obj.target/leveldb/deps/leveldb/leveldb-1.20/util/arena.o
227  [02/07/2018 04:13PM]:   CXX(target) Release/obj.target/leveldb/deps/leveldb/leveldb-1.20/util/bloom.o
228  [02/07/2018 04:13PM]:   CXX(target) Release/obj.target/leveldb/deps/leveldb/leveldb-1.20/util/cache.o
229  [02/07/2018 04:13PM]:   CXX(target) Release/obj.target/leveldb/deps/leveldb/leveldb-1.20/util/coding.o
230  [02/07/2018 04:13PM]:   CXX(target) Release/obj.target/leveldb/deps/leveldb/leveldb-1.20/util/comparator.o
231  [02/07/2018 04:13PM]:   CXX(target) Release/obj.target/leveldb/deps/leveldb/leveldb-1.20/util/crc32c.o
232  [02/07/2018 04:13PM]:   CXX(target) Release/obj.target/leveldb/deps/leveldb/leveldb-1.20/util/env.o
233  [02/07/2018 04:13PM]:   CXX(target) Release/obj.target/leveldb/deps/leveldb/leveldb-1.20/util/filter_policy.o
234  [02/07/2018 04:13PM]:   CXX(target) Release/obj.target/leveldb/deps/leveldb/leveldb-1.20/util/hash.o
235  [02/07/2018 04:13PM]: ../deps/leveldb/leveldb-1.20/util/hash.cc: In function uint32_t leveldb::Hash(const char*, size_t, uint32_t):
236  [02/07/2018 04:13PM]: ../deps/leveldb/leveldb-1.20/util/hash.cc:37:9: warning: this statement may fall through [-Wimplicit-fallthrough=]
237  [02/07/2018 04:13PM]:        h += static_cast<unsigned char>(data[2]) << 16;
238  [02/07/2018 04:13PM]:        ~~^~~~~~~~~~~~~~~~~~~~~~~~~~~~~~~~~~~~~~~~~~~~
239  [02/07/2018 04:13PM]: ../deps/leveldb/leveldb-1.20/util/hash.cc:39:5: note: here
240  [02/07/2018 04:13PM]: ../deps/leveldb/leveldb-1.20/util/hash.cc:40:9: warning: this statement may fall through [-Wimplicit-fallthrough=]
241  [02/07/2018 04:13PM]:        h += static_cast<unsigned char>(data[1]) << 8;
242  [02/07/2018 04:13PM]:        ~~^~~~~~~~~~~~~~~~~~~~~~~~~~~~~~~~~~~~~~~~~~~
243  [02/07/2018 04:13PM]: ../deps/leveldb/leveldb-1.20/util/hash.cc:42:5: note: here
244  [02/07/2018 04:13PM]:   CXX(target) Release/obj.target/leveldb/deps/leveldb/leveldb-1.20/util/logging.o
245  [02/07/2018 04:13PM]:   CXX(target) Release/obj.target/leveldb/deps/leveldb/leveldb-1.20/util/options.o
246  [02/07/2018 04:13PM]:   CXX(target) Release/obj.target/leveldb/deps/leveldb/leveldb-1.20/util/status.o
247  [02/07/2018 04:13PM]:   CXX(target) Release/obj.target/leveldb/deps/leveldb/leveldb-1.20/port/port_posix.o
248  [02/07/2018 04:13PM]:   CXX(target) Release/obj.target/leveldb/deps/leveldb/leveldb-1.20/util/env_posix.o
249  [02/07/2018 04:13PM]:   AR(target) Release/obj.target/deps/leveldb/leveldb.a
250  [02/07/2018 04:13PM]:   CXX(target) Release/obj.target/snappy/deps/snappy/snappy-1.1.4/snappy-sinksource.o
251  [02/07/2018 04:13PM]:   CXX(target) Release/obj.target/snappy/deps/snappy/snappy-1.1.4/snappy-stubs-internal.o
252  [02/07/2018 04:13PM]:   CXX(target) Release/obj.target/snappy/deps/snappy/snappy-1.1.4/snappy.o
253  [02/07/2018 04:13PM]:   AR(target) Release/obj.target/deps/snappy/snappy.a
254  [02/07/2018 04:13PM]:   CXX(target) Release/obj.target/leveldown/src/batch.o
255  [02/07/2018 04:13PM]:                  from ../src/batch.cc:3:
256  [02/07/2018 04:13PM]:                  from ../src/batch.cc:1:
257  [02/07/2018 04:13PM]:   CXX(target) Release/obj.target/leveldown/src/batch_async.o
258  [02/07/2018 04:13PM]:                  from ../src/database.h:16,
259  [02/07/2018 04:13PM]:                  from ../src/batch.h:9,
260  [02/07/2018 04:13PM]:                  from ../src/batch_async.cc:8:
261  [02/07/2018 04:13PM]:                  from ../src/batch.h:5,
262  [02/07/2018 04:13PM]:   CXX(target) Release/obj.target/leveldown/src/database.o
263  [02/07/2018 04:13PM]:                  from ../src/leveldown.h:11,
264  [02/07/2018 04:13PM]:                  from ../src/database.cc:12:
265  [02/07/2018 04:13PM]:                  from ../src/database.cc:6:
266  [02/07/2018 04:13PM]:   CXX(target) Release/obj.target/leveldown/src/database_async.o
267  [02/07/2018 04:13PM]:                  from ../src/database_async.cc:12:
268  [02/07/2018 04:13PM]:                  from ../src/database_async.cc:6:
269  [02/07/2018 04:13PM]:   CXX(target) Release/obj.target/leveldown/src/iterator.o
270  [02/07/2018 04:13PM]:                  from ../src/iterator.cc:9:
271  [02/07/2018 04:13PM]:                  from ../src/iterator.cc:6:
272  [02/07/2018 04:13PM]:   CXX(target) Release/obj.target/leveldown/src/iterator_async.o
273  [02/07/2018 04:13PM]:                  from ../src/iterator_async.cc:9:
274  [02/07/2018 04:13PM]:                  from ../src/iterator_async.cc:6:
275  [02/07/2018 04:13PM]:   CXX(target) Release/obj.target/leveldown/src/leveldown.o
276  [02/07/2018 04:13PM]:                  from ../src/leveldown.cc:8:
277  [02/07/2018 04:13PM]:                  from ../src/leveldown.cc:6:
278  [02/07/2018 04:13PM]:   CXX(target) Release/obj.target/leveldown/src/leveldown_async.o
279  [02/07/2018 04:13PM]:                  from ../src/leveldown_async.cc:8:
280  [02/07/2018 04:13PM]:                  from ../src/leveldown.h:8,
281  [02/07/2018 04:13PM]:   SOLINK_MODULE(target) Release/obj.target/leveldown.node
282  [02/07/2018 04:13PM]:   COPY Release/leveldown.node
283  [02/07/2018 04:13PM]: make: Leaving directory /pkg/src/browser-laptop/node_modules/leveldown/build
284  [02/07/2018 04:13PM]: > [email protected] install /pkg/src/browser-laptop/node_modules/prova-lib/node_modules/secp256k1
285  [02/07/2018 04:13PM]: > prebuild-install || node-gyp rebuild || echo Secp256k1 bindings compilation fail. Pure JS implementation will be used.
286  [02/07/2018 04:13PM]: make: Entering directory /pkg/src/browser-laptop/node_modules/prova-lib/node_modules/secp256k1/build
287  [02/07/2018 04:13PM]:   CXX(target) Release/obj.target/secp256k1/src/addon.o
288  [02/07/2018 04:13PM]: In file included from ../../../../nan/nan.h:192:0,
289  [02/07/2018 04:13PM]:                  from ../src/addon.cc:2:
290  [02/07/2018 04:13PM]: ../../../../nan/nan_maybe_43_inl.h: In function Nan::Maybe<bool> Nan::ForceSet(v8::Local<v8::Object>, v8::Local<v8::Value>, v8::Local<v8::Value>, v8::PropertyAttribute):
291  [02/07/2018 04:13PM]: ../../../../nan/nan_maybe_43_inl.h:112:73: warning: v8::Maybe<bool> v8::Object::ForceSet(v8::Local<v8::Context>, v8::Local<v8::Value>, v8::Local<v8::Value>, v8::PropertyAttribute) is deprecated: Use CreateDataProperty / DefineOwnProperty [-Wdeprecated-declarations]
292  [02/07/2018 04:13PM]:                  from ../src/addon.cc:1:
293  [02/07/2018 04:13PM]:   CXX(target) Release/obj.target/secp256k1/src/privatekey.o
294  [02/07/2018 04:13PM]:                  from ../src/privatekey.cc:2:
295  [02/07/2018 04:13PM]:                  from ../src/privatekey.cc:1:
296  [02/07/2018 04:13PM]:   CXX(target) Release/obj.target/secp256k1/src/publickey.o
297  [02/07/2018 04:13PM]:                  from ../src/publickey.cc:3:
298  [02/07/2018 04:13PM]:                  from ../src/publickey.cc:2:
299  [02/07/2018 04:13PM]:   CXX(target) Release/obj.target/secp256k1/src/signature.o
300  [02/07/2018 04:13PM]:                  from ../src/signature.cc:2:
301  [02/07/2018 04:13PM]:                  from ../src/signature.cc:1:
302  [02/07/2018 04:13PM]:   CXX(target) Release/obj.target/secp256k1/src/ecdsa.o
303  [02/07/2018 04:13PM]:                  from ../src/ecdsa.cc:2:
304  [02/07/2018 04:13PM]:                  from ../src/ecdsa.cc:1:
305  [02/07/2018 04:13PM]:   CXX(target) Release/obj.target/secp256k1/src/ecdh.o
306  [02/07/2018 04:13PM]:                  from ../src/ecdh.cc:2:
307  [02/07/2018 04:13PM]:                  from ../src/ecdh.cc:1:
308  [02/07/2018 04:13PM]:   CC(target) Release/obj.target/secp256k1/src/secp256k1-src/src/secp256k1.o
309  [02/07/2018 04:13PM]: ../src/secp256k1-src/src/secp256k1.c: In function secp256k1_ec_pubkey_parse:
310  [02/07/2018 04:13PM]: ../src/secp256k1-src/src/secp256k1.c:22:8: warning: nonnull argument pubkey compared to NULL [-Wnonnull-compare]
311  [02/07/2018 04:13PM]:      if (EXPECT(!(cond), 0)) { \
312  [02/07/2018 04:13PM]: ../src/secp256k1-src/src/secp256k1.c:154:5: note: in expansion of macro ARG_CHECK
313  [02/07/2018 04:13PM]:      ARG_CHECK(pubkey != NULL);
314  [02/07/2018 04:13PM]: ../src/secp256k1-src/src/secp256k1.c:22:8: warning: nonnull argument input compared to NULL [-Wnonnull-compare]
315  [02/07/2018 04:13PM]: ../src/secp256k1-src/src/secp256k1.c:156:5: note: in expansion of macro ARG_CHECK
316  [02/07/2018 04:13PM]:      ARG_CHECK(input != NULL);
317  [02/07/2018 04:13PM]: ../src/secp256k1-src/src/secp256k1.c: In function secp256k1_ec_pubkey_serialize:
318  [02/07/2018 04:13PM]: ../src/secp256k1-src/src/secp256k1.c:22:8: warning: nonnull argument output compared to NULL [-Wnonnull-compare]
319  [02/07/2018 04:13PM]: ../src/secp256k1-src/src/secp256k1.c:175:5: note: in expansion of macro ARG_CHECK
320  [02/07/2018 04:13PM]: ../src/secp256k1-src/src/secp256k1.c:22:8: warning: nonnull argument outputlen compared to NULL [-Wnonnull-compare]
321  [02/07/2018 04:13PM]: ../src/secp256k1-src/src/secp256k1.c:171:5: note: in expansion of macro ARG_CHECK
322  [02/07/2018 04:13PM]:      ARG_CHECK(outputlen != NULL);
323  [02/07/2018 04:13PM]: ../src/secp256k1-src/src/secp256k1.c:177:5: note: in expansion of macro ARG_CHECK
324  [02/07/2018 04:13PM]: ../src/secp256k1-src/src/secp256k1.c: In function secp256k1_ecdsa_signature_parse_der:
325  [02/07/2018 04:13PM]: ../src/secp256k1-src/src/secp256k1.c:22:8: warning: nonnull argument sig compared to NULL [-Wnonnull-compare]
326  [02/07/2018 04:13PM]: ../src/secp256k1-src/src/secp256k1.c:216:5: note: in expansion of macro ARG_CHECK
327  [02/07/2018 04:13PM]:      ARG_CHECK(sig != NULL);
328  [02/07/2018 04:13PM]: ../src/secp256k1-src/src/secp256k1.c:217:5: note: in expansion of macro ARG_CHECK
329  [02/07/2018 04:13PM]: ../src/secp256k1-src/src/secp256k1.c: In function secp256k1_ecdsa_signature_parse_compact:
330  [02/07/2018 04:13PM]: ../src/secp256k1-src/src/secp256k1.c:234:5: note: in expansion of macro ARG_CHECK
331  [02/07/2018 04:13PM]: ../src/secp256k1-src/src/secp256k1.c:22:8: warning: nonnull argument input64 compared to NULL [-Wnonnull-compare]
332  [02/07/2018 04:13PM]: ../src/secp256k1-src/src/secp256k1.c:235:5: note: in expansion of macro ARG_CHECK
333  [02/07/2018 04:13PM]:      ARG_CHECK(input64 != NULL);
334  [02/07/2018 04:13PM]: ../src/secp256k1-src/src/secp256k1.c: In function secp256k1_ecdsa_signature_serialize_der:
335  [02/07/2018 04:13PM]: ../src/secp256k1-src/src/secp256k1.c:253:5: note: in expansion of macro ARG_CHECK
336  [02/07/2018 04:13PM]: ../src/secp256k1-src/src/secp256k1.c:254:5: note: in expansion of macro ARG_CHECK
337  [02/07/2018 04:13PM]: ../src/secp256k1-src/src/secp256k1.c:255:5: note: in expansion of macro ARG_CHECK
338  [02/07/2018 04:13PM]: ../src/secp256k1-src/src/secp256k1.c: In function secp256k1_ecdsa_signature_serialize_compact:
339  [02/07/2018 04:13PM]: ../src/secp256k1-src/src/secp256k1.c:22:8: warning: nonnull argument output64 compared to NULL [-Wnonnull-compare]
340  [02/07/2018 04:13PM]: ../src/secp256k1-src/src/secp256k1.c:265:5: note: in expansion of macro ARG_CHECK
341  [02/07/2018 04:13PM]:      ARG_CHECK(output64 != NULL);
342  [02/07/2018 04:13PM]: ../src/secp256k1-src/src/secp256k1.c:266:5: note: in expansion of macro ARG_CHECK
343  [02/07/2018 04:13PM]: ../src/secp256k1-src/src/secp256k1.c: In function secp256k1_ecdsa_signature_normalize:
344  [02/07/2018 04:13PM]: ../src/secp256k1-src/src/secp256k1.c:22:8: warning: nonnull argument sigin compared to NULL [-Wnonnull-compare]
345  [02/07/2018 04:13PM]: ../src/secp256k1-src/src/secp256k1.c:279:5: note: in expansion of macro ARG_CHECK
346  [02/07/2018 04:13PM]: ../src/secp256k1-src/src/secp256k1.c: In function secp256k1_ecdsa_verify:
347  [02/07/2018 04:13PM]: ../src/secp256k1-src/src/secp256k1.c:300:5: note: in expansion of macro ARG_CHECK
348  [02/07/2018 04:13PM]: ../src/secp256k1-src/src/secp256k1.c:22:8: warning: nonnull argument msg32 compared to NULL [-Wnonnull-compare]
349  [02/07/2018 04:13PM]: ../src/secp256k1-src/src/secp256k1.c:299:5: note: in expansion of macro ARG_CHECK
350  [02/07/2018 04:13PM]: ../src/secp256k1-src/src/secp256k1.c:301:5: note: in expansion of macro ARG_CHECK
351  [02/07/2018 04:13PM]: ../src/secp256k1-src/src/secp256k1.c: In function secp256k1_ecdsa_sign:
352  [02/07/2018 04:13PM]: ../src/secp256k1-src/src/secp256k1.c:22:8: warning: nonnull argument signature compared to NULL [-Wnonnull-compare]
353  [02/07/2018 04:13PM]: ../src/secp256k1-src/src/secp256k1.c:353:5: note: in expansion of macro ARG_CHECK
354  [02/07/2018 04:13PM]: ../src/secp256k1-src/src/secp256k1.c:352:5: note: in expansion of macro ARG_CHECK
355  [02/07/2018 04:13PM]: ../src/secp256k1-src/src/secp256k1.c:22:8: warning: nonnull argument seckey compared to NULL [-Wnonnull-compare]
356  [02/07/2018 04:13PM]: ../src/secp256k1-src/src/secp256k1.c:354:5: note: in expansion of macro ARG_CHECK
357  [02/07/2018 04:13PM]: ../src/secp256k1-src/src/secp256k1.c: In function secp256k1_ec_seckey_verify:
358  [02/07/2018 04:13PM]: ../src/secp256k1-src/src/secp256k1.c:396:5: note: in expansion of macro ARG_CHECK
359  [02/07/2018 04:13PM]: ../src/secp256k1-src/src/secp256k1.c: In function secp256k1_ec_pubkey_create:
360  [02/07/2018 04:13PM]: ../src/secp256k1-src/src/secp256k1.c:411:5: note: in expansion of macro ARG_CHECK
361  [02/07/2018 04:13PM]: ../src/secp256k1-src/src/secp256k1.c:414:5: note: in expansion of macro ARG_CHECK
362  [02/07/2018 04:13PM]: ../src/secp256k1-src/src/secp256k1.c: In function secp256k1_ec_privkey_negate:
363  [02/07/2018 04:13PM]: ../src/secp256k1-src/src/secp256k1.c:430:5: note: in expansion of macro ARG_CHECK
364  [02/07/2018 04:13PM]: ../src/secp256k1-src/src/secp256k1.c: In function secp256k1_ec_pubkey_negate:
365  [02/07/2018 04:13PM]: ../src/secp256k1-src/src/secp256k1.c:443:5: note: in expansion of macro ARG_CHECK
366  [02/07/2018 04:13PM]: ../src/secp256k1-src/src/secp256k1.c: In function secp256k1_ec_privkey_tweak_add:
367  [02/07/2018 04:13PM]: ../src/secp256k1-src/src/secp256k1.c:460:5: note: in expansion of macro ARG_CHECK
368  [02/07/2018 04:13PM]: ../src/secp256k1-src/src/secp256k1.c:22:8: warning: nonnull argument tweak compared to NULL [-Wnonnull-compare]
369  [02/07/2018 04:13PM]: ../src/secp256k1-src/src/secp256k1.c:461:5: note: in expansion of macro ARG_CHECK
370  [02/07/2018 04:13PM]: ../src/secp256k1-src/src/secp256k1.c: In function secp256k1_ec_pubkey_tweak_add:
371  [02/07/2018 04:13PM]: ../src/secp256k1-src/src/secp256k1.c:484:5: note: in expansion of macro ARG_CHECK
372  [02/07/2018 04:13PM]: ../src/secp256k1-src/src/secp256k1.c:485:5: note: in expansion of macro ARG_CHECK
373  [02/07/2018 04:13PM]: ../src/secp256k1-src/src/secp256k1.c: In function secp256k1_ec_privkey_tweak_mul:
374  [02/07/2018 04:13PM]: ../src/secp256k1-src/src/secp256k1.c:507:5: note: in expansion of macro ARG_CHECK
375  [02/07/2018 04:13PM]: ../src/secp256k1-src/src/secp256k1.c:508:5: note: in expansion of macro ARG_CHECK
376  [02/07/2018 04:13PM]: ../src/secp256k1-src/src/secp256k1.c: In function secp256k1_ec_pubkey_tweak_mul:
377  [02/07/2018 04:13PM]: ../src/secp256k1-src/src/secp256k1.c:530:5: note: in expansion of macro ARG_CHECK
378  [02/07/2018 04:13PM]: ../src/secp256k1-src/src/secp256k1.c:531:5: note: in expansion of macro ARG_CHECK
379  [02/07/2018 04:13PM]: ../src/secp256k1-src/src/secp256k1.c: In function secp256k1_ec_pubkey_combine:
380  [02/07/2018 04:13PM]: ../src/secp256k1-src/src/secp256k1.c:22:8: warning: nonnull argument pubnonce compared to NULL [-Wnonnull-compare]
381  [02/07/2018 04:13PM]: ../src/secp256k1-src/src/secp256k1.c:559:5: note: in expansion of macro ARG_CHECK
382  [02/07/2018 04:13PM]: ../src/secp256k1-src/src/secp256k1.c:22:8: warning: nonnull argument pubnonces compared to NULL [-Wnonnull-compare]
383  [02/07/2018 04:13PM]: ../src/secp256k1-src/src/secp256k1.c:562:5: note: in expansion of macro ARG_CHECK
384  [02/07/2018 04:13PM]: ../src/secp256k1-src/src/secp256k1.c: In function secp256k1_ecdsa_recoverable_signature_parse_compact:
385  [02/07/2018 04:13PM]: ../src/secp256k1-src/src/modules/recovery/main_impl.h:44:5: note: in expansion of macro ARG_CHECK
386  [02/07/2018 04:13PM]: ../src/secp256k1-src/src/modules/recovery/main_impl.h:45:5: note: in expansion of macro ARG_CHECK
387  [02/07/2018 04:13PM]: ../src/secp256k1-src/src/secp256k1.c: In function secp256k1_ecdsa_recoverable_signature_serialize_compact:
388  [02/07/2018 04:13PM]: ../src/secp256k1-src/src/modules/recovery/main_impl.h:64:5: note: in expansion of macro ARG_CHECK
389  [02/07/2018 04:13PM]: ../src/secp256k1-src/src/secp256k1.c:22:8: warning: nonnull argument recid compared to NULL [-Wnonnull-compare]
390  [02/07/2018 04:13PM]: ../src/secp256k1-src/src/modules/recovery/main_impl.h:66:5: note: in expansion of macro ARG_CHECK
391  [02/07/2018 04:13PM]: ../src/secp256k1-src/src/modules/recovery/main_impl.h:65:5: note: in expansion of macro ARG_CHECK
392  [02/07/2018 04:13PM]: ../src/secp256k1-src/src/secp256k1.c: In function secp256k1_ecdsa_recoverable_signature_convert:
393  [02/07/2018 04:13PM]: ../src/secp256k1-src/src/modules/recovery/main_impl.h:79:5: note: in expansion of macro ARG_CHECK
394  [02/07/2018 04:13PM]: ../src/secp256k1-src/src/modules/recovery/main_impl.h:80:5: note: in expansion of macro ARG_CHECK
395  [02/07/2018 04:13PM]: ../src/secp256k1-src/src/secp256k1.c: In function secp256k1_ecdsa_sign_recoverable:
396  [02/07/2018 04:13PM]: ../src/secp256k1-src/src/modules/recovery/main_impl.h:132:5: note: in expansion of macro ARG_CHECK
397  [02/07/2018 04:13PM]: ../src/secp256k1-src/src/modules/recovery/main_impl.h:131:5: note: in expansion of macro ARG_CHECK
398  [02/07/2018 04:13PM]: ../src/secp256k1-src/src/modules/recovery/main_impl.h:133:5: note: in expansion of macro ARG_CHECK
399  [02/07/2018 04:13PM]: ../src/secp256k1-src/src/secp256k1.c: In function secp256k1_ecdsa_recover:
400  [02/07/2018 04:13PM]: ../src/secp256k1-src/src/modules/recovery/main_impl.h:179:5: note: in expansion of macro ARG_CHECK
401  [02/07/2018 04:13PM]: ../src/secp256k1-src/src/modules/recovery/main_impl.h:178:5: note: in expansion of macro ARG_CHECK
402  [02/07/2018 04:13PM]: ../src/secp256k1-src/src/modules/recovery/main_impl.h:177:5: note: in expansion of macro ARG_CHECK
403  [02/07/2018 04:13PM]:   CC(target) Release/obj.target/secp256k1/src/secp256k1-src/contrib/lax_der_parsing.o
404  [02/07/2018 04:13PM]:   CC(target) Release/obj.target/secp256k1/src/secp256k1-src/contrib/lax_der_privatekey_parsing.o
405  [02/07/2018 04:13PM]:   SOLINK_MODULE(target) Release/obj.target/secp256k1.node
406  [02/07/2018 04:13PM]: make: Leaving directory /pkg/src/browser-laptop/node_modules/prova-lib/node_modules/secp256k1/build
407  [02/07/2018 04:13PM]: > [email protected] install /pkg/src/browser-laptop/node_modules/secp256k1
408  [02/07/2018 04:13PM]: make: Entering directory /pkg/src/browser-laptop/node_modules/secp256k1/build
409  [02/07/2018 04:13PM]: ../src/secp256k1-src/src/secp256k1.c:433:5: note: in expansion of macro ARG_CHECK
410  [02/07/2018 04:13PM]: ../src/secp256k1-src/src/secp256k1.c:434:5: note: in expansion of macro ARG_CHECK
411  [02/07/2018 04:13PM]: ../src/secp256k1-src/src/secp256k1.c:457:5: note: in expansion of macro ARG_CHECK
412  [02/07/2018 04:13PM]: ../src/secp256k1-src/src/secp256k1.c:458:5: note: in expansion of macro ARG_CHECK
413  [02/07/2018 04:13PM]: ../src/secp256k1-src/src/secp256k1.c:480:5: note: in expansion of macro ARG_CHECK
414  [02/07/2018 04:13PM]: ../src/secp256k1-src/src/secp256k1.c:481:5: note: in expansion of macro ARG_CHECK
415  [02/07/2018 04:13PM]: ../src/secp256k1-src/src/secp256k1.c:503:5: note: in expansion of macro ARG_CHECK
416  [02/07/2018 04:13PM]: ../src/secp256k1-src/src/secp256k1.c:504:5: note: in expansion of macro ARG_CHECK
417  [02/07/2018 04:13PM]: ../src/secp256k1-src/src/secp256k1.c:532:5: note: in expansion of macro ARG_CHECK
418  [02/07/2018 04:13PM]: ../src/secp256k1-src/src/secp256k1.c:535:5: note: in expansion of macro ARG_CHECK
419  [02/07/2018 04:13PM]: make: Leaving directory /pkg/src/browser-laptop/node_modules/secp256k1/build
420  [02/07/2018 04:13PM]: > [email protected] install /pkg/src/browser-laptop/node_modules/spectron/node_modules/electron-chromedriver
421  [02/07/2018 04:13PM]: > node ./download-chromedriver.js
422  [02/07/2018 04:13PM]: > [email protected] install /pkg/src/browser-laptop/node_modules/electron-chromedriver
423  [02/07/2018 04:13PM]: > [email protected] install /pkg/src/browser-laptop/node_modules/keytar
424  [02/07/2018 04:13PM]: make: Entering directory /pkg/src/browser-laptop/node_modules/keytar/build
425  [02/07/2018 04:13PM]:   CXX(target) Release/obj.target/keytar/src/main.o
426  [02/07/2018 04:13PM]:   CXX(target) Release/obj.target/keytar/src/keytar_posix.o
427  [02/07/2018 04:13PM]:   SOLINK_MODULE(target) Release/obj.target/keytar.node
428  [02/07/2018 04:13PM]:   COPY Release/keytar.node
429  [02/07/2018 04:13PM]: make: Leaving directory /pkg/src/browser-laptop/node_modules/keytar/build
430  [02/07/2018 04:13PM]: > [email protected] install /pkg/src/browser-laptop/node_modules/nsp/node_modules/git-validate
431  [02/07/2018 04:13PM]: > [email protected] install /pkg/src/browser-laptop/node_modules/pre-commit
432  [02/07/2018 04:13PM]: (node:1348) MaxListenersExceededWarning: Possible EventEmitter memory leak detected. 11 SIGINT listeners added. Use emitter.setMaxListeners() to increase limit
433  [02/07/2018 04:13PM]: pre-commit: Detected an existing git pre-commit hook
434  [02/07/2018 04:13PM]: pre-commit: Old pre-commit hook backuped to pre-commit.old
435  [02/07/2018 04:13PM]: > [email protected] install /pkg/src/browser-laptop/node_modules/pre-push
436  [02/07/2018 04:13PM]: pre-push: Detected an existing git pre-push hook
437  [02/07/2018 04:13PM]: pre-push: Old pre-push hook backuped to pre-push.old
438  [02/07/2018 04:13PM]: > [email protected] postinstall /pkg/src/browser-laptop/node_modules/bat-publisher/node_modules/tldjs
439  [02/07/2018 04:13PM]: > node ./bin/postinstall.js
440  [02/07/2018 04:13PM]: > [email protected] postinstall /pkg/src/browser-laptop/node_modules/spawn-sync
441  [02/07/2018 04:13PM]: > [email protected] postinstall /pkg/src/browser-laptop/node_modules/electron-prebuilt
442  [02/07/2018 04:13PM]: Downloading brave-v4.5.15-linux-x64.zip
443  [02/07/2018 04:13PM]: [>                                            ] 0.0% (0 B/s)
444  [02/07/2018 04:13PM]: Downloading brave-v4.5.15-linux-x64.zip
445  [02/07/2018 04:13PM]: [>                                            ] 0.0% of 54.92 MB (0 B/s)
446  [02/07/2018 04:13PM]: [>                                            ] 1.9% of 54.92 MB (1.06 MB/s)
447  [02/07/2018 04:13PM]: [=====>                                       ] 14.1% of 54.92 MB (7.75 MB/s)
448  [02/07/2018 04:13PM]: [=========>                                   ] 23.7% of 54.92 MB (10.39 MB/s)
449  [02/07/2018 04:13PM]: [==============>                              ] 35.4% of 54.92 MB (12.97 MB/s)
450  [02/07/2018 04:13PM]: [======================>                      ] 51.4% of 54.92 MB (16.13 MB/s)
451  [02/07/2018 04:13PM]: [============================>                ] 64.6% of 54.92 MB (17.74 MB/s)
452  [02/07/2018 04:13PM]: [=================================>           ] 75.8% of 54.92 MB (18.51 MB/s)
453  [02/07/2018 04:13PM]: [====================================>        ] 83.5% of 54.92 MB (18.34 MB/s)
454  [02/07/2018 04:13PM]: [========================================>    ] 92.8% of 54.92 MB (18.54 MB/s)
455  [02/07/2018 04:13PM]: [============================================>] 100.0% of 54.92 MB (18.31 MB/s)
456  [02/07/2018 04:13PM]: > [email protected] postinstall /pkg/src/browser-laptop/node_modules/flow-bin
457  [02/07/2018 04:13PM]:   ✔ flow binary test passed successfully
458  [02/07/2018 04:13PM]: > [email protected] postinstall /pkg/src/browser-laptop
459  [02/07/2018 04:13PM]: > npm run download-sync-client && webpack
460  [02/07/2018 04:13PM]: > [email protected] download-sync-client /pkg/src/browser-laptop
461  [02/07/2018 04:13PM]: > node ./tools/downloadSyncClient
462  [02/07/2018 04:13PM]: writing sync bundle to /pkg/src/browser-laptop/app/extensions/brave/content/scripts/sync.js
463  [02/07/2018 04:14PM]: Hash: 834a07377273aaeca0ee4481bf6186814d724434da8873207db89a05aecd
464  [02/07/2018 04:14PM]:     Hash: 834a07377273aaeca0ee
465  [02/07/2018 04:14PM]:     Version: webpack 1.15.0
466  [02/07/2018 04:14PM]:                                      Asset       Size  Chunks             Chunk Names
467  [02/07/2018 04:14PM]:       de46bc0216c15ce3302139b3c2af4884.svg  789 bytes          [emitted]
468  [02/07/2018 04:14PM]:       41943a7d37ac5c61823a2a17c4e06070.svg  733 bytes          [emitted]
469  [02/07/2018 04:14PM]:     af7ae505a9eed503f8b8e6982036873e.woff2    77.2 kB          [emitted]
470  [02/07/2018 04:14PM]:      fee66e712a8a08eef5805a46892932ad.woff      98 kB          [emitted]
471  [02/07/2018 04:14PM]:       b06871f281fee6b241d60582ae9369b9.ttf     166 kB          [emitted]
472  [02/07/2018 04:14PM]:       912ec66d7572ff821749319396470bde.svg     444 kB          [emitted]
473  [02/07/2018 04:14PM]:       2ad15189f9772058209b9036ebf8bda1.svg    1.34 kB          [emitted]
474  [02/07/2018 04:14PM]:       292a09c3abb7e423680bb8be4de82460.svg  768 bytes          [emitted]
475  [02/07/2018 04:14PM]:       f9c5944d81cb03f5601faa8815856fc4.svg     1.3 kB          [emitted]
476  [02/07/2018 04:14PM]:       a42c3b4a1de787c14f05edf1ec49c9fd.svg    1.72 kB          [emitted]
477  [02/07/2018 04:14PM]:       dfd0990bd610a78a34d31bd751d140bd.svg    1.72 kB          [emitted]
478  [02/07/2018 04:14PM]:       b6dd4b1292cfd4470e58486c56ad0832.svg    3.69 kB          [emitted]
479  [02/07/2018 04:14PM]:       f3b9223a9b686682b28b618d9f28817e.svg  792 bytes          [emitted]
480  [02/07/2018 04:14PM]:       59023652f84793c67f7775cea1b33195.svg  670 bytes          [emitted]
481  [02/07/2018 04:14PM]:       fbb1a0acb7d12f9e64c82a8cc82aeb66.svg  615 bytes          [emitted]
482  [02/07/2018 04:14PM]:       7e57f5ffe33356122ffb083eecf8f2cf.svg    1.13 kB          [emitted]
483  [02/07/2018 04:14PM]:       ab6512b7dac5700b20f7de361aa47884.svg    1.03 kB          [emitted]
484  [02/07/2018 04:14PM]:       aa1e37293df5a3c347ea3784959aa105.svg  776 bytes          [emitted]
485  [02/07/2018 04:14PM]:       d50f42f7ea312cabab88d8eda5bb14a9.svg    2.88 kB          [emitted]
486  [02/07/2018 04:14PM]:       24e964b96ac35120541941897f6a01e3.svg  869 bytes          [emitted]
487  [02/07/2018 04:14PM]:       222f169694e4d1e956fce5a4fb5ad23d.svg  626 bytes          [emitted]
488  [02/07/2018 04:14PM]:       e606b7f6bbecaced0044c1052a99b7a9.svg    1.06 kB          [emitted]
489  [02/07/2018 04:14PM]:       eb1972095e43719a327e7fc4dd7691a4.svg    1.82 kB          [emitted]
490  [02/07/2018 04:14PM]:       7e7925a41b22d080e00c8d7309745420.svg  378 bytes          [emitted]
491  [02/07/2018 04:14PM]:       196262d2122e55e514d47f9e44b66520.svg  431 bytes          [emitted]
492  [02/07/2018 04:14PM]:       4bb98a05900622845d2e66b433711e32.png    2.93 kB          [emitted]
493  [02/07/2018 04:14PM]:       b6190b89305d7ca6eb2b6a84fb68d7bf.png     2.7 kB          [emitted]
494  [02/07/2018 04:14PM]:       4126c044e93c3caa1faaca0f4ec04e1e.png    11.1 kB          [emitted]
495  [02/07/2018 04:14PM]:       80c2dca1e4c4e1e3f495563a6952ee12.png    25.1 kB          [emitted]
496  [02/07/2018 04:14PM]:       4134ecd741d7d7b79fd1bb41ca3ad4d5.svg  472 bytes          [emitted]
497  [02/07/2018 04:14PM]:       89f9f5560225e5eee776ab6ae8f9f0b3.svg  840 bytes          [emitted]
498  [02/07/2018 04:14PM]:       f5ff01ecdaca34dc1cac01191958b4b3.svg  494 bytes          [emitted]
499  [02/07/2018 04:14PM]:       adc4e1913e1d98de46263c2dad9b914c.svg  820 bytes          [emitted]
500  [02/07/2018 04:14PM]:       bd7efdfbcb45f934ff13bfe5f5de5330.svg  990 bytes          [emitted]
501  [02/07/2018 04:14PM]:       e877f09f64a2ce7ec153e0efdd4ed1a1.svg  861 bytes          [emitted]
502  [02/07/2018 04:14PM]:       21db55dd9ae45888ef8d007135d7e243.svg    1.56 kB          [emitted]
503  [02/07/2018 04:14PM]:       d7876d48e80112e766d737346a616707.svg     1.5 kB          [emitted]
504  [02/07/2018 04:14PM]:       247d2a2d16b90d7364981e7224620a2a.svg  976 bytes          [emitted]
505  [02/07/2018 04:14PM]:       c74aae1d7c31e27b75eb9c779b6fab4c.svg    1.03 kB          [emitted]
506  [02/07/2018 04:14PM]:       674f50d287a8c48dc19ba404d20fe713.eot     166 kB          [emitted]
507  [02/07/2018 04:14PM]:       14ad83ede0f899bd6a66a37194df85c6.svg  934 bytes          [emitted]
508  [02/07/2018 04:14PM]:       493bc2b131dc439f27e05c4d3f4e93e7.png    12.1 kB          [emitted]
509  [02/07/2018 04:14PM]:       392507919f6ec931361b489a56c65ce9.svg  816 bytes          [emitted]
510  [02/07/2018 04:14PM]:       d5a535fdec793b2b9219ef7abfa185ce.svg  205 bytes          [emitted]
511  [02/07/2018 04:14PM]:       5ccced21c6505bfab561c1e015e407e1.svg  239 bytes          [emitted]
512  [02/07/2018 04:14PM]:       23b20b72da217563c4304c07c5206dd0.svg  213 bytes          [emitted]
513  [02/07/2018 04:14PM]:       e008bf562e79f9e1fd5110df9d61627d.svg  355 bytes          [emitted]
514  [02/07/2018 04:14PM]:       c11dbc2db4c1e34f10ac562b48e1d886.svg  289 bytes          [emitted]
515  [02/07/2018 04:14PM]:       430b679826c6e11b1767e7e05649e028.svg  615 bytes          [emitted]
516  [02/07/2018 04:14PM]:       2e7aa1b656ba910260191a20406af15f.svg  618 bytes          [emitted]
517  [02/07/2018 04:14PM]:       38ad268f3a41dc9191cc26857537e4c1.svg  452 bytes          [emitted]
518  [02/07/2018 04:14PM]:       a60b6ab6aaca89b5627cee5fb224ce64.svg  438 bytes          [emitted]
519  [02/07/2018 04:14PM]:       f88876b2519c8cbda6ef6fa17e83eeff.svg  687 bytes          [emitted]
520  [02/07/2018 04:14PM]:       bc90457507bcff2412ad0d500d7f92a9.svg  693 bytes          [emitted]
521  [02/07/2018 04:14PM]:       b6fb7a0b51d3af832d445c02e46d434d.png    2.13 kB          [emitted]
522  [02/07/2018 04:14PM]:       a34dd95ecb584ddb353a854a069d89a1.png    18.1 kB          [emitted]
523  [02/07/2018 04:14PM]:       0c4a088449e73ec59b36bb111c7e03b5.png    5.91 kB          [emitted]
524  [02/07/2018 04:14PM]:       69e1af008c893d635dabe4b7feb5f366.png    2.39 kB          [emitted]
525  [02/07/2018 04:14PM]:       51a0855604244165c58b5867df7d5676.png    4.69 kB          [emitted]
526  [02/07/2018 04:14PM]:       1be94b6e3fe1720c770ab40ab0c71cbe.png    7.22 kB          [emitted]
527  [02/07/2018 04:14PM]:       cd1a406ba824513a8d92a2e1418a2977.svg  418 bytes          [emitted]
528  [02/07/2018 04:14PM]:       1acaa76443941825560798bdb3936bf9.svg  437 bytes          [emitted]
529  [02/07/2018 04:14PM]:       3bad0d188335cbfe4a29bd448fa4d0e3.svg  430 bytes          [emitted]
530  [02/07/2018 04:14PM]:       f8aa9b15e2d849c26e84ec0dba7bebae.svg    1.27 kB          [emitted]
531  [02/07/2018 04:14PM]:       cbba55184f62c3df8728928b9016f9d7.svg     1.7 kB          [emitted]
532  [02/07/2018 04:14PM]:       1d10887913956d5ffe996a035b489730.svg    1.51 kB          [emitted]
533  [02/07/2018 04:14PM]:       df9d90f487acc18337a62e10623a2d87.svg    1.21 kB          [emitted]
534  [02/07/2018 04:14PM]:       4816047e6c690868e2f2dfb972e11263.svg    1.09 kB          [emitted]
535  [02/07/2018 04:14PM]:       e27fa9769059ed125a576fe851592410.svg  671 bytes          [emitted]
536  [02/07/2018 04:14PM]:       dafa0bbc64a10f10d65c8eadadd14c0a.svg  890 bytes          [emitted]
537  [02/07/2018 04:14PM]:       dba2dc28147a6dc7176d68287cb3fb74.svg    2.66 kB          [emitted]
538  [02/07/2018 04:14PM]:       8c9c38b16d3e35299481600c10f9bd19.svg  823 bytes          [emitted]
539  [02/07/2018 04:14PM]:       e61458fc4b59fafd5f6bb3a25b6d94ff.svg  824 bytes          [emitted]
540  [02/07/2018 04:14PM]:       f70c25409713b4132e79b004c03ef3cb.svg  428 bytes          [emitted]
541  [02/07/2018 04:14PM]:                        aboutPages.entry.js     4.2 MB       0  [emitted]  aboutPages
542  [02/07/2018 04:14PM]:                               app.entry.js    3.32 MB       1  [emitted]  app
543  [02/07/2018 04:14PM]:                    aboutPages.entry.js.map    5.62 MB       0  [emitted]  aboutPages
544  [02/07/2018 04:14PM]:                           app.entry.js.map    4.61 MB       1  [emitted]  app
545  [02/07/2018 04:14PM]:        [0] multi app 28 bytes {1} [built]
546  [02/07/2018 04:14PM]:        [0] multi aboutPages 28 bytes {0} [built]
547  [02/07/2018 04:14PM]:         + 920 hidden modules
548  [02/07/2018 04:14PM]:     Hash: 4481bf6186814d724434
549  [02/07/2018 04:14PM]:                   Asset    Size  Chunks             Chunk Names
550  [02/07/2018 04:14PM]:         lib.devTools.js  717 kB       0  [emitted]  devTools
551  [02/07/2018 04:14PM]:     lib.devTools.js.map  952 kB       0  [emitted]  devTools
552  [02/07/2018 04:14PM]:        [0] multi devTools 28 bytes {0} [built]
553  [02/07/2018 04:14PM]:         + 54 hidden modules
554  [02/07/2018 04:14PM]:     Hash: da8873207db89a05aecd
555  [02/07/2018 04:14PM]:                    webtorrentPage.entry.js     1.4 MB       0  [emitted]  main
556  [02/07/2018 04:14PM]:                webtorrentPage.entry.js.map    1.72 MB       0  [emitted]  main
557  [02/07/2018 04:14PM]:        [0] multi main 28 bytes {0} [built]
558  [02/07/2018 04:14PM]: npm WARN optional SKIPPING OPTIONAL DEPENDENCY: [email protected] (node_modules/7zip-bin-mac):
559  [02/07/2018 04:14PM]: npm WARN notsup SKIPPING OPTIONAL DEPENDENCY: Unsupported platform for [email protected]: wanted {os:darwin,arch:any} (current: {os:linux,arch:x64})
560  [02/07/2018 04:14PM]: npm WARN optional SKIPPING OPTIONAL DEPENDENCY: [email protected] (node_modules/fsevents):
561  [02/07/2018 04:14PM]: npm WARN notsup SKIPPING OPTIONAL DEPENDENCY: Unsupported platform for [email protected]: wanted {os:darwin,arch:any} (current: {os:linux,arch:x64})
562  [02/07/2018 04:14PM]: added 2317 packages in 172.029s
563  [02/07/2018 04:14PM]: > [email protected] build-package /pkg/src/browser-laptop
564  [02/07/2018 04:14PM]: > node ./tools/buildPackage.js
565  [02/07/2018 04:14PM]: Building version 0.19.88 in Brave-linux-x64 with Electron 4.5.15
566  [02/07/2018 04:14PM]: echo cleaning up target...&&rm -Rf Brave-linux-x64&&rm -Rf dist&&rm -f Brave.tar.bz2&&echo done&&echo starting build...&&./node_modules/.bin/webpack&&npm run checks&&node ./node_modules/electron-packager/cli.js . Brave --overwrite --ignore=pre-commit|pre-push|test/|docs/|tools/|signcode-tf|rx|nslog|eslint|cppunitlite|caniuse-db|cross-env|spectron|\.(0|13ctype|APACHE2|BSD|DOCS|DS_Store|LESSER|Makefile|a|ac|aff|after|am|arcconfig|arclint|babelrc|bat|before|bnf|brave-gyp|c|cardinalrc|cc|cfg|closure-compiler|cmake|cmd|covignore|cpp|csv|cxx|d|def|deps|dic|dll|dntrc|dockerignore|dsp|editorconfig|editorconfig~|el|enc|entitlements|eot|esprima|flow|flowconfig|gitattributes|githug|gitignore|gitattributes|gitignore|gitkeep|gitmodules|gnu|gradle|gyp|gypi|gz|h|hbs|hxx|idl|iml|in|inc|include|info|jade|java|jsfmtrc|jshint|jshintignore|jshintrc|jslintrc|jst|js~|keep|lint|lintignore|lock|log|ls|m4|mailmap|map|markdown|md|mdown|md~|mem|min-wd|mk|mkd|mm|mustache|myspell|myspell|name|nsh|nsi|nsprc|nuspec|nvmrc|o|old|orig|otf|param|patch|pegjs|post|pre|pro|py|rej|s|sage|scss|settings|sh|skip|source-map|stamp|swo|tap|targ|template|tern-port|tern-project|testignore|tm_properties|tmp|tpl|ts|txt|un~|vscode|xcf|xml|yaml|yml)$|/deps/|Release/obj|obj.target|ad-block/(node_modules|test|perf|sample|scripts|test|vendor|ABPFilterParserData.dat)|tracking-protection/(node_modules|test|data|scripts|vendor)|tracking-protection/build/node_modules|tracking-protection/build/Release/(sample.exe|test.exe)|sqlite3/src|nsp/node_modules|electron-installer-squirrel-windows|electron-chromedriver|electron-installer-debian|node-notifier/vendor|node-gyp|npm|jsdoc|docs|sinon|electron-download|electron-rebuild|electron-packager|electron-builder|electron-prebuilt|electron-rebuild|electron-winstaller-fixed|muon-winstaller|electron-installer-redhat|flow-bin|babel$|babel-(?!polyfill|regenerator-runtime|preset-env)|jsdom-global|react-addons-perf|react-addons-test-utils|enzyme|git-rev-sync|sqlite3|uglify-js|webdriverio|webpack-dev-server --platform=linux --arch=x64 --version=4.5.15 --icon=res/app.png --asar=true --app-version=0.19.88 --build-version=4.5.15 --protocol=http --protocol-name=HTTP Handler --protocol=https --protocol-name=HTTPS Handler --product-dir-name=brave --version-string.CompanyName=Brave Software --version-string.ProductName=Brave --version-string.Copyright=Copyright 2017, Brave Software --version-string.FileDescription=Brave&&mv Brave-linux-x64/Brave Brave-linux-x64/brave&&ncp ./app/extensions Brave-linux-x64/resources/extensions&&mkdirp Brave-linux-x64/resources/app.asar.unpacked/node_modules/node-anonize2-relic-emscripten&&ncp node_modules/node-anonize2-relic-emscripten/anonize2.js.mem Brave-linux-x64/resources/app.asar.unpacked/node_modules/node-anonize2-relic-emscripten/anonize2.js.mem
567  [02/07/2018 04:15PM]: Hash: b36783f2eda6b011c746393766448e1b3f95556d344503f66c6a3ab49da8
568  [02/07/2018 04:15PM]:     Hash: b36783f2eda6b011c746
569  [02/07/2018 04:15PM]:                        aboutPages.entry.js    4.14 MB       0  [emitted]  aboutPages
570  [02/07/2018 04:15PM]:                               app.entry.js    3.29 MB       1  [emitted]  app
571  [02/07/2018 04:15PM]:                    aboutPages.entry.js.map    5.54 MB       0  [emitted]  aboutPages
572  [02/07/2018 04:15PM]:                           app.entry.js.map    4.56 MB       1  [emitted]  app
573  [02/07/2018 04:15PM]:     ERROR in aboutPages.entry.js from UglifyJs
574  [02/07/2018 04:15PM]:     SyntaxError: Name expected [./app/renderer/components/styles/global.js:5,6]
575  [02/07/2018 04:15PM]:     ERROR in app.entry.js from UglifyJs
576  [02/07/2018 04:15PM]:     Hash: 393766448e1b3f95556d
577  [02/07/2018 04:15PM]:     ERROR in lib.devTools.js from UglifyJs
578  [02/07/2018 04:15PM]:     SyntaxError: Unexpected token: operator (>) [./js/constants/config.js:46,13]
579  [02/07/2018 04:15PM]:     Hash: 344503f66c6a3ab49da8
580  [02/07/2018 04:15PM]:                    webtorrentPage.entry.js    1.35 MB       0  [emitted]  main
581  [02/07/2018 04:15PM]:                webtorrentPage.entry.js.map    1.66 MB       0  [emitted]  main
582  [02/07/2018 04:15PM]:     ERROR in webtorrentPage.entry.js from UglifyJs
583  [02/07/2018 04:15PM]:     SyntaxError: Name expected [./app/renderer/components/styles/commonStyles.js:5,6]
584  [02/07/2018 04:15PM]: > [email protected] checks /pkg/src/browser-laptop
585  [02/07/2018 04:15PM]: > [email protected] check-security /pkg/src/browser-laptop
586  [02/07/2018 04:15PM]: (+) 5 vulnerabilities found
587  [02/07/2018 04:15PM]: ┌───────────────┬─────────────────────────────────────────────────────────────────┐
588  [02/07/2018 04:15PM]: │               │ Regular Expression Denial of Service                            │
589  [02/07/2018 04:15PM]: ├───────────────┼─────────────────────────────────────────────────────────────────┤
590  [02/07/2018 04:15PM]: │ Name          │ moment                                                          │
591  [02/07/2018 04:15PM]: │ CVSS          │ 7.5 (High)592  [02/07/2018 04:15PM]: │ Patched       │ >=2.19.3                                                        │
593  [02/07/2018 04:15PM]: │ Path          │ [email protected] > [email protected] > [email protected] > [email protected]… │
594  [02/07/2018 04:15PM]: │ More Info     │ https://nodesecurity.io/advisories/532                          │
595  [02/07/2018 04:15PM]: └───────────────┴─────────────────────────────────────────────────────────────────┘
596  [02/07/2018 04:15PM]: │ Path          │ [email protected] > [email protected] > [email protected] > meta… │
597  [02/07/2018 04:15PM]: │ Path          │ [email protected] > [email protected] > [email protected]… │
598  [02/07/2018 04:15PM]: │ Path          │ [email protected] > [email protected] > [email protected] > chro… │
599  [02/07/2018 04:15PM]: │ Path          │ [email protected] > [email protected]600  [02/07/2018 04:15PM]: npm ERR! [email protected] check-security: `nsp check`
601  [02/07/2018 04:15PM]: npm ERR! Failed at the [email protected] check-security script.
602  [02/07/2018 04:15PM]: npm ERR! This is probably not a problem with npm. There is likely additional logging output above.
603  [02/07/2018 04:15PM]: npm ERR! A complete log of this run can be found in:
604  [02/07/2018 04:15PM]: npm ERR!     /pkg/src/.npm/_logs/2018-02-07T22_15_31_916Z-debug.log
605  [02/07/2018 04:15PM]: npm ERR! [email protected] checks: `npm run check-security`
606  [02/07/2018 04:15PM]: npm ERR! Failed at the [email protected] checks script.
607  [02/07/2018 04:15PM]: npm ERR!     /pkg/src/.npm/_logs/2018-02-07T22_15_31_929Z-debug.log
608  [02/07/2018 04:15PM]: buildPackage failed { Error: Command failed: echo cleaning up target...&&rm -Rf Brave-linux-x64&&rm -Rf dist&&rm -f Brave.tar.bz2&&echo done&&echo starting build...&&./node_modules/.bin/webpack&&npm run checks&&node ./node_modules/electron-packager/cli.js . Brave --overwrite --ignore=pre-commit|pre-push|test/|docs/|tools/|signcode-tf|rx|nslog|eslint|cppunitlite|caniuse-db|cross-env|spectron|\.(0|13ctype|APACHE2|BSD|DOCS|DS_Store|LESSER|Makefile|a|ac|aff|after|am|arcconfig|arclint|babelrc|bat|before|bnf|brave-gyp|c|cardinalrc|cc|cfg|closure-compiler|cmake|cmd|covignore|cpp|csv|cxx|d|def|deps|dic|dll|dntrc|dockerignore|dsp|editorconfig|editorconfig~|el|enc|entitlements|eot|esprima|flow|flowconfig|gitattributes|githug|gitignore|gitattributes|gitignore|gitkeep|gitmodules|gnu|gradle|gyp|gypi|gz|h|hbs|hxx|idl|iml|in|inc|include|info|jade|java|jsfmtrc|jshint|jshintignore|jshintrc|jslintrc|jst|js~|keep|lint|lintignore|lock|log|ls|m4|mailmap|map|markdown|md|mdown|md~|mem|min-wd|mk|mkd|mm|mustache|myspell|myspell|name|nsh|nsi|nsprc|nuspec|nvmrc|o|old|orig|otf|param|patch|pegjs|post|pre|pro|py|rej|s|sage|scss|settings|sh|skip|source-map|stamp|swo|tap|targ|template|tern-port|tern-project|testignore|tm_properties|tmp|tpl|ts|txt|un~|vscode|xcf|xml|yaml|yml)$|/deps/|Release/obj|obj.target|ad-block/(node_modules|test|perf|sample|scripts|test|vendor|ABPFilterParserData.dat)|tracking-protection/(node_modules|test|data|scripts|vendor)|tracking-protection/build/node_modules|tracking-protection/build/Release/(sample.exe|test.exe)|sqlite3/src|nsp/node_modules|electron-installer-squirrel-windows|electron-chromedriver|electron-installer-debian|node-notifier/vendor|node-gyp|npm|jsdoc|docs|sinon|electron-download|electron-rebuild|electron-packager|electron-builder|electron-prebuilt|electron-rebuild|electron-winstaller-fixed|muon-winstaller|electron-installer-redhat|flow-bin|babel$|babel-(?!polyfill|regenerator-runtime|preset-env)|jsdom-global|react-addons-perf|react-addons-test-utils|enzyme|git-rev-sync|sqlite3|uglify-js|webdriverio|webpack-dev-server --platform=linux --arch=x64 --version=4.5.15 --icon=res/app.png --asar=true --app-version=0.19.88 --build-version=4.5.15 --protocol=http --protocol-name=HTTP Handler --protocol=https --protocol-name=HTTPS Handler --product-dir-name=brave --version-string.CompanyName=Brave Software --version-string.ProductName=Brave --version-string.Copyright=Copyright 2017, Brave Software --version-string.FileDescription=Brave&&mv Brave-linux-x64/Brave Brave-linux-x64/brave&&ncp ./app/extensions Brave-linux-x64/resources/extensions&&mkdirp Brave-linux-x64/resources/app.asar.unpacked/node_modules/node-anonize2-relic-emscripten&&ncp node_modules/node-anonize2-relic-emscripten/anonize2.js.mem Brave-linux-x64/resources/app.asar.unpacked/node_modules/node-anonize2-relic-emscripten/anonize2.js.mem
609  [02/07/2018 04:15PM]:     at ChildProcess.exithandler (child_process.js:272:12)
610  [02/07/2018 04:15PM]:     at ChildProcess.emit (events.js:160:13)
611  [02/07/2018 04:15PM]:     at maybeClose (internal/child_process.js:943:16)
612  [02/07/2018 04:15PM]:     at Socket.stream.socket.on (internal/child_process.js:363:11)
613  [02/07/2018 04:15PM]:     at Socket.emit (events.js:160:13)
614  [02/07/2018 04:15PM]:     at Pipe._handle.close [as _onclose] (net.js:562:12)
615  [02/07/2018 04:15PM]:   cmd: echo cleaning up target...&&rm -Rf Brave-linux-x64&&rm -Rf dist&&rm -f Brave.tar.bz2&&echo done&&echo starting build...&&./node_modules/.bin/webpack&&npm run checks&&node ./node_modules/electron-packager/cli.js . Brave --overwrite --ignore=pre-commit|pre-push|test/|docs/|tools/|signcode-tf|rx|nslog|eslint|cppunitlite|caniuse-db|cross-env|spectron|\\.(0|13ctype|APACHE2|BSD|DOCS|DS_Store|LESSER|Makefile|a|ac|aff|after|am|arcconfig|arclint|babelrc|bat|before|bnf|brave-gyp|c|cardinalrc|cc|cfg|closure-compiler|cmake|cmd|covignore|cpp|csv|cxx|d|def|deps|dic|dll|dntrc|dockerignore|dsp|editorconfig|editorconfig~|el|enc|entitlements|eot|esprima|flow|flowconfig|gitattributes|githug|gitignore|gitattributes|gitignore|gitkeep|gitmodules|gnu|gradle|gyp|gypi|gz|h|hbs|hxx|idl|iml|in|inc|include|info|jade|java|jsfmtrc|jshint|jshintignore|jshintrc|jslintrc|jst|js~|keep|lint|lintignore|lock|log|ls|m4|mailmap|map|markdown|md|mdown|md~|mem|min-wd|mk|mkd|mm|mustache|myspell|myspell|name|nsh|nsi|nsprc|nuspec|nvmrc|o|old|orig|otf|param|patch|pegjs|post|pre|pro|py|rej|s|sage|scss|settings|sh|skip|source-map|stamp|swo|tap|targ|template|tern-port|tern-project|testignore|tm_properties|tmp|tpl|ts|txt|un~|vscode|xcf|xml|yaml|yml)$|/deps/|Release/obj|obj.target|ad-block/(node_modules|test|perf|sample|scripts|test|vendor|ABPFilterParserData.dat)|tracking-protection/(node_modules|test|data|scripts|vendor)|tracking-protection/build/node_modules|tracking-protection/build/Release/(sample.exe|test.exe)|sqlite3/src|nsp/node_modules|electron-installer-squirrel-windows|electron-chromedriver|electron-installer-debian|node-notifier/vendor|node-gyp|npm|jsdoc|docs|sinon|electron-download|electron-rebuild|electron-packager|electron-builder|electron-prebuilt|electron-rebuild|electron-winstaller-fixed|muon-winstaller|electron-installer-redhat|flow-bin|babel$|babel-(?!polyfill|regenerator-runtime|preset-env)|jsdom-global|react-addons-perf|react-addons-test-utils|enzyme|git-rev-sync|sqlite3|uglify-js|webdriverio|webpack-dev-server --platform=linux --arch=x64 --version=4.5.15 --icon=res/app.png --asar=true --app-version=0.19.88 --build-version=4.5.15 --protocol=http --protocol-name=HTTP Handler --protocol=https --protocol-name=HTTPS Handler --product-dir-name=brave --version-string.CompanyName=Brave Software --version-string.ProductName=Brave --version-string.Copyright=Copyright 2017, Brave Software --version-string.FileDescription=Brave&&mv Brave-linux-x64/Brave Brave-linux-x64/brave&&ncp ./app/extensions Brave-linux-x64/resources/extensions&&mkdirp Brave-linux-x64/resources/app.asar.unpacked/node_modules/node-anonize2-relic-emscripten&&ncp node_modules/node-anonize2-relic-emscripten/anonize2.js.mem Brave-linux-x64/resources/app.asar.unpacked/node_modules/node-anonize2-relic-emscripten/anonize2.js.mem }
616  [02/07/2018 04:15PM]: npm ERR! [email protected] build-package: `node ./tools/buildPackage.js`
617  [02/07/2018 04:15PM]: npm ERR! Failed at the [email protected] build-package script.
618  [02/07/2018 04:15PM]: npm ERR!     /pkg/src/.npm/_logs/2018-02-07T22_15_31_953Z-debug.log
619  [02/07/2018 04:15PM]: ==> ERROR: A failure occurred in build().
620  [02/07/2018 04:15PM]: rm: cannot remove **.pkg.**: No such file or directory
621  [02/07/2018 04:15PM]: [\^/\^/^\^/^\^/\^/\^/^\^/^\^/]  BUILD FAILED  [\^/\^/^\^/^\^/\^/\^/^\^/^\^/]