Build Record

Build Number: 7829

Transaction: 3871
Package: brave
Version: 0.19.134dev-1
Start: 03/03/2018 01:34PM
Finish: 03/03/2018 01:39PM
Result: failed

Build Log

  1 [03/03/2018 01:34PM]: [\^/\^/^\^/^\^/\^/\^/^\^/^\^/]  SETTING UP ENVIRONMENT  [\^/\^/^\^/^\^/\^/\^/^\^/^\^/]
  2  [03/03/2018 01:34PM]: [\^/\^/^\^/^\^/\^/\^/^\^/^\^/]  ADDING UPSTREAM PGP KEYS TO KEYRING  [\^/\^/^\^/^\^/\^/\^/^\^/^\^/]
  3  [03/03/2018 01:34PM]: gpg: WARNING: unsafe ownership on homedir /tmp/antbs/.gnupg
  4  [03/03/2018 01:34PM]: gpg: keybox /tmp/antbs/.gnupg/pubring.kbx created
  5  [03/03/2018 01:35PM]: gpg: key 23EFEFE93C4CFFFE: 1 signature not checked due to a missing key
  6  [03/03/2018 01:35PM]: gpg: /tmp/antbs/.gnupg/trustdb.gpg: trustdb created
  7  [03/03/2018 01:35PM]: gpg: key 23EFEFE93C4CFFFE: public key Italo A. Casas <[email protected]> imported
  8  [03/03/2018 01:35PM]: gpg: key B63B535A4C206CA9: 8 signatures not checked due to missing keys
  9  [03/03/2018 01:35PM]: gpg: key B63B535A4C206CA9: public key Evan Lucas <[email protected]> imported
 10  [03/03/2018 01:35PM]: gpg: key E73BC641CC11F4C8: 14 signatures not checked due to missing keys
 11  [03/03/2018 01:35PM]: gpg: key E73BC641CC11F4C8: public key Myles Borins <[email protected]> imported
 12  [03/03/2018 01:35PM]: gpg: key C273792F7D83545D: 2 signatures not checked due to missing keys
 13  [03/03/2018 01:35PM]: gpg: key C273792F7D83545D: public key Rod Vagg <[email protected]> imported
 14  [03/03/2018 01:35PM]: gpg: key C97EC7A07EDE3FC1: 19 signatures not checked due to missing keys
 15  [03/03/2018 01:35PM]: gpg: key C97EC7A07EDE3FC1: public key keybase.io/jasnell <[email protected]> imported
 16  [03/03/2018 01:35PM]: gpg: key 09FE44734EB7990E: public key Jeremiah Senkpiel <[email protected]> imported
 17  [03/03/2018 01:35PM]: gpg: key 7434390BDBE9B9C5: public key Colin Ihrig <[email protected]> imported
 18  [03/03/2018 01:35PM]: gpg: key 61B7B526D98F0353: 26 signatures not checked due to missing keys
 19  [03/03/2018 01:35PM]: gpg: key 61B7B526D98F0353: public key Mozilla Software Releases <[email protected]> imported
 20  [03/03/2018 01:35PM]: gpg: key 61B7B526D98F0353: Mozilla Software Releases <[email protected]> not changed
 21  [03/03/2018 01:35PM]: gpg: no ultimately trusted keys found
 22  [03/03/2018 01:35PM]: gpg: Total number processed: 9
 23  [03/03/2018 01:35PM]: gpg:               imported: 8
 24  [03/03/2018 01:35PM]: gpg:              unchanged: 1
 25  [03/03/2018 01:35PM]: [\^/\^/^\^/^\^/\^/\^/^\^/^\^/]  SYNCING REPO DATABASES  [\^/\^/^\^/^\^/\^/\^/^\^/^\^/]
 26  [03/03/2018 01:35PM]: :: Synchronizing package databases...
 27  [03/03/2018 01:35PM]: downloading antergos-staging.db...
 28  [03/03/2018 01:35PM]: downloading antergos.db...
 29  [03/03/2018 01:35PM]: downloading core.db...
 30  [03/03/2018 01:35PM]: downloading community.db...
 31  [03/03/2018 01:35PM]: :: Starting full system upgrade...
 32  [03/03/2018 01:35PM]: looking for conflicting packages...
 33  [03/03/2018 01:35PM]: Packages (30) bash-4.4.019-1  bzip2-1.0.6-7  dbus-1.12.4-1  dhcpcd-7.0.1-1  e2fsprogs-1.43.9-1  expect-5.45.4-1  gc-7.6.4-1  gcc-7.3.0-1  gcc-libs-7.3.0-1  git-2.16.2-1  gnupg-2.2.5-1  gnutls-3.5.18-1  gpgme-1.10.0-2  iana-etc-20180221-1  iproute2-4.15.0-1  iptables-1.6.2-2  less-530-1  libnghttp2-1.30.0-1  libsystemd-237.64-1  libtirpc-1.0.2-3  libtool-2.4.6+40+g6ca5e224-4  lz4-1:1.8.1.2-1  mercurial-4.5-1  mpfr-4.0.1-1  ncurses-6.1-3  pacman-mirrorlist-20180224-1  patch-2.7.6-1  pcre2-10.31-1  systemd-237.64-1  systemd-sysvcompat-237.64-1
 34  [03/03/2018 01:35PM]: Total Installed Size:  342.04 MiB
 35  [03/03/2018 01:35PM]: Net Upgrade Size:        2.09 MiB
 36  [03/03/2018 01:35PM]: :: Proceed with installation? [Y/n]
 37  [03/03/2018 01:35PM]: checking package integrity...
 38  [03/03/2018 01:35PM]: checking for file conflicts...
 39  [03/03/2018 01:35PM]: :: Processing package changes...
 40  [03/03/2018 01:35PM]: New optional dependencies for gnupg
 41  [03/03/2018 01:35PM]: upgrading pacman-mirrorlist...
 42  [03/03/2018 01:35PM]: warning: /etc/pacman.d/mirrorlist installed as /etc/pacman.d/mirrorlist.pacnew
 43  [03/03/2018 01:35PM]: upgrading systemd-sysvcompat...
 44  [03/03/2018 01:35PM]: :: Running post-transaction hooks...
 45  [03/03/2018 01:35PM]: (1/5) Updating udev hardware database...
 46  [03/03/2018 01:35PM]: (2/5) Updating system user accounts...
 47  [03/03/2018 01:35PM]: (3/5) Creating temporary files...
 48  [03/03/2018 01:35PM]: (4/5) Arming ConditionNeedsUpdate...
 49  [03/03/2018 01:35PM]: (5/5) Updating the info directory file...
 50  [03/03/2018 01:35PM]: [\^/\^/^\^/^\^/\^/\^/^\^/^\^/]  TRYING BUILD  [\^/\^/^\^/^\^/\^/\^/^\^/^\^/]
 51  [03/03/2018 01:35PM]: [\^/\^/^\^/^\^/\^/\^/^\^/^\^/]  UPDATING SOURCE CHECKSUMS  [\^/\^/^\^/^\^/\^/\^/^\^/^\^/]
 52  [03/03/2018 01:35PM]: ==> Generating checksums for source files...
 53  [03/03/2018 01:35PM]: ==> Making package: brave 0.19.88dev-1 (Sat Mar  3 19:35:21 UTC 2018)
 54  [03/03/2018 01:35PM]: ==> Checking runtime dependencies...
 55  [03/03/2018 01:35PM]: ==> Installing missing dependencies...
 56  [03/03/2018 01:35PM]: :: There are 10 providers available for ttf-font:
 57  [03/03/2018 01:35PM]:    1) ttf-google-fonts-typewolf
 58  [03/03/2018 01:35PM]:    2) noto-fonts  3) noto-fonts-extra  4) ttf-bitstream-vera  5) ttf-croscore  6) ttf-dejavu  7) ttf-freefont
 59  [03/03/2018 01:35PM]:    8) ttf-droid  9) ttf-liberation  10) ttf-ubuntu-font-family
 60  [03/03/2018 01:35PM]: Enter a number (default=1):
 61  [03/03/2018 01:35PM]: warning: dependency cycle detected:
 62  [03/03/2018 01:35PM]: warning: harfbuzz will be installed before its freetype2 dependency
 63  [03/03/2018 01:35PM]: Packages (60) atk-2.26.1-1  avahi-0.7-4  cairo-1.15.10-1  dbus-glib-0.110-1  fontconfig-2.12.6+5+g665584a-1  freetype2-2.9-2  gdk-pixbuf2-2.36.11-1  graphite-1:1.3.10-1  gtk-update-icon-cache-3.22.28-1  harfbuzz-1.7.5-1  hicolor-icon-theme-0.17-1  icu-60.2-1  jasper-2.0.14-1  js-24.2.0-4  libcroco-0.6.12+4+g9ad7287-1  libcups-2.2.6-4  libdaemon-0.14-3  libdatrie-0.2.10-2  libfontenc-1.1.3-1  libjpeg-turbo-1.5.3-1  libpng-1.6.34-2  librsvg-2:2.42.2-1  libthai-0.1.27-1  libtiff-4.0.9-1  libx11-1.6.5-1  libxau-1.0.8-3  libxcb-1.12-1  libxcomposite-0.4.4-2  libxcursor-1.1.15-1  libxdamage-1.1.4-3  libxdmcp-1.1.2-1  libxext-1.3.3-1  libxfixes-5.0.3-2  libxft-2.3.2-1  libxi-1.7.9-1  libxinerama-1.1.3-2  libxml2-2.9.7+4+g72182550-2  libxrandr-1.5.1-2  libxrender-0.9.10-1  lzo-2.10-1  nspr-4.18-1  pango-1.40.14-2  pixman-0.34.0-1  polkit-0.113+34+g29ba7af-1  shared-mime-info-1.9-1  xcb-proto-1.12-3  xorg-fonts-encodings-1.0.4-4  xorg-mkfontdir-1.0.7-8  xorg-mkfontscale-1.1.2-1  xorgproto-2018.4-1  alsa-lib-1.1.5-1  desktop-file-utils-0.23-1  gconf-3.2.6-5  gtk2-2.24.32-1  libgnome-keyring-3.12.0-2  libnotify-0.7.7-1  libxss-1.2.2-2  libxtst-1.2.3-1  nss-3.35-1  ttf-google-fonts-typewolf-17.11.git+2e2caa2-1
 64  [03/03/2018 01:35PM]: Total Download Size:     0.67 MiB
 65  [03/03/2018 01:35PM]: Total Installed Size:  311.30 MiB
 66  [03/03/2018 01:35PM]: downloading xorgproto-2018.4-1-any.pkg.tar.xz...
 67  [03/03/2018 01:35PM]: downloading pango-1.40.14-2-x86_64.pkg.tar.xz...
 68  [03/03/2018 01:35PM]: Optional dependencies for harfbuzz
 69  [03/03/2018 01:35PM]:     cairo: hb-view program [pending]
 70  [03/03/2018 01:35PM]: warning: directory permissions differ on /var/
 71  [03/03/2018 01:35PM]: filesystem: 777  package: 755
 72  [03/03/2018 01:35PM]:   Fontconfig configuration is done via /etc/fonts/conf.avail and conf.d.
 73  [03/03/2018 01:35PM]:   Read /etc/fonts/conf.d/README for more information.
 74  [03/03/2018 01:35PM]:   Configuration via /etc/fonts/local.conf is still possible,
 75  [03/03/2018 01:35PM]:   but is no longer recommended for options available in conf.avail.
 76  [03/03/2018 01:35PM]:   Main systemwide configuration should be done by symlinks
 77  [03/03/2018 01:35PM]:   (especially for autohinting, sub-pixel and lcdfilter):
 78  [03/03/2018 01:35PM]:   ln -s ../conf.avail/XX-foo.conf
 79  [03/03/2018 01:35PM]:   Check also https://wiki.archlinux.org/index.php/Font_Configuration
 80  [03/03/2018 01:35PM]:   and https://wiki.archlinux.org/index.php/Fonts.
 81  [03/03/2018 01:35PM]: Rebuilding fontconfig cache... done.
 82  [03/03/2018 01:35PM]: Optional dependencies for libxcursor
 83  [03/03/2018 01:35PM]:     gnome-themes-standard: fallback icon theme
 84  [03/03/2018 01:35PM]: installing shared-mime-info...
 85  [03/03/2018 01:35PM]: Optional dependencies for libtiff
 86  [03/03/2018 01:35PM]:     freeglut: for using tiffgt
 87  [03/03/2018 01:35PM]: Optional dependencies for avahi
 88  [03/03/2018 01:35PM]:     gtk3: avahi-discover, avahi-discover-standalone, bshell, bssh, bvnc
 89  [03/03/2018 01:35PM]:     gtk2: gtk2 bindings [pending]
 90  [03/03/2018 01:35PM]:     pygtk: avahi-bookmarks
 91  [03/03/2018 01:35PM]:     python2-twisted: avahi-bookmarks
 92  [03/03/2018 01:35PM]:     nss-mdns: NSS support for mDNS
 93  [03/03/2018 01:35PM]:     python-gobject: avahi-discover
 94  [03/03/2018 01:35PM]:     python-dbus: avahi-discover
 95  [03/03/2018 01:35PM]: Optional dependencies for jasper
 96  [03/03/2018 01:35PM]:     jasper-doc: documentation
 97  [03/03/2018 01:35PM]: installing hicolor-icon-theme...
 98  [03/03/2018 01:35PM]: installing gtk-update-icon-cache...
 99  [03/03/2018 01:35PM]: installing desktop-file-utils...
100  [03/03/2018 01:35PM]: Optional dependencies for gtk2
101  [03/03/2018 01:35PM]:     gnome-themes-standard: Default widget theme
102  [03/03/2018 01:35PM]:     adwaita-icon-theme: Default icon theme
103  [03/03/2018 01:35PM]: Optional dependencies for alsa-lib
104  [03/03/2018 01:35PM]:     python2: for python smixer plugin [installed]
105  [03/03/2018 01:35PM]: installing xorg-fonts-encodings...
106  [03/03/2018 01:35PM]: installing xorg-mkfontscale...
107  [03/03/2018 01:35PM]: installing xorg-mkfontdir...
108  [03/03/2018 01:35PM]: Creating X fontdir indices... done.
109  [03/03/2018 01:35PM]: installing ttf-google-fonts-typewolf...
110  [03/03/2018 01:35PM]: installing libgnome-keyring...
111  [03/03/2018 01:35PM]: Optional dependencies for libgnome-keyring
112  [03/03/2018 01:35PM]:     gnome-keyring: key storage service (or use any other service implementing org.freedesktop.secrets)
113  [03/03/2018 01:35PM]: ( 1/10) Updating fontconfig cache...
114  [03/03/2018 01:35PM]: ( 2/10) Probing GDK-Pixbuf loader modules...
115  [03/03/2018 01:35PM]: ( 3/10) Updating GIO module cache...
116  [03/03/2018 01:35PM]: ( 4/10) Probing GTK2 input method modules...
117  [03/03/2018 01:35PM]: ( 5/10) Updating icon theme caches...
118  [03/03/2018 01:35PM]: ( 6/10) Updating system user accounts...
119  [03/03/2018 01:35PM]: ( 7/10) Arming ConditionNeedsUpdate...
120  [03/03/2018 01:35PM]: ( 8/10) Updating the desktop file MIME type cache...
121  [03/03/2018 01:35PM]: ( 9/10) Updating the MIME type database...
122  [03/03/2018 01:35PM]: (10/10) Updating X fontdir indices...
123  [03/03/2018 01:35PM]: Packages (7) c-ares-1.13.0-1  http-parser-2.8.0-1  libuv-1.19.2-1  nodejs-9.7.1-1  openssl-1.0-1.0.2.n-1  semver-5.5.0-1  npm-5.7.1-1
124  [03/03/2018 01:35PM]: Total Download Size:    8.30 MiB
125  [03/03/2018 01:35PM]: Total Installed Size:  46.48 MiB
126  [03/03/2018 01:35PM]: downloading nodejs-9.7.1-1-x86_64.pkg.tar.xz...
127  [03/03/2018 01:35PM]: downloading npm-5.7.1-1-any.pkg.tar.xz...
128  [03/03/2018 01:35PM]: Optional dependencies for openssl-1.0
129  [03/03/2018 01:35PM]:     ca-certificates [installed]
130  [03/03/2018 01:35PM]: Optional dependencies for nodejs
131  [03/03/2018 01:35PM]:     npm: nodejs package manager [pending]
132  [03/03/2018 01:35PM]: Optional dependencies for npm
133  [03/03/2018 01:35PM]:     python2: for node-gyp [installed]
134  [03/03/2018 01:35PM]:   -> Cloning browser-laptop git repo...
135  [03/03/2018 01:35PM]: Cloning into bare repository /pkg/browser-laptop...
136  [03/03/2018 01:35PM]: ==> Validating source files with md5sums...
137  [03/03/2018 01:35PM]:     brave.desktop ... Passed
138  [03/03/2018 01:35PM]:     browser-laptop ... Skipped
139  [03/03/2018 01:35PM]:   -> Creating working copy of browser-laptop git repo...
140  [03/03/2018 01:35PM]: Cloning into browser-laptop...
141  [03/03/2018 01:35PM]: Switched to a new branch makepkg
142  [03/03/2018 01:36PM]: > [email protected] install /pkg/src/browser-laptop/node_modules/dtrace-provider
143  [03/03/2018 01:36PM]: > [email protected] install /pkg/src/browser-laptop/node_modules/sha3
144  [03/03/2018 01:36PM]: make: Entering directory /pkg/src/browser-laptop/node_modules/sha3/build
145  [03/03/2018 01:36PM]:   CXX(target) Release/obj.target/sha3/src/addon.o
146  [03/03/2018 01:36PM]: In file included from ../../nan/nan.h:192:0,
147  [03/03/2018 01:36PM]:                  from ../src/addon.cpp:4:
148  [03/03/2018 01:36PM]: ../../nan/nan_maybe_43_inl.h: In function Nan::Maybe<bool> Nan::ForceSet(v8::Local<v8::Object>, v8::Local<v8::Value>, v8::Local<v8::Value>, v8::PropertyAttribute):
149  [03/03/2018 01:36PM]: ../../nan/nan_maybe_43_inl.h:112:73: warning: v8::Maybe<bool> v8::Object::ForceSet(v8::Local<v8::Context>, v8::Local<v8::Value>, v8::Local<v8::Value>, v8::PropertyAttribute) is deprecated: Use CreateDataProperty / DefineOwnProperty [-Wdeprecated-declarations]
150  [03/03/2018 01:36PM]:    return obj->ForceSet(isolate->GetCurrentContext(), key, value, attribs);
151  [03/03/2018 01:36PM]:                                                                          ^
152  [03/03/2018 01:36PM]: In file included from /pkg/src/.node-gyp/4.5.15/deps/v8/include/v8.h:26:0,
153  [03/03/2018 01:36PM]:                  from /pkg/src/.node-gyp/4.5.15/src/node.h:42,
154  [03/03/2018 01:36PM]:                  from ../src/addon.cpp:1:
155  [03/03/2018 01:36PM]: /pkg/src/.node-gyp/4.5.15/deps/v8/include/v8.h:3115:29: note: declared here
156  [03/03/2018 01:36PM]:                  Maybe<bool> ForceSet(Local<Context> context, Local<Value> key,
157  [03/03/2018 01:36PM]:                              ^
158  [03/03/2018 01:36PM]: /pkg/src/.node-gyp/4.5.15/deps/v8/include/v8config.h:318:3: note: in definition of macro V8_DEPRECATED
159  [03/03/2018 01:36PM]:    declarator __attribute__((deprecated(message)))
160  [03/03/2018 01:36PM]: ../src/addon.cpp: In static member function static Nan::NAN_METHOD_RETURN_TYPE SHA3Hash::New(Nan::NAN_METHOD_ARGS_TYPE):
161  [03/03/2018 01:36PM]: ../src/addon.cpp:49:23: warning: new of type SHA3Hash with extended alignment 32 [-Waligned-new=]
162  [03/03/2018 01:36PM]: ../src/addon.cpp:49:23: note: uses void* operator new(std::size_t), which does not have an alignment parameter
163  [03/03/2018 01:36PM]: ../src/addon.cpp:49:23: note: use -faligned-new to enable C++17 over-aligned new support
164  [03/03/2018 01:36PM]: ../src/addon.cpp:59:58: warning: v8::Local<v8::Object> v8::Function::NewInstance(int, v8::Local<v8::Value>*) const is deprecated: Use maybe version [-Wdeprecated-declarations]
165  [03/03/2018 01:36PM]:     info.GetReturnValue().Set(cons->NewInstance(argc, argv));
166  [03/03/2018 01:36PM]:                                                           ^
167  [03/03/2018 01:36PM]: /pkg/src/.node-gyp/4.5.15/deps/v8/include/v8.h:3844:31: note: declared here
168  [03/03/2018 01:36PM]:                  Local<Object> NewInstance(int argc, Local<Value> argv[]) const);
169  [03/03/2018 01:36PM]:                                ^
170  [03/03/2018 01:36PM]:   CXX(target) Release/obj.target/sha3/src/displayIntermediateValues.o
171  [03/03/2018 01:36PM]:   CXX(target) Release/obj.target/sha3/src/KeccakF-1600-reference.o
172  [03/03/2018 01:36PM]:   CXX(target) Release/obj.target/sha3/src/KeccakNISTInterface.o
173  [03/03/2018 01:36PM]:   CXX(target) Release/obj.target/sha3/src/KeccakSponge.o
174  [03/03/2018 01:36PM]:   SOLINK_MODULE(target) Release/obj.target/sha3.node
175  [03/03/2018 01:36PM]: make: Leaving directory /pkg/src/browser-laptop/node_modules/sha3/build
176  [03/03/2018 01:36PM]: > [email protected] install /pkg/src/browser-laptop/node_modules/bufferutil
177  [03/03/2018 01:36PM]: > prebuild-install || node-gyp rebuild
178  [03/03/2018 01:36PM]: /pkg/src/browser-laptop/node_modules/node-abi/index.js:45
179  [03/03/2018 01:36PM]:   throw new Error(Could not detect abi for version  + target +  and runtime  + runtime + .  Updating node-abi might help solve this issue if it is a new release of  + runtime)
180  [03/03/2018 01:36PM]: Error: Could not detect abi for version 4.5.15 and runtime electron.  Updating node-abi might help solve this issue if it is a new release of electron
181  [03/03/2018 01:36PM]:     at getAbi (/pkg/src/browser-laptop/node_modules/node-abi/index.js:45:9)
182  [03/03/2018 01:36PM]:     at module.exports (/pkg/src/browser-laptop/node_modules/prebuild-install/rc.js:57:12)
183  [03/03/2018 01:36PM]:     at Object.<anonymous> (/pkg/src/browser-laptop/node_modules/prebuild-install/bin.js:9:25)
184  [03/03/2018 01:36PM]:     at Module._compile (module.js:662:30)
185  [03/03/2018 01:36PM]:     at Object.Module._extensions..js (module.js:673:10)
186  [03/03/2018 01:36PM]:     at Module.load (module.js:575:32)
187  [03/03/2018 01:36PM]:     at tryModuleLoad (module.js:515:12)
188  [03/03/2018 01:36PM]:     at Function.Module._load (module.js:507:3)
189  [03/03/2018 01:36PM]:     at Function.Module.runMain (module.js:703:10)
190  [03/03/2018 01:36PM]:     at startup (bootstrap_node.js:193:16)
191  [03/03/2018 01:36PM]: make: Entering directory /pkg/src/browser-laptop/node_modules/bufferutil/build
192  [03/03/2018 01:36PM]:   CXX(target) Release/obj.target/bufferutil/src/bufferutil.o
193  [03/03/2018 01:36PM]: In file included from ../node_modules/nan/nan.h:192:0,
194  [03/03/2018 01:36PM]:                  from ../src/bufferutil.cc:7:
195  [03/03/2018 01:36PM]: ../node_modules/nan/nan_maybe_43_inl.h: In function Nan::Maybe<bool> Nan::ForceSet(v8::Local<v8::Object>, v8::Local<v8::Value>, v8::Local<v8::Value>, v8::PropertyAttribute):
196  [03/03/2018 01:36PM]: ../node_modules/nan/nan_maybe_43_inl.h:112:73: warning: v8::Maybe<bool> v8::Object::ForceSet(v8::Local<v8::Context>, v8::Local<v8::Value>, v8::Local<v8::Value>, v8::PropertyAttribute) is deprecated: Use CreateDataProperty / DefineOwnProperty [-Wdeprecated-declarations]
197  [03/03/2018 01:36PM]:                  from ../node_modules/nan/nan.h:49,
198  [03/03/2018 01:36PM]:   SOLINK_MODULE(target) Release/obj.target/bufferutil.node
199  [03/03/2018 01:36PM]:   COPY Release/bufferutil.node
200  [03/03/2018 01:36PM]: make: Leaving directory /pkg/src/browser-laptop/node_modules/bufferutil/build
201  [03/03/2018 01:36PM]: > [email protected] install /pkg/src/browser-laptop/node_modules/leveldown
202  [03/03/2018 01:36PM]: make: Entering directory /pkg/src/browser-laptop/node_modules/leveldown/build
203  [03/03/2018 01:36PM]:   CXX(target) Release/obj.target/leveldb/deps/leveldb/leveldb-1.20/db/builder.o
204  [03/03/2018 01:36PM]:   CXX(target) Release/obj.target/leveldb/deps/leveldb/leveldb-1.20/db/db_impl.o
205  [03/03/2018 01:36PM]:   CXX(target) Release/obj.target/leveldb/deps/leveldb/leveldb-1.20/db/db_iter.o
206  [03/03/2018 01:36PM]:   CXX(target) Release/obj.target/leveldb/deps/leveldb/leveldb-1.20/db/filename.o
207  [03/03/2018 01:36PM]:   CXX(target) Release/obj.target/leveldb/deps/leveldb/leveldb-1.20/db/dbformat.o
208  [03/03/2018 01:36PM]:   CXX(target) Release/obj.target/leveldb/deps/leveldb/leveldb-1.20/db/log_reader.o
209  [03/03/2018 01:36PM]:   CXX(target) Release/obj.target/leveldb/deps/leveldb/leveldb-1.20/db/log_writer.o
210  [03/03/2018 01:36PM]:   CXX(target) Release/obj.target/leveldb/deps/leveldb/leveldb-1.20/db/memtable.o
211  [03/03/2018 01:36PM]:   CXX(target) Release/obj.target/leveldb/deps/leveldb/leveldb-1.20/db/repair.o
212  [03/03/2018 01:36PM]:   CXX(target) Release/obj.target/leveldb/deps/leveldb/leveldb-1.20/db/table_cache.o
213  [03/03/2018 01:36PM]:   CXX(target) Release/obj.target/leveldb/deps/leveldb/leveldb-1.20/db/version_edit.o
214  [03/03/2018 01:36PM]:   CXX(target) Release/obj.target/leveldb/deps/leveldb/leveldb-1.20/db/version_set.o
215  [03/03/2018 01:36PM]:   CXX(target) Release/obj.target/leveldb/deps/leveldb/leveldb-1.20/db/write_batch.o
216  [03/03/2018 01:36PM]:   CXX(target) Release/obj.target/leveldb/deps/leveldb/leveldb-1.20/helpers/memenv/memenv.o
217  [03/03/2018 01:36PM]:   CXX(target) Release/obj.target/leveldb/deps/leveldb/leveldb-1.20/port/port_posix_sse.o
218  [03/03/2018 01:36PM]:   CXX(target) Release/obj.target/leveldb/deps/leveldb/leveldb-1.20/table/block.o
219  [03/03/2018 01:36PM]:   CXX(target) Release/obj.target/leveldb/deps/leveldb/leveldb-1.20/table/block_builder.o
220  [03/03/2018 01:36PM]:   CXX(target) Release/obj.target/leveldb/deps/leveldb/leveldb-1.20/table/filter_block.o
221  [03/03/2018 01:36PM]:   CXX(target) Release/obj.target/leveldb/deps/leveldb/leveldb-1.20/table/format.o
222  [03/03/2018 01:36PM]:   CXX(target) Release/obj.target/leveldb/deps/leveldb/leveldb-1.20/table/iterator.o
223  [03/03/2018 01:36PM]:   CXX(target) Release/obj.target/leveldb/deps/leveldb/leveldb-1.20/table/merger.o
224  [03/03/2018 01:36PM]:   CXX(target) Release/obj.target/leveldb/deps/leveldb/leveldb-1.20/table/table.o
225  [03/03/2018 01:37PM]:   CXX(target) Release/obj.target/leveldb/deps/leveldb/leveldb-1.20/table/table_builder.o
226  [03/03/2018 01:37PM]:   CXX(target) Release/obj.target/leveldb/deps/leveldb/leveldb-1.20/table/two_level_iterator.o
227  [03/03/2018 01:37PM]:   CXX(target) Release/obj.target/leveldb/deps/leveldb/leveldb-1.20/util/arena.o
228  [03/03/2018 01:37PM]:   CXX(target) Release/obj.target/leveldb/deps/leveldb/leveldb-1.20/util/bloom.o
229  [03/03/2018 01:37PM]:   CXX(target) Release/obj.target/leveldb/deps/leveldb/leveldb-1.20/util/cache.o
230  [03/03/2018 01:37PM]:   CXX(target) Release/obj.target/leveldb/deps/leveldb/leveldb-1.20/util/coding.o
231  [03/03/2018 01:37PM]:   CXX(target) Release/obj.target/leveldb/deps/leveldb/leveldb-1.20/util/comparator.o
232  [03/03/2018 01:37PM]:   CXX(target) Release/obj.target/leveldb/deps/leveldb/leveldb-1.20/util/crc32c.o
233  [03/03/2018 01:37PM]:   CXX(target) Release/obj.target/leveldb/deps/leveldb/leveldb-1.20/util/env.o
234  [03/03/2018 01:37PM]:   CXX(target) Release/obj.target/leveldb/deps/leveldb/leveldb-1.20/util/filter_policy.o
235  [03/03/2018 01:37PM]:   CXX(target) Release/obj.target/leveldb/deps/leveldb/leveldb-1.20/util/hash.o
236  [03/03/2018 01:37PM]: ../deps/leveldb/leveldb-1.20/util/hash.cc: In function uint32_t leveldb::Hash(const char*, size_t, uint32_t):
237  [03/03/2018 01:37PM]: ../deps/leveldb/leveldb-1.20/util/hash.cc:37:9: warning: this statement may fall through [-Wimplicit-fallthrough=]
238  [03/03/2018 01:37PM]:        h += static_cast<unsigned char>(data[2]) << 16;
239  [03/03/2018 01:37PM]:        ~~^~~~~~~~~~~~~~~~~~~~~~~~~~~~~~~~~~~~~~~~~~~~
240  [03/03/2018 01:37PM]: ../deps/leveldb/leveldb-1.20/util/hash.cc:39:5: note: here
241  [03/03/2018 01:37PM]: ../deps/leveldb/leveldb-1.20/util/hash.cc:40:9: warning: this statement may fall through [-Wimplicit-fallthrough=]
242  [03/03/2018 01:37PM]:        h += static_cast<unsigned char>(data[1]) << 8;
243  [03/03/2018 01:37PM]:        ~~^~~~~~~~~~~~~~~~~~~~~~~~~~~~~~~~~~~~~~~~~~~
244  [03/03/2018 01:37PM]: ../deps/leveldb/leveldb-1.20/util/hash.cc:42:5: note: here
245  [03/03/2018 01:37PM]:   CXX(target) Release/obj.target/leveldb/deps/leveldb/leveldb-1.20/util/logging.o
246  [03/03/2018 01:37PM]:   CXX(target) Release/obj.target/leveldb/deps/leveldb/leveldb-1.20/util/options.o
247  [03/03/2018 01:37PM]:   CXX(target) Release/obj.target/leveldb/deps/leveldb/leveldb-1.20/util/status.o
248  [03/03/2018 01:37PM]:   CXX(target) Release/obj.target/leveldb/deps/leveldb/leveldb-1.20/port/port_posix.o
249  [03/03/2018 01:37PM]:   CXX(target) Release/obj.target/leveldb/deps/leveldb/leveldb-1.20/util/env_posix.o
250  [03/03/2018 01:37PM]:   AR(target) Release/obj.target/deps/leveldb/leveldb.a
251  [03/03/2018 01:37PM]:   CXX(target) Release/obj.target/snappy/deps/snappy/snappy-1.1.4/snappy-sinksource.o
252  [03/03/2018 01:37PM]:   CXX(target) Release/obj.target/snappy/deps/snappy/snappy-1.1.4/snappy-stubs-internal.o
253  [03/03/2018 01:37PM]:   CXX(target) Release/obj.target/snappy/deps/snappy/snappy-1.1.4/snappy.o
254  [03/03/2018 01:37PM]:   AR(target) Release/obj.target/deps/snappy/snappy.a
255  [03/03/2018 01:37PM]:   CXX(target) Release/obj.target/leveldown/src/batch.o
256  [03/03/2018 01:37PM]:                  from ../src/batch.cc:3:
257  [03/03/2018 01:37PM]:                  from ../src/batch.cc:1:
258  [03/03/2018 01:37PM]:   CXX(target) Release/obj.target/leveldown/src/batch_async.o
259  [03/03/2018 01:37PM]:                  from ../src/database.h:16,
260  [03/03/2018 01:37PM]:                  from ../src/batch.h:9,
261  [03/03/2018 01:37PM]:                  from ../src/batch_async.cc:8:
262  [03/03/2018 01:37PM]:                  from ../src/batch.h:5,
263  [03/03/2018 01:37PM]:   CXX(target) Release/obj.target/leveldown/src/database.o
264  [03/03/2018 01:37PM]:                  from ../src/leveldown.h:11,
265  [03/03/2018 01:37PM]:                  from ../src/database.cc:12:
266  [03/03/2018 01:37PM]:                  from ../src/database.cc:6:
267  [03/03/2018 01:37PM]:   CXX(target) Release/obj.target/leveldown/src/database_async.o
268  [03/03/2018 01:37PM]:                  from ../src/database_async.cc:12:
269  [03/03/2018 01:37PM]:                  from ../src/database_async.cc:6:
270  [03/03/2018 01:37PM]:   CXX(target) Release/obj.target/leveldown/src/iterator.o
271  [03/03/2018 01:37PM]:                  from ../src/iterator.cc:9:
272  [03/03/2018 01:37PM]:                  from ../src/iterator.cc:6:
273  [03/03/2018 01:37PM]:   CXX(target) Release/obj.target/leveldown/src/iterator_async.o
274  [03/03/2018 01:37PM]:                  from ../src/iterator_async.cc:9:
275  [03/03/2018 01:37PM]:                  from ../src/iterator_async.cc:6:
276  [03/03/2018 01:37PM]:   CXX(target) Release/obj.target/leveldown/src/leveldown.o
277  [03/03/2018 01:37PM]:                  from ../src/leveldown.cc:8:
278  [03/03/2018 01:37PM]:                  from ../src/leveldown.cc:6:
279  [03/03/2018 01:37PM]:   CXX(target) Release/obj.target/leveldown/src/leveldown_async.o
280  [03/03/2018 01:37PM]:                  from ../src/leveldown_async.cc:8:
281  [03/03/2018 01:37PM]:                  from ../src/leveldown.h:8,
282  [03/03/2018 01:37PM]:   SOLINK_MODULE(target) Release/obj.target/leveldown.node
283  [03/03/2018 01:37PM]:   COPY Release/leveldown.node
284  [03/03/2018 01:37PM]: make: Leaving directory /pkg/src/browser-laptop/node_modules/leveldown/build
285  [03/03/2018 01:37PM]: > [email protected] install /pkg/src/browser-laptop/node_modules/prova-lib/node_modules/secp256k1
286  [03/03/2018 01:37PM]: > prebuild-install || node-gyp rebuild || echo Secp256k1 bindings compilation fail. Pure JS implementation will be used.
287  [03/03/2018 01:37PM]: make: Entering directory /pkg/src/browser-laptop/node_modules/prova-lib/node_modules/secp256k1/build
288  [03/03/2018 01:37PM]:   CXX(target) Release/obj.target/secp256k1/src/addon.o
289  [03/03/2018 01:37PM]: In file included from ../../../../nan/nan.h:192:0,
290  [03/03/2018 01:37PM]:                  from ../src/addon.cc:2:
291  [03/03/2018 01:37PM]: ../../../../nan/nan_maybe_43_inl.h: In function Nan::Maybe<bool> Nan::ForceSet(v8::Local<v8::Object>, v8::Local<v8::Value>, v8::Local<v8::Value>, v8::PropertyAttribute):
292  [03/03/2018 01:37PM]: ../../../../nan/nan_maybe_43_inl.h:112:73: warning: v8::Maybe<bool> v8::Object::ForceSet(v8::Local<v8::Context>, v8::Local<v8::Value>, v8::Local<v8::Value>, v8::PropertyAttribute) is deprecated: Use CreateDataProperty / DefineOwnProperty [-Wdeprecated-declarations]
293  [03/03/2018 01:37PM]:                  from ../src/addon.cc:1:
294  [03/03/2018 01:37PM]:   CXX(target) Release/obj.target/secp256k1/src/privatekey.o
295  [03/03/2018 01:37PM]:                  from ../src/privatekey.cc:2:
296  [03/03/2018 01:37PM]:                  from ../src/privatekey.cc:1:
297  [03/03/2018 01:37PM]:   CXX(target) Release/obj.target/secp256k1/src/publickey.o
298  [03/03/2018 01:37PM]:                  from ../src/publickey.cc:3:
299  [03/03/2018 01:37PM]:                  from ../src/publickey.cc:2:
300  [03/03/2018 01:37PM]:   CXX(target) Release/obj.target/secp256k1/src/signature.o
301  [03/03/2018 01:37PM]:                  from ../src/signature.cc:2:
302  [03/03/2018 01:37PM]:                  from ../src/signature.cc:1:
303  [03/03/2018 01:37PM]:   CXX(target) Release/obj.target/secp256k1/src/ecdsa.o
304  [03/03/2018 01:37PM]:                  from ../src/ecdsa.cc:2:
305  [03/03/2018 01:37PM]:                  from ../src/ecdsa.cc:1:
306  [03/03/2018 01:37PM]:   CXX(target) Release/obj.target/secp256k1/src/ecdh.o
307  [03/03/2018 01:37PM]:                  from ../src/ecdh.cc:2:
308  [03/03/2018 01:37PM]:                  from ../src/ecdh.cc:1:
309  [03/03/2018 01:37PM]:   CC(target) Release/obj.target/secp256k1/src/secp256k1-src/src/secp256k1.o
310  [03/03/2018 01:37PM]: ../src/secp256k1-src/src/secp256k1.c: In function secp256k1_ec_pubkey_parse:
311  [03/03/2018 01:37PM]: ../src/secp256k1-src/src/secp256k1.c:22:8: warning: nonnull argument pubkey compared to NULL [-Wnonnull-compare]
312  [03/03/2018 01:37PM]:      if (EXPECT(!(cond), 0)) { \
313  [03/03/2018 01:37PM]: ../src/secp256k1-src/src/secp256k1.c:154:5: note: in expansion of macro ARG_CHECK
314  [03/03/2018 01:37PM]:      ARG_CHECK(pubkey != NULL);
315  [03/03/2018 01:37PM]: ../src/secp256k1-src/src/secp256k1.c:22:8: warning: nonnull argument input compared to NULL [-Wnonnull-compare]
316  [03/03/2018 01:37PM]: ../src/secp256k1-src/src/secp256k1.c:156:5: note: in expansion of macro ARG_CHECK
317  [03/03/2018 01:37PM]:      ARG_CHECK(input != NULL);
318  [03/03/2018 01:37PM]: ../src/secp256k1-src/src/secp256k1.c: In function secp256k1_ec_pubkey_serialize:
319  [03/03/2018 01:37PM]: ../src/secp256k1-src/src/secp256k1.c:22:8: warning: nonnull argument output compared to NULL [-Wnonnull-compare]
320  [03/03/2018 01:37PM]: ../src/secp256k1-src/src/secp256k1.c:175:5: note: in expansion of macro ARG_CHECK
321  [03/03/2018 01:37PM]: ../src/secp256k1-src/src/secp256k1.c:22:8: warning: nonnull argument outputlen compared to NULL [-Wnonnull-compare]
322  [03/03/2018 01:37PM]: ../src/secp256k1-src/src/secp256k1.c:171:5: note: in expansion of macro ARG_CHECK
323  [03/03/2018 01:37PM]:      ARG_CHECK(outputlen != NULL);
324  [03/03/2018 01:37PM]: ../src/secp256k1-src/src/secp256k1.c:177:5: note: in expansion of macro ARG_CHECK
325  [03/03/2018 01:37PM]: ../src/secp256k1-src/src/secp256k1.c: In function secp256k1_ecdsa_signature_parse_der:
326  [03/03/2018 01:37PM]: ../src/secp256k1-src/src/secp256k1.c:22:8: warning: nonnull argument sig compared to NULL [-Wnonnull-compare]
327  [03/03/2018 01:37PM]: ../src/secp256k1-src/src/secp256k1.c:216:5: note: in expansion of macro ARG_CHECK
328  [03/03/2018 01:37PM]:      ARG_CHECK(sig != NULL);
329  [03/03/2018 01:37PM]: ../src/secp256k1-src/src/secp256k1.c:217:5: note: in expansion of macro ARG_CHECK
330  [03/03/2018 01:37PM]: ../src/secp256k1-src/src/secp256k1.c: In function secp256k1_ecdsa_signature_parse_compact:
331  [03/03/2018 01:37PM]: ../src/secp256k1-src/src/secp256k1.c:234:5: note: in expansion of macro ARG_CHECK
332  [03/03/2018 01:37PM]: ../src/secp256k1-src/src/secp256k1.c:22:8: warning: nonnull argument input64 compared to NULL [-Wnonnull-compare]
333  [03/03/2018 01:37PM]: ../src/secp256k1-src/src/secp256k1.c:235:5: note: in expansion of macro ARG_CHECK
334  [03/03/2018 01:37PM]:      ARG_CHECK(input64 != NULL);
335  [03/03/2018 01:37PM]: ../src/secp256k1-src/src/secp256k1.c: In function secp256k1_ecdsa_signature_serialize_der:
336  [03/03/2018 01:37PM]: ../src/secp256k1-src/src/secp256k1.c:253:5: note: in expansion of macro ARG_CHECK
337  [03/03/2018 01:37PM]: ../src/secp256k1-src/src/secp256k1.c:254:5: note: in expansion of macro ARG_CHECK
338  [03/03/2018 01:37PM]: ../src/secp256k1-src/src/secp256k1.c:255:5: note: in expansion of macro ARG_CHECK
339  [03/03/2018 01:37PM]: ../src/secp256k1-src/src/secp256k1.c: In function secp256k1_ecdsa_signature_serialize_compact:
340  [03/03/2018 01:37PM]: ../src/secp256k1-src/src/secp256k1.c:22:8: warning: nonnull argument output64 compared to NULL [-Wnonnull-compare]
341  [03/03/2018 01:37PM]: ../src/secp256k1-src/src/secp256k1.c:265:5: note: in expansion of macro ARG_CHECK
342  [03/03/2018 01:37PM]:      ARG_CHECK(output64 != NULL);
343  [03/03/2018 01:37PM]: ../src/secp256k1-src/src/secp256k1.c:266:5: note: in expansion of macro ARG_CHECK
344  [03/03/2018 01:37PM]: ../src/secp256k1-src/src/secp256k1.c: In function secp256k1_ecdsa_signature_normalize:
345  [03/03/2018 01:37PM]: ../src/secp256k1-src/src/secp256k1.c:22:8: warning: nonnull argument sigin compared to NULL [-Wnonnull-compare]
346  [03/03/2018 01:37PM]: ../src/secp256k1-src/src/secp256k1.c:279:5: note: in expansion of macro ARG_CHECK
347  [03/03/2018 01:37PM]: ../src/secp256k1-src/src/secp256k1.c: In function secp256k1_ecdsa_verify:
348  [03/03/2018 01:37PM]: ../src/secp256k1-src/src/secp256k1.c:300:5: note: in expansion of macro ARG_CHECK
349  [03/03/2018 01:37PM]: ../src/secp256k1-src/src/secp256k1.c:22:8: warning: nonnull argument msg32 compared to NULL [-Wnonnull-compare]
350  [03/03/2018 01:37PM]: ../src/secp256k1-src/src/secp256k1.c:299:5: note: in expansion of macro ARG_CHECK
351  [03/03/2018 01:37PM]: ../src/secp256k1-src/src/secp256k1.c:301:5: note: in expansion of macro ARG_CHECK
352  [03/03/2018 01:37PM]: ../src/secp256k1-src/src/secp256k1.c: In function secp256k1_ecdsa_sign:
353  [03/03/2018 01:37PM]: ../src/secp256k1-src/src/secp256k1.c:22:8: warning: nonnull argument signature compared to NULL [-Wnonnull-compare]
354  [03/03/2018 01:37PM]: ../src/secp256k1-src/src/secp256k1.c:353:5: note: in expansion of macro ARG_CHECK
355  [03/03/2018 01:37PM]: ../src/secp256k1-src/src/secp256k1.c:352:5: note: in expansion of macro ARG_CHECK
356  [03/03/2018 01:37PM]: ../src/secp256k1-src/src/secp256k1.c:22:8: warning: nonnull argument seckey compared to NULL [-Wnonnull-compare]
357  [03/03/2018 01:37PM]: ../src/secp256k1-src/src/secp256k1.c:354:5: note: in expansion of macro ARG_CHECK
358  [03/03/2018 01:37PM]: ../src/secp256k1-src/src/secp256k1.c: In function secp256k1_ec_seckey_verify:
359  [03/03/2018 01:37PM]: ../src/secp256k1-src/src/secp256k1.c:396:5: note: in expansion of macro ARG_CHECK
360  [03/03/2018 01:37PM]: ../src/secp256k1-src/src/secp256k1.c: In function secp256k1_ec_pubkey_create:
361  [03/03/2018 01:37PM]: ../src/secp256k1-src/src/secp256k1.c:411:5: note: in expansion of macro ARG_CHECK
362  [03/03/2018 01:37PM]: ../src/secp256k1-src/src/secp256k1.c:414:5: note: in expansion of macro ARG_CHECK
363  [03/03/2018 01:37PM]: ../src/secp256k1-src/src/secp256k1.c: In function secp256k1_ec_privkey_negate:
364  [03/03/2018 01:37PM]: ../src/secp256k1-src/src/secp256k1.c:430:5: note: in expansion of macro ARG_CHECK
365  [03/03/2018 01:37PM]: ../src/secp256k1-src/src/secp256k1.c: In function secp256k1_ec_pubkey_negate:
366  [03/03/2018 01:37PM]: ../src/secp256k1-src/src/secp256k1.c:443:5: note: in expansion of macro ARG_CHECK
367  [03/03/2018 01:37PM]: ../src/secp256k1-src/src/secp256k1.c: In function secp256k1_ec_privkey_tweak_add:
368  [03/03/2018 01:37PM]: ../src/secp256k1-src/src/secp256k1.c:460:5: note: in expansion of macro ARG_CHECK
369  [03/03/2018 01:37PM]: ../src/secp256k1-src/src/secp256k1.c:22:8: warning: nonnull argument tweak compared to NULL [-Wnonnull-compare]
370  [03/03/2018 01:37PM]: ../src/secp256k1-src/src/secp256k1.c:461:5: note: in expansion of macro ARG_CHECK
371  [03/03/2018 01:37PM]: ../src/secp256k1-src/src/secp256k1.c: In function secp256k1_ec_pubkey_tweak_add:
372  [03/03/2018 01:37PM]: ../src/secp256k1-src/src/secp256k1.c:484:5: note: in expansion of macro ARG_CHECK
373  [03/03/2018 01:37PM]: ../src/secp256k1-src/src/secp256k1.c:485:5: note: in expansion of macro ARG_CHECK
374  [03/03/2018 01:37PM]: ../src/secp256k1-src/src/secp256k1.c: In function secp256k1_ec_privkey_tweak_mul:
375  [03/03/2018 01:37PM]: ../src/secp256k1-src/src/secp256k1.c:507:5: note: in expansion of macro ARG_CHECK
376  [03/03/2018 01:37PM]: ../src/secp256k1-src/src/secp256k1.c:508:5: note: in expansion of macro ARG_CHECK
377  [03/03/2018 01:37PM]: ../src/secp256k1-src/src/secp256k1.c: In function secp256k1_ec_pubkey_tweak_mul:
378  [03/03/2018 01:37PM]: ../src/secp256k1-src/src/secp256k1.c:530:5: note: in expansion of macro ARG_CHECK
379  [03/03/2018 01:37PM]: ../src/secp256k1-src/src/secp256k1.c:531:5: note: in expansion of macro ARG_CHECK
380  [03/03/2018 01:37PM]: ../src/secp256k1-src/src/secp256k1.c: In function secp256k1_ec_pubkey_combine:
381  [03/03/2018 01:37PM]: ../src/secp256k1-src/src/secp256k1.c:22:8: warning: nonnull argument pubnonce compared to NULL [-Wnonnull-compare]
382  [03/03/2018 01:37PM]: ../src/secp256k1-src/src/secp256k1.c:559:5: note: in expansion of macro ARG_CHECK
383  [03/03/2018 01:37PM]: ../src/secp256k1-src/src/secp256k1.c:22:8: warning: nonnull argument pubnonces compared to NULL [-Wnonnull-compare]
384  [03/03/2018 01:37PM]: ../src/secp256k1-src/src/secp256k1.c:562:5: note: in expansion of macro ARG_CHECK
385  [03/03/2018 01:37PM]: ../src/secp256k1-src/src/secp256k1.c: In function secp256k1_ecdsa_recoverable_signature_parse_compact:
386  [03/03/2018 01:37PM]: ../src/secp256k1-src/src/modules/recovery/main_impl.h:44:5: note: in expansion of macro ARG_CHECK
387  [03/03/2018 01:37PM]: ../src/secp256k1-src/src/modules/recovery/main_impl.h:45:5: note: in expansion of macro ARG_CHECK
388  [03/03/2018 01:37PM]: ../src/secp256k1-src/src/secp256k1.c: In function secp256k1_ecdsa_recoverable_signature_serialize_compact:
389  [03/03/2018 01:37PM]: ../src/secp256k1-src/src/modules/recovery/main_impl.h:64:5: note: in expansion of macro ARG_CHECK
390  [03/03/2018 01:37PM]: ../src/secp256k1-src/src/secp256k1.c:22:8: warning: nonnull argument recid compared to NULL [-Wnonnull-compare]
391  [03/03/2018 01:37PM]: ../src/secp256k1-src/src/modules/recovery/main_impl.h:66:5: note: in expansion of macro ARG_CHECK
392  [03/03/2018 01:37PM]: ../src/secp256k1-src/src/modules/recovery/main_impl.h:65:5: note: in expansion of macro ARG_CHECK
393  [03/03/2018 01:37PM]: ../src/secp256k1-src/src/secp256k1.c: In function secp256k1_ecdsa_recoverable_signature_convert:
394  [03/03/2018 01:37PM]: ../src/secp256k1-src/src/modules/recovery/main_impl.h:79:5: note: in expansion of macro ARG_CHECK
395  [03/03/2018 01:37PM]: ../src/secp256k1-src/src/modules/recovery/main_impl.h:80:5: note: in expansion of macro ARG_CHECK
396  [03/03/2018 01:37PM]: ../src/secp256k1-src/src/secp256k1.c: In function secp256k1_ecdsa_sign_recoverable:
397  [03/03/2018 01:37PM]: ../src/secp256k1-src/src/modules/recovery/main_impl.h:132:5: note: in expansion of macro ARG_CHECK
398  [03/03/2018 01:37PM]: ../src/secp256k1-src/src/modules/recovery/main_impl.h:131:5: note: in expansion of macro ARG_CHECK
399  [03/03/2018 01:37PM]: ../src/secp256k1-src/src/modules/recovery/main_impl.h:133:5: note: in expansion of macro ARG_CHECK
400  [03/03/2018 01:37PM]: ../src/secp256k1-src/src/secp256k1.c: In function secp256k1_ecdsa_recover:
401  [03/03/2018 01:37PM]: ../src/secp256k1-src/src/modules/recovery/main_impl.h:179:5: note: in expansion of macro ARG_CHECK
402  [03/03/2018 01:37PM]: ../src/secp256k1-src/src/modules/recovery/main_impl.h:178:5: note: in expansion of macro ARG_CHECK
403  [03/03/2018 01:37PM]: ../src/secp256k1-src/src/modules/recovery/main_impl.h:177:5: note: in expansion of macro ARG_CHECK
404  [03/03/2018 01:37PM]:   CC(target) Release/obj.target/secp256k1/src/secp256k1-src/contrib/lax_der_parsing.o
405  [03/03/2018 01:37PM]:   CC(target) Release/obj.target/secp256k1/src/secp256k1-src/contrib/lax_der_privatekey_parsing.o
406  [03/03/2018 01:37PM]:   SOLINK_MODULE(target) Release/obj.target/secp256k1.node
407  [03/03/2018 01:37PM]: make: Leaving directory /pkg/src/browser-laptop/node_modules/prova-lib/node_modules/secp256k1/build
408  [03/03/2018 01:37PM]: > [email protected] install /pkg/src/browser-laptop/node_modules/secp256k1
409  [03/03/2018 01:37PM]: make: Entering directory /pkg/src/browser-laptop/node_modules/secp256k1/build
410  [03/03/2018 01:37PM]: ../src/secp256k1-src/src/secp256k1.c:433:5: note: in expansion of macro ARG_CHECK
411  [03/03/2018 01:37PM]: ../src/secp256k1-src/src/secp256k1.c:434:5: note: in expansion of macro ARG_CHECK
412  [03/03/2018 01:37PM]: ../src/secp256k1-src/src/secp256k1.c:457:5: note: in expansion of macro ARG_CHECK
413  [03/03/2018 01:37PM]: ../src/secp256k1-src/src/secp256k1.c:458:5: note: in expansion of macro ARG_CHECK
414  [03/03/2018 01:37PM]: ../src/secp256k1-src/src/secp256k1.c:480:5: note: in expansion of macro ARG_CHECK
415  [03/03/2018 01:37PM]: ../src/secp256k1-src/src/secp256k1.c:481:5: note: in expansion of macro ARG_CHECK
416  [03/03/2018 01:37PM]: ../src/secp256k1-src/src/secp256k1.c:503:5: note: in expansion of macro ARG_CHECK
417  [03/03/2018 01:37PM]: ../src/secp256k1-src/src/secp256k1.c:504:5: note: in expansion of macro ARG_CHECK
418  [03/03/2018 01:37PM]: ../src/secp256k1-src/src/secp256k1.c:532:5: note: in expansion of macro ARG_CHECK
419  [03/03/2018 01:37PM]: ../src/secp256k1-src/src/secp256k1.c:535:5: note: in expansion of macro ARG_CHECK
420  [03/03/2018 01:37PM]: make: Leaving directory /pkg/src/browser-laptop/node_modules/secp256k1/build
421  [03/03/2018 01:37PM]: > [email protected] install /pkg/src/browser-laptop/node_modules/spectron/node_modules/electron-chromedriver
422  [03/03/2018 01:37PM]: > node ./download-chromedriver.js
423  [03/03/2018 01:37PM]: > [email protected] install /pkg/src/browser-laptop/node_modules/electron-chromedriver
424  [03/03/2018 01:37PM]: > [email protected] install /pkg/src/browser-laptop/node_modules/keytar
425  [03/03/2018 01:37PM]: make: Entering directory /pkg/src/browser-laptop/node_modules/keytar/build
426  [03/03/2018 01:37PM]:   CXX(target) Release/obj.target/keytar/src/main.o
427  [03/03/2018 01:37PM]:   CXX(target) Release/obj.target/keytar/src/keytar_posix.o
428  [03/03/2018 01:37PM]:   SOLINK_MODULE(target) Release/obj.target/keytar.node
429  [03/03/2018 01:37PM]:   COPY Release/keytar.node
430  [03/03/2018 01:37PM]: make: Leaving directory /pkg/src/browser-laptop/node_modules/keytar/build
431  [03/03/2018 01:37PM]: > [email protected] install /pkg/src/browser-laptop/node_modules/nsp/node_modules/git-validate
432  [03/03/2018 01:37PM]: > [email protected] install /pkg/src/browser-laptop/node_modules/pre-commit
433  [03/03/2018 01:37PM]: (node:1458) MaxListenersExceededWarning: Possible EventEmitter memory leak detected. 11 SIGINT listeners added. Use emitter.setMaxListeners() to increase limit
434  [03/03/2018 01:37PM]: pre-commit: Detected an existing git pre-commit hook
435  [03/03/2018 01:37PM]: pre-commit: Old pre-commit hook backuped to pre-commit.old
436  [03/03/2018 01:37PM]: > [email protected] install /pkg/src/browser-laptop/node_modules/pre-push
437  [03/03/2018 01:37PM]: pre-push: Detected an existing git pre-push hook
438  [03/03/2018 01:37PM]: pre-push: Old pre-push hook backuped to pre-push.old
439  [03/03/2018 01:37PM]: > [email protected] postinstall /pkg/src/browser-laptop/node_modules/bat-publisher/node_modules/tldjs
440  [03/03/2018 01:37PM]: > node ./bin/postinstall.js
441  [03/03/2018 01:37PM]: > [email protected] postinstall /pkg/src/browser-laptop/node_modules/spawn-sync
442  [03/03/2018 01:37PM]: > [email protected] postinstall /pkg/src/browser-laptop/node_modules/electron-prebuilt
443  [03/03/2018 01:37PM]: Downloading brave-v4.5.15-linux-x64.zip
444  [03/03/2018 01:37PM]: [>                                            ] 0.0% (0 B/s)
445  [03/03/2018 01:37PM]: Downloading brave-v4.5.15-linux-x64.zip
446  [03/03/2018 01:37PM]: [>                                            ] 0.0% of 54.92 MB (0 B/s)
447  [03/03/2018 01:37PM]: [>                                            ] 2.4% of 54.92 MB (1.3 MB/s)
448  [03/03/2018 01:37PM]: [===>                                         ] 9.8% of 54.92 MB (5.36 MB/s)
449  [03/03/2018 01:37PM]: [======>                                      ] 17.0% of 54.92 MB (7.46 MB/s)
450  [03/03/2018 01:37PM]: [==========>                                  ] 24.8% of 54.92 MB (9.07 MB/s)
451  [03/03/2018 01:37PM]: [=============>                               ] 32.6% of 54.92 MB (10.23 MB/s)
452  [03/03/2018 01:37PM]: [=================>                           ] 40.5% of 54.92 MB (11.12 MB/s)
453  [03/03/2018 01:37PM]: [====================>                        ] 48.5% of 54.92 MB (11.83 MB/s)
454  [03/03/2018 01:37PM]: [========================>                    ] 56.9% of 54.92 MB (12.5 MB/s)
455  [03/03/2018 01:37PM]: [==============================>              ] 69.5% of 54.92 MB (13.89 MB/s)
456  [03/03/2018 01:37PM]: [====================================>        ] 83.6% of 54.92 MB (15.31 MB/s)
457  [03/03/2018 01:37PM]: [==========================================>  ] 97.2% of 54.92 MB (16.43 MB/s)
458  [03/03/2018 01:37PM]: [============================================>] 100.0% of 54.92 MB (15.69 MB/s)
459  [03/03/2018 01:37PM]: > [email protected] postinstall /pkg/src/browser-laptop/node_modules/flow-bin
460  [03/03/2018 01:37PM]:   ✔ flow binary test passed successfully
461  [03/03/2018 01:37PM]: > [email protected] postinstall /pkg/src/browser-laptop
462  [03/03/2018 01:37PM]: > npm run download-sync-client && webpack
463  [03/03/2018 01:37PM]: > [email protected] download-sync-client /pkg/src/browser-laptop
464  [03/03/2018 01:37PM]: > node ./tools/downloadSyncClient
465  [03/03/2018 01:37PM]: writing sync bundle to /pkg/src/browser-laptop/app/extensions/brave/content/scripts/sync.js
466  [03/03/2018 01:38PM]: Hash: 834a07377273aaeca0ee4481bf6186814d724434da8873207db89a05aecd
467  [03/03/2018 01:38PM]:     Hash: 834a07377273aaeca0ee
468  [03/03/2018 01:38PM]:     Version: webpack 1.15.0
469  [03/03/2018 01:38PM]:                                      Asset       Size  Chunks             Chunk Names
470  [03/03/2018 01:38PM]:       de46bc0216c15ce3302139b3c2af4884.svg  789 bytes          [emitted]
471  [03/03/2018 01:38PM]:       41943a7d37ac5c61823a2a17c4e06070.svg  733 bytes          [emitted]
472  [03/03/2018 01:38PM]:     af7ae505a9eed503f8b8e6982036873e.woff2    77.2 kB          [emitted]
473  [03/03/2018 01:38PM]:      fee66e712a8a08eef5805a46892932ad.woff      98 kB          [emitted]
474  [03/03/2018 01:38PM]:       b06871f281fee6b241d60582ae9369b9.ttf     166 kB          [emitted]
475  [03/03/2018 01:38PM]:       912ec66d7572ff821749319396470bde.svg     444 kB          [emitted]
476  [03/03/2018 01:38PM]:       2ad15189f9772058209b9036ebf8bda1.svg    1.34 kB          [emitted]
477  [03/03/2018 01:38PM]:       292a09c3abb7e423680bb8be4de82460.svg  768 bytes          [emitted]
478  [03/03/2018 01:38PM]:       f9c5944d81cb03f5601faa8815856fc4.svg     1.3 kB          [emitted]
479  [03/03/2018 01:38PM]:       a42c3b4a1de787c14f05edf1ec49c9fd.svg    1.72 kB          [emitted]
480  [03/03/2018 01:38PM]:       dfd0990bd610a78a34d31bd751d140bd.svg    1.72 kB          [emitted]
481  [03/03/2018 01:38PM]:       b6dd4b1292cfd4470e58486c56ad0832.svg    3.69 kB          [emitted]
482  [03/03/2018 01:38PM]:       f3b9223a9b686682b28b618d9f28817e.svg  792 bytes          [emitted]
483  [03/03/2018 01:38PM]:       59023652f84793c67f7775cea1b33195.svg  670 bytes          [emitted]
484  [03/03/2018 01:38PM]:       fbb1a0acb7d12f9e64c82a8cc82aeb66.svg  615 bytes          [emitted]
485  [03/03/2018 01:38PM]:       7e57f5ffe33356122ffb083eecf8f2cf.svg    1.13 kB          [emitted]
486  [03/03/2018 01:38PM]:       ab6512b7dac5700b20f7de361aa47884.svg    1.03 kB          [emitted]
487  [03/03/2018 01:38PM]:       aa1e37293df5a3c347ea3784959aa105.svg  776 bytes          [emitted]
488  [03/03/2018 01:38PM]:       d50f42f7ea312cabab88d8eda5bb14a9.svg    2.88 kB          [emitted]
489  [03/03/2018 01:38PM]:       24e964b96ac35120541941897f6a01e3.svg  869 bytes          [emitted]
490  [03/03/2018 01:38PM]:       222f169694e4d1e956fce5a4fb5ad23d.svg  626 bytes          [emitted]
491  [03/03/2018 01:38PM]:       e606b7f6bbecaced0044c1052a99b7a9.svg    1.06 kB          [emitted]
492  [03/03/2018 01:38PM]:       eb1972095e43719a327e7fc4dd7691a4.svg    1.82 kB          [emitted]
493  [03/03/2018 01:38PM]:       7e7925a41b22d080e00c8d7309745420.svg  378 bytes          [emitted]
494  [03/03/2018 01:38PM]:       196262d2122e55e514d47f9e44b66520.svg  431 bytes          [emitted]
495  [03/03/2018 01:38PM]:       4bb98a05900622845d2e66b433711e32.png    2.93 kB          [emitted]
496  [03/03/2018 01:38PM]:       b6190b89305d7ca6eb2b6a84fb68d7bf.png     2.7 kB          [emitted]
497  [03/03/2018 01:38PM]:       4126c044e93c3caa1faaca0f4ec04e1e.png    11.1 kB          [emitted]
498  [03/03/2018 01:38PM]:       80c2dca1e4c4e1e3f495563a6952ee12.png    25.1 kB          [emitted]
499  [03/03/2018 01:38PM]:       4134ecd741d7d7b79fd1bb41ca3ad4d5.svg  472 bytes          [emitted]
500  [03/03/2018 01:38PM]:       89f9f5560225e5eee776ab6ae8f9f0b3.svg  840 bytes          [emitted]
501  [03/03/2018 01:38PM]:       f5ff01ecdaca34dc1cac01191958b4b3.svg  494 bytes          [emitted]
502  [03/03/2018 01:38PM]:       adc4e1913e1d98de46263c2dad9b914c.svg  820 bytes          [emitted]
503  [03/03/2018 01:38PM]:       bd7efdfbcb45f934ff13bfe5f5de5330.svg  990 bytes          [emitted]
504  [03/03/2018 01:38PM]:       e877f09f64a2ce7ec153e0efdd4ed1a1.svg  861 bytes          [emitted]
505  [03/03/2018 01:38PM]:       21db55dd9ae45888ef8d007135d7e243.svg    1.56 kB          [emitted]
506  [03/03/2018 01:38PM]:       d7876d48e80112e766d737346a616707.svg     1.5 kB          [emitted]
507  [03/03/2018 01:38PM]:       247d2a2d16b90d7364981e7224620a2a.svg  976 bytes          [emitted]
508  [03/03/2018 01:38PM]:       c74aae1d7c31e27b75eb9c779b6fab4c.svg    1.03 kB          [emitted]
509  [03/03/2018 01:38PM]:       674f50d287a8c48dc19ba404d20fe713.eot     166 kB          [emitted]
510  [03/03/2018 01:38PM]:       14ad83ede0f899bd6a66a37194df85c6.svg  934 bytes          [emitted]
511  [03/03/2018 01:38PM]:       493bc2b131dc439f27e05c4d3f4e93e7.png    12.1 kB          [emitted]
512  [03/03/2018 01:38PM]:       392507919f6ec931361b489a56c65ce9.svg  816 bytes          [emitted]
513  [03/03/2018 01:38PM]:       d5a535fdec793b2b9219ef7abfa185ce.svg  205 bytes          [emitted]
514  [03/03/2018 01:38PM]:       5ccced21c6505bfab561c1e015e407e1.svg  239 bytes          [emitted]
515  [03/03/2018 01:38PM]:       23b20b72da217563c4304c07c5206dd0.svg  213 bytes          [emitted]
516  [03/03/2018 01:38PM]:       e008bf562e79f9e1fd5110df9d61627d.svg  355 bytes          [emitted]
517  [03/03/2018 01:38PM]:       c11dbc2db4c1e34f10ac562b48e1d886.svg  289 bytes          [emitted]
518  [03/03/2018 01:38PM]:       430b679826c6e11b1767e7e05649e028.svg  615 bytes          [emitted]
519  [03/03/2018 01:38PM]:       2e7aa1b656ba910260191a20406af15f.svg  618 bytes          [emitted]
520  [03/03/2018 01:38PM]:       38ad268f3a41dc9191cc26857537e4c1.svg  452 bytes          [emitted]
521  [03/03/2018 01:38PM]:       a60b6ab6aaca89b5627cee5fb224ce64.svg  438 bytes          [emitted]
522  [03/03/2018 01:38PM]:       f88876b2519c8cbda6ef6fa17e83eeff.svg  687 bytes          [emitted]
523  [03/03/2018 01:38PM]:       bc90457507bcff2412ad0d500d7f92a9.svg  693 bytes          [emitted]
524  [03/03/2018 01:38PM]:       b6fb7a0b51d3af832d445c02e46d434d.png    2.13 kB          [emitted]
525  [03/03/2018 01:38PM]:       a34dd95ecb584ddb353a854a069d89a1.png    18.1 kB          [emitted]
526  [03/03/2018 01:38PM]:       0c4a088449e73ec59b36bb111c7e03b5.png    5.91 kB          [emitted]
527  [03/03/2018 01:38PM]:       69e1af008c893d635dabe4b7feb5f366.png    2.39 kB          [emitted]
528  [03/03/2018 01:38PM]:       51a0855604244165c58b5867df7d5676.png    4.69 kB          [emitted]
529  [03/03/2018 01:38PM]:       1be94b6e3fe1720c770ab40ab0c71cbe.png    7.22 kB          [emitted]
530  [03/03/2018 01:38PM]:       cd1a406ba824513a8d92a2e1418a2977.svg  418 bytes          [emitted]
531  [03/03/2018 01:38PM]:       1acaa76443941825560798bdb3936bf9.svg  437 bytes          [emitted]
532  [03/03/2018 01:38PM]:       3bad0d188335cbfe4a29bd448fa4d0e3.svg  430 bytes          [emitted]
533  [03/03/2018 01:38PM]:       f8aa9b15e2d849c26e84ec0dba7bebae.svg    1.27 kB          [emitted]
534  [03/03/2018 01:38PM]:       cbba55184f62c3df8728928b9016f9d7.svg     1.7 kB          [emitted]
535  [03/03/2018 01:38PM]:       1d10887913956d5ffe996a035b489730.svg    1.51 kB          [emitted]
536  [03/03/2018 01:38PM]:       df9d90f487acc18337a62e10623a2d87.svg    1.21 kB          [emitted]
537  [03/03/2018 01:38PM]:       4816047e6c690868e2f2dfb972e11263.svg    1.09 kB          [emitted]
538  [03/03/2018 01:38PM]:       e27fa9769059ed125a576fe851592410.svg  671 bytes          [emitted]
539  [03/03/2018 01:38PM]:       dafa0bbc64a10f10d65c8eadadd14c0a.svg  890 bytes          [emitted]
540  [03/03/2018 01:38PM]:       dba2dc28147a6dc7176d68287cb3fb74.svg    2.66 kB          [emitted]
541  [03/03/2018 01:38PM]:       8c9c38b16d3e35299481600c10f9bd19.svg  823 bytes          [emitted]
542  [03/03/2018 01:38PM]:       e61458fc4b59fafd5f6bb3a25b6d94ff.svg  824 bytes          [emitted]
543  [03/03/2018 01:38PM]:       f70c25409713b4132e79b004c03ef3cb.svg  428 bytes          [emitted]
544  [03/03/2018 01:38PM]:                        aboutPages.entry.js     4.2 MB       0  [emitted]  aboutPages
545  [03/03/2018 01:38PM]:                               app.entry.js    3.32 MB       1  [emitted]  app
546  [03/03/2018 01:38PM]:                    aboutPages.entry.js.map    5.62 MB       0  [emitted]  aboutPages
547  [03/03/2018 01:38PM]:                           app.entry.js.map    4.61 MB       1  [emitted]  app
548  [03/03/2018 01:38PM]:        [0] multi app 28 bytes {1} [built]
549  [03/03/2018 01:38PM]:        [0] multi aboutPages 28 bytes {0} [built]
550  [03/03/2018 01:38PM]:         + 920 hidden modules
551  [03/03/2018 01:38PM]:     Hash: 4481bf6186814d724434
552  [03/03/2018 01:38PM]:                   Asset    Size  Chunks             Chunk Names
553  [03/03/2018 01:38PM]:         lib.devTools.js  717 kB       0  [emitted]  devTools
554  [03/03/2018 01:38PM]:     lib.devTools.js.map  952 kB       0  [emitted]  devTools
555  [03/03/2018 01:38PM]:        [0] multi devTools 28 bytes {0} [built]
556  [03/03/2018 01:38PM]:         + 54 hidden modules
557  [03/03/2018 01:38PM]:     Hash: da8873207db89a05aecd
558  [03/03/2018 01:38PM]:                    webtorrentPage.entry.js     1.4 MB       0  [emitted]  main
559  [03/03/2018 01:38PM]:                webtorrentPage.entry.js.map    1.72 MB       0  [emitted]  main
560  [03/03/2018 01:38PM]:        [0] multi main 28 bytes {0} [built]
561  [03/03/2018 01:38PM]: npm WARN optional SKIPPING OPTIONAL DEPENDENCY: [email protected] (node_modules/7zip-bin-mac):
562  [03/03/2018 01:38PM]: npm WARN notsup SKIPPING OPTIONAL DEPENDENCY: Unsupported platform for [email protected]: wanted {os:darwin,arch:any} (current: {os:linux,arch:x64})
563  [03/03/2018 01:38PM]: npm WARN optional SKIPPING OPTIONAL DEPENDENCY: [email protected] (node_modules/fsevents):
564  [03/03/2018 01:38PM]: npm WARN notsup SKIPPING OPTIONAL DEPENDENCY: Unsupported platform for [email protected]: wanted {os:darwin,arch:any} (current: {os:linux,arch:x64})
565  [03/03/2018 01:38PM]: added 2326 packages from 1529 contributors in 173.186s
566  [03/03/2018 01:38PM]: > [email protected] build-package /pkg/src/browser-laptop
567  [03/03/2018 01:38PM]: > node ./tools/buildPackage.js
568  [03/03/2018 01:38PM]: Building version 0.19.88 in Brave-linux-x64 with Electron 4.5.15
569  [03/03/2018 01:38PM]: echo cleaning up target...&&rm -Rf Brave-linux-x64&&rm -Rf dist&&rm -f Brave.tar.bz2&&echo done&&echo starting build...&&./node_modules/.bin/webpack&&npm run checks&&node ./node_modules/electron-packager/cli.js . Brave --overwrite --ignore=pre-commit|pre-push|test/|docs/|tools/|signcode-tf|rx|nslog|eslint|cppunitlite|caniuse-db|cross-env|spectron|\.(0|13ctype|APACHE2|BSD|DOCS|DS_Store|LESSER|Makefile|a|ac|aff|after|am|arcconfig|arclint|babelrc|bat|before|bnf|brave-gyp|c|cardinalrc|cc|cfg|closure-compiler|cmake|cmd|covignore|cpp|csv|cxx|d|def|deps|dic|dll|dntrc|dockerignore|dsp|editorconfig|editorconfig~|el|enc|entitlements|eot|esprima|flow|flowconfig|gitattributes|githug|gitignore|gitattributes|gitignore|gitkeep|gitmodules|gnu|gradle|gyp|gypi|gz|h|hbs|hxx|idl|iml|in|inc|include|info|jade|java|jsfmtrc|jshint|jshintignore|jshintrc|jslintrc|jst|js~|keep|lint|lintignore|lock|log|ls|m4|mailmap|map|markdown|md|mdown|md~|mem|min-wd|mk|mkd|mm|mustache|myspell|myspell|name|nsh|nsi|nsprc|nuspec|nvmrc|o|old|orig|otf|param|patch|pegjs|post|pre|pro|py|rej|s|sage|scss|settings|sh|skip|source-map|stamp|swo|tap|targ|template|tern-port|tern-project|testignore|tm_properties|tmp|tpl|ts|txt|un~|vscode|xcf|xml|yaml|yml)$|/deps/|Release/obj|obj.target|ad-block/(node_modules|test|perf|sample|scripts|test|vendor|ABPFilterParserData.dat)|tracking-protection/(node_modules|test|data|scripts|vendor)|tracking-protection/build/node_modules|tracking-protection/build/Release/(sample.exe|test.exe)|sqlite3/src|nsp/node_modules|electron-installer-squirrel-windows|electron-chromedriver|electron-installer-debian|node-notifier/vendor|node-gyp|npm|jsdoc|docs|sinon|electron-download|electron-rebuild|electron-packager|electron-builder|electron-prebuilt|electron-rebuild|electron-winstaller-fixed|muon-winstaller|electron-installer-redhat|flow-bin|babel$|babel-(?!polyfill|regenerator-runtime|preset-env)|jsdom-global|react-addons-perf|react-addons-test-utils|enzyme|git-rev-sync|sqlite3|uglify-js|webdriverio|webpack-dev-server --platform=linux --arch=x64 --version=4.5.15 --icon=res/app.png --asar=true --app-version=0.19.88 --build-version=4.5.15 --protocol=http --protocol-name=HTTP Handler --protocol=https --protocol-name=HTTPS Handler --product-dir-name=brave --version-string.CompanyName=Brave Software --version-string.ProductName=Brave --version-string.Copyright=Copyright 2017, Brave Software --version-string.FileDescription=Brave&&mv Brave-linux-x64/Brave Brave-linux-x64/brave&&ncp ./app/extensions Brave-linux-x64/resources/extensions&&mkdirp Brave-linux-x64/resources/app.asar.unpacked/node_modules/node-anonize2-relic-emscripten&&ncp node_modules/node-anonize2-relic-emscripten/anonize2.js.mem Brave-linux-x64/resources/app.asar.unpacked/node_modules/node-anonize2-relic-emscripten/anonize2.js.mem
570  [03/03/2018 01:39PM]: Hash: b36783f2eda6b011c746393766448e1b3f95556d344503f66c6a3ab49da8
571  [03/03/2018 01:39PM]:     Hash: b36783f2eda6b011c746
572  [03/03/2018 01:39PM]:                        aboutPages.entry.js    4.14 MB       0  [emitted]  aboutPages
573  [03/03/2018 01:39PM]:                               app.entry.js    3.29 MB       1  [emitted]  app
574  [03/03/2018 01:39PM]:                    aboutPages.entry.js.map    5.54 MB       0  [emitted]  aboutPages
575  [03/03/2018 01:39PM]:                           app.entry.js.map    4.56 MB       1  [emitted]  app
576  [03/03/2018 01:39PM]:     ERROR in aboutPages.entry.js from UglifyJs
577  [03/03/2018 01:39PM]:     SyntaxError: Name expected [./app/renderer/components/styles/global.js:5,6]
578  [03/03/2018 01:39PM]:     ERROR in app.entry.js from UglifyJs
579  [03/03/2018 01:39PM]:     Hash: 393766448e1b3f95556d
580  [03/03/2018 01:39PM]:     ERROR in lib.devTools.js from UglifyJs
581  [03/03/2018 01:39PM]:     SyntaxError: Unexpected token: operator (>) [./js/constants/config.js:46,13]
582  [03/03/2018 01:39PM]:     Hash: 344503f66c6a3ab49da8
583  [03/03/2018 01:39PM]:                    webtorrentPage.entry.js    1.35 MB       0  [emitted]  main
584  [03/03/2018 01:39PM]:                webtorrentPage.entry.js.map    1.66 MB       0  [emitted]  main
585  [03/03/2018 01:39PM]:     ERROR in webtorrentPage.entry.js from UglifyJs
586  [03/03/2018 01:39PM]:     SyntaxError: Name expected [./app/renderer/components/styles/commonStyles.js:5,6]
587  [03/03/2018 01:39PM]: > [email protected] checks /pkg/src/browser-laptop
588  [03/03/2018 01:39PM]: > [email protected] check-security /pkg/src/browser-laptop
589  [03/03/2018 01:39PM]: (+) 8 vulnerabilities found
590  [03/03/2018 01:39PM]: ┌───────────────┬─────────────────────────────────────────────────────────────────┐
591  [03/03/2018 01:39PM]: │               │ Regular Expression Denial of Service                            │
592  [03/03/2018 01:39PM]: ├───────────────┼─────────────────────────────────────────────────────────────────┤
593  [03/03/2018 01:39PM]: │ Name          │ moment                                                          │
594  [03/03/2018 01:39PM]: │ CVSS          │ 7.5 (High)595  [03/03/2018 01:39PM]: │ Patched       │ >=2.19.3                                                        │
596  [03/03/2018 01:39PM]: │ Path          │ [email protected] > [email protected] > [email protected] > [email protected]… │
597  [03/03/2018 01:39PM]: │ More Info     │ https://nodesecurity.io/advisories/532                          │
598  [03/03/2018 01:39PM]: └───────────────┴─────────────────────────────────────────────────────────────────┘
599  [03/03/2018 01:39PM]: │ Path          │ [email protected] > [email protected] > [email protected] > meta… │
600  [03/03/2018 01:39PM]: │ Path          │ [email protected] > [email protected] > [email protected]… │
601  [03/03/2018 01:39PM]: │ Path          │ [email protected] > [email protected] > [email protected] > chro… │
602  [03/03/2018 01:39PM]: │ Path          │ [email protected] > [email protected]603  [03/03/2018 01:39PM]: │               │ Prototype pollution attack                                      │
604  [03/03/2018 01:39PM]: │ CVSS          │ 4 (Medium)605  [03/03/2018 01:39PM]: │ Vulnerable    │ <= 4.2.0 || >= 5.0.0 < 5.0.3                                    │
606  [03/03/2018 01:39PM]: │ Patched       │ > 4.2.0 < 5.0.0 || >= 5.0.3                                     │
607  [03/03/2018 01:39PM]: │ Path          │ [email protected] > [email protected] > [email protected] > [email protected]608  [03/03/2018 01:39PM]: │ More Info     │ https://nodesecurity.io/advisories/566                          │
609  [03/03/2018 01:39PM]: │ Path          │ [email protected] > [email protected] > [email protected] > [email protected]610  [03/03/2018 01:39PM]: │ Path          │ [email protected] > [email protected] > [email protected] > [email protected]611  [03/03/2018 01:39PM]: npm ERR! [email protected] check-security: `nsp check`
612  [03/03/2018 01:39PM]: npm ERR! Failed at the [email protected] check-security script.
613  [03/03/2018 01:39PM]: npm ERR! This is probably not a problem with npm. There is likely additional logging output above.
614  [03/03/2018 01:39PM]: npm ERR! A complete log of this run can be found in:
615  [03/03/2018 01:39PM]: npm ERR!     /pkg/src/.npm/_logs/2018-03-03T19_39_26_174Z-debug.log
616  [03/03/2018 01:39PM]: npm ERR! [email protected] checks: `npm run check-security`
617  [03/03/2018 01:39PM]: npm ERR! Failed at the [email protected] checks script.
618  [03/03/2018 01:39PM]: npm ERR!     /pkg/src/.npm/_logs/2018-03-03T19_39_26_185Z-debug.log
619  [03/03/2018 01:39PM]: buildPackage failed { Error: Command failed: echo cleaning up target...&&rm -Rf Brave-linux-x64&&rm -Rf dist&&rm -f Brave.tar.bz2&&echo done&&echo starting build...&&./node_modules/.bin/webpack&&npm run checks&&node ./node_modules/electron-packager/cli.js . Brave --overwrite --ignore=pre-commit|pre-push|test/|docs/|tools/|signcode-tf|rx|nslog|eslint|cppunitlite|caniuse-db|cross-env|spectron|\.(0|13ctype|APACHE2|BSD|DOCS|DS_Store|LESSER|Makefile|a|ac|aff|after|am|arcconfig|arclint|babelrc|bat|before|bnf|brave-gyp|c|cardinalrc|cc|cfg|closure-compiler|cmake|cmd|covignore|cpp|csv|cxx|d|def|deps|dic|dll|dntrc|dockerignore|dsp|editorconfig|editorconfig~|el|enc|entitlements|eot|esprima|flow|flowconfig|gitattributes|githug|gitignore|gitattributes|gitignore|gitkeep|gitmodules|gnu|gradle|gyp|gypi|gz|h|hbs|hxx|idl|iml|in|inc|include|info|jade|java|jsfmtrc|jshint|jshintignore|jshintrc|jslintrc|jst|js~|keep|lint|lintignore|lock|log|ls|m4|mailmap|map|markdown|md|mdown|md~|mem|min-wd|mk|mkd|mm|mustache|myspell|myspell|name|nsh|nsi|nsprc|nuspec|nvmrc|o|old|orig|otf|param|patch|pegjs|post|pre|pro|py|rej|s|sage|scss|settings|sh|skip|source-map|stamp|swo|tap|targ|template|tern-port|tern-project|testignore|tm_properties|tmp|tpl|ts|txt|un~|vscode|xcf|xml|yaml|yml)$|/deps/|Release/obj|obj.target|ad-block/(node_modules|test|perf|sample|scripts|test|vendor|ABPFilterParserData.dat)|tracking-protection/(node_modules|test|data|scripts|vendor)|tracking-protection/build/node_modules|tracking-protection/build/Release/(sample.exe|test.exe)|sqlite3/src|nsp/node_modules|electron-installer-squirrel-windows|electron-chromedriver|electron-installer-debian|node-notifier/vendor|node-gyp|npm|jsdoc|docs|sinon|electron-download|electron-rebuild|electron-packager|electron-builder|electron-prebuilt|electron-rebuild|electron-winstaller-fixed|muon-winstaller|electron-installer-redhat|flow-bin|babel$|babel-(?!polyfill|regenerator-runtime|preset-env)|jsdom-global|react-addons-perf|react-addons-test-utils|enzyme|git-rev-sync|sqlite3|uglify-js|webdriverio|webpack-dev-server --platform=linux --arch=x64 --version=4.5.15 --icon=res/app.png --asar=true --app-version=0.19.88 --build-version=4.5.15 --protocol=http --protocol-name=HTTP Handler --protocol=https --protocol-name=HTTPS Handler --product-dir-name=brave --version-string.CompanyName=Brave Software --version-string.ProductName=Brave --version-string.Copyright=Copyright 2017, Brave Software --version-string.FileDescription=Brave&&mv Brave-linux-x64/Brave Brave-linux-x64/brave&&ncp ./app/extensions Brave-linux-x64/resources/extensions&&mkdirp Brave-linux-x64/resources/app.asar.unpacked/node_modules/node-anonize2-relic-emscripten&&ncp node_modules/node-anonize2-relic-emscripten/anonize2.js.mem Brave-linux-x64/resources/app.asar.unpacked/node_modules/node-anonize2-relic-emscripten/anonize2.js.mem
620  [03/03/2018 01:39PM]:     at ChildProcess.exithandler (child_process.js:273:12)
621  [03/03/2018 01:39PM]:     at ChildProcess.emit (events.js:127:13)
622  [03/03/2018 01:39PM]:     at maybeClose (internal/child_process.js:936:16)
623  [03/03/2018 01:39PM]:     at Process.ChildProcess._handle.onexit (internal/child_process.js:220:5)
624  [03/03/2018 01:39PM]:   cmd: echo cleaning up target...&&rm -Rf Brave-linux-x64&&rm -Rf dist&&rm -f Brave.tar.bz2&&echo done&&echo starting build...&&./node_modules/.bin/webpack&&npm run checks&&node ./node_modules/electron-packager/cli.js . Brave --overwrite --ignore=pre-commit|pre-push|test/|docs/|tools/|signcode-tf|rx|nslog|eslint|cppunitlite|caniuse-db|cross-env|spectron|\\.(0|13ctype|APACHE2|BSD|DOCS|DS_Store|LESSER|Makefile|a|ac|aff|after|am|arcconfig|arclint|babelrc|bat|before|bnf|brave-gyp|c|cardinalrc|cc|cfg|closure-compiler|cmake|cmd|covignore|cpp|csv|cxx|d|def|deps|dic|dll|dntrc|dockerignore|dsp|editorconfig|editorconfig~|el|enc|entitlements|eot|esprima|flow|flowconfig|gitattributes|githug|gitignore|gitattributes|gitignore|gitkeep|gitmodules|gnu|gradle|gyp|gypi|gz|h|hbs|hxx|idl|iml|in|inc|include|info|jade|java|jsfmtrc|jshint|jshintignore|jshintrc|jslintrc|jst|js~|keep|lint|lintignore|lock|log|ls|m4|mailmap|map|markdown|md|mdown|md~|mem|min-wd|mk|mkd|mm|mustache|myspell|myspell|name|nsh|nsi|nsprc|nuspec|nvmrc|o|old|orig|otf|param|patch|pegjs|post|pre|pro|py|rej|s|sage|scss|settings|sh|skip|source-map|stamp|swo|tap|targ|template|tern-port|tern-project|testignore|tm_properties|tmp|tpl|ts|txt|un~|vscode|xcf|xml|yaml|yml)$|/deps/|Release/obj|obj.target|ad-block/(node_modules|test|perf|sample|scripts|test|vendor|ABPFilterParserData.dat)|tracking-protection/(node_modules|test|data|scripts|vendor)|tracking-protection/build/node_modules|tracking-protection/build/Release/(sample.exe|test.exe)|sqlite3/src|nsp/node_modules|electron-installer-squirrel-windows|electron-chromedriver|electron-installer-debian|node-notifier/vendor|node-gyp|npm|jsdoc|docs|sinon|electron-download|electron-rebuild|electron-packager|electron-builder|electron-prebuilt|electron-rebuild|electron-winstaller-fixed|muon-winstaller|electron-installer-redhat|flow-bin|babel$|babel-(?!polyfill|regenerator-runtime|preset-env)|jsdom-global|react-addons-perf|react-addons-test-utils|enzyme|git-rev-sync|sqlite3|uglify-js|webdriverio|webpack-dev-server --platform=linux --arch=x64 --version=4.5.15 --icon=res/app.png --asar=true --app-version=0.19.88 --build-version=4.5.15 --protocol=http --protocol-name=HTTP Handler --protocol=https --protocol-name=HTTPS Handler --product-dir-name=brave --version-string.CompanyName=Brave Software --version-string.ProductName=Brave --version-string.Copyright=Copyright 2017, Brave Software --version-string.FileDescription=Brave&&mv Brave-linux-x64/Brave Brave-linux-x64/brave&&ncp ./app/extensions Brave-linux-x64/resources/extensions&&mkdirp Brave-linux-x64/resources/app.asar.unpacked/node_modules/node-anonize2-relic-emscripten&&ncp node_modules/node-anonize2-relic-emscripten/anonize2.js.mem Brave-linux-x64/resources/app.asar.unpacked/node_modules/node-anonize2-relic-emscripten/anonize2.js.mem }
625  [03/03/2018 01:39PM]: npm ERR! [email protected] build-package: `node ./tools/buildPackage.js`
626  [03/03/2018 01:39PM]: npm ERR! Failed at the [email protected] build-package script.
627  [03/03/2018 01:39PM]: npm ERR!     /pkg/src/.npm/_logs/2018-03-03T19_39_26_213Z-debug.log
628  [03/03/2018 01:39PM]: ==> ERROR: A failure occurred in build().
629  [03/03/2018 01:39PM]: rm: cannot remove **.pkg.**: No such file or directory
630  [03/03/2018 01:39PM]: [\^/\^/^\^/^\^/\^/\^/^\^/^\^/]  BUILD FAILED  [\^/\^/^\^/^\^/\^/\^/^\^/^\^/]