Build Record

Build Number: 7903

Transaction: 3922
Package: brave
Version: 0.19.147dev-1
Start: 04/01/2018 03:04PM
Finish: 04/01/2018 03:09PM
Result: failed

Build Log

  1 [04/01/2018 03:04PM]: [\^/\^/^\^/^\^/\^/\^/^\^/^\^/]  SETTING UP ENVIRONMENT  [\^/\^/^\^/^\^/\^/\^/^\^/^\^/]
  2  [04/01/2018 03:04PM]: [\^/\^/^\^/^\^/\^/\^/^\^/^\^/]  ADDING UPSTREAM PGP KEYS TO KEYRING  [\^/\^/^\^/^\^/\^/\^/^\^/^\^/]
  3  [04/01/2018 03:04PM]: gpg: WARNING: unsafe ownership on homedir /tmp/antbs/.gnupg
  4  [04/01/2018 03:04PM]: gpg: keybox /tmp/antbs/.gnupg/pubring.kbx created
  5  [04/01/2018 03:04PM]: gpg: key 23EFEFE93C4CFFFE: 1 signature not checked due to a missing key
  6  [04/01/2018 03:04PM]: gpg: /tmp/antbs/.gnupg/trustdb.gpg: trustdb created
  7  [04/01/2018 03:04PM]: gpg: key 23EFEFE93C4CFFFE: public key Italo A. Casas <[email protected]> imported
  8  [04/01/2018 03:04PM]: gpg: key B63B535A4C206CA9: 8 signatures not checked due to missing keys
  9  [04/01/2018 03:04PM]: gpg: key B63B535A4C206CA9: public key Evan Lucas <[email protected]> imported
 10  [04/01/2018 03:04PM]: gpg: key E73BC641CC11F4C8: 14 signatures not checked due to missing keys
 11  [04/01/2018 03:04PM]: gpg: key E73BC641CC11F4C8: public key Myles Borins <[email protected]> imported
 12  [04/01/2018 03:04PM]: gpg: key C273792F7D83545D: 2 signatures not checked due to missing keys
 13  [04/01/2018 03:04PM]: gpg: key C273792F7D83545D: public key Rod Vagg <[email protected]> imported
 14  [04/01/2018 03:04PM]: gpg: key C97EC7A07EDE3FC1: 19 signatures not checked due to missing keys
 15  [04/01/2018 03:04PM]: gpg: key C97EC7A07EDE3FC1: public key keybase.io/jasnell <[email protected]> imported
 16  [04/01/2018 03:04PM]: gpg: key 09FE44734EB7990E: public key Jeremiah Senkpiel <[email protected]> imported
 17  [04/01/2018 03:04PM]: gpg: key 7434390BDBE9B9C5: public key Colin Ihrig <[email protected]> imported
 18  [04/01/2018 03:04PM]: gpg: key 61B7B526D98F0353: 26 signatures not checked due to missing keys
 19  [04/01/2018 03:04PM]: gpg: key 61B7B526D98F0353: public key Mozilla Software Releases <[email protected]> imported
 20  [04/01/2018 03:04PM]: gpg: key 61B7B526D98F0353: Mozilla Software Releases <[email protected]> not changed
 21  [04/01/2018 03:04PM]: gpg: no ultimately trusted keys found
 22  [04/01/2018 03:04PM]: gpg: Total number processed: 9
 23  [04/01/2018 03:04PM]: gpg:               imported: 8
 24  [04/01/2018 03:04PM]: gpg:              unchanged: 1
 25  [04/01/2018 03:04PM]: [\^/\^/^\^/^\^/\^/\^/^\^/^\^/]  SYNCING REPO DATABASES  [\^/\^/^\^/^\^/\^/\^/^\^/^\^/]
 26  [04/01/2018 03:04PM]: :: Synchronizing package databases...
 27  [04/01/2018 03:04PM]: downloading antergos-staging.db...
 28  [04/01/2018 03:04PM]: downloading antergos.db...
 29  [04/01/2018 03:04PM]: downloading core.db...
 30  [04/01/2018 03:04PM]: downloading community.db...
 31  [04/01/2018 03:04PM]: :: Starting full system upgrade...
 32  [04/01/2018 03:04PM]: looking for conflicting packages...
 33  [04/01/2018 03:04PM]: Packages (53) archlinux-keyring-20180322-1  bash-4.4.019-1  binutils-2.29.1-3  bzip2-1.0.6-7  ca-certificates-mozilla-3.36-1  cryptsetup-2.0.2-1  curl-7.59.0-2  dbus-1.12.6-1  device-mapper-2.02.177-5  dhcpcd-7.0.1-1  e2fsprogs-1.44.1-1  expect-5.45.4-1  filesystem-2018.1-2  gawk-4.2.1-1  gc-7.6.4-1  gcc-7.3.1+20180312-2  gcc-libs-7.3.1+20180312-2  git-2.16.3-1  glib2-2.56.0+7+g66948ae23-1  gnupg-2.2.5-1  gnutls-3.5.18-1  gpgme-1.10.0-2  iana-etc-20180221-1  iproute2-4.15.0-1  iptables-1.6.2-2  less-530-1  libatomic_ops-7.6.4-1  libcap-ng-0.7.9-1  libgpg-error-1.28-1  libnghttp2-1.31.0-1  libpsl-0.20.1-2  libsystemd-238.51-1  libtirpc-1.0.3-1  libtool-2.4.6+40+g6ca5e224-5  libunistring-0.9.9-1  libutil-linux-2.32-2  lz4-1:1.8.1.2-1  mercurial-4.5.2-1  mpfr-4.0.1-1  nano-2.9.5-1  ncurses-6.1-3  openssl-1.1.0.h-1  p11-kit-0.23.10-1  pacman-mirrorlist-20180224-1  patch-2.7.6-1  pcre2-10.31-1  reflector-2018-1  systemd-238.51-1  systemd-sysvcompat-238.51-1  tcl-8.6.8-2  tzdata-2018d-1  util-linux-2.32-2  wget-1.19.4-3
 34  [04/01/2018 03:04PM]: Total Download Size:     0.42 MiB
 35  [04/01/2018 03:04PM]: Total Installed Size:  433.39 MiB
 36  [04/01/2018 03:04PM]: Net Upgrade Size:        1.66 MiB
 37  [04/01/2018 03:04PM]: :: Proceed with installation? [Y/n]
 38  [04/01/2018 03:04PM]: downloading nano-2.9.5-1-x86_64.pkg.tar.xz...
 39  [04/01/2018 03:04PM]: checking package integrity...
 40  [04/01/2018 03:04PM]: checking for file conflicts...
 41  [04/01/2018 03:04PM]: :: Processing package changes...
 42  [04/01/2018 03:04PM]: upgrading archlinux-keyring...
 43  [04/01/2018 03:04PM]: ==> Appending keys from archlinux.gpg...
 44  [04/01/2018 03:04PM]: ==> Locally signing trusted keys in keyring...
 45  [04/01/2018 03:04PM]:   -> Locally signing key DDB867B92AA789C165EEFA799B729B06A680C281...
 46  [04/01/2018 03:04PM]:   -> Locally signing key 684148BB25B49E986A4944C55184252D824B18E8...
 47  [04/01/2018 03:04PM]:   -> Locally signing key 91FFE0700E80619CEB73235CA88E23E377514E00...
 48  [04/01/2018 03:04PM]:   -> Locally signing key AB19265E5D7D20687D303246BA1DFB64FFF979E7...
 49  [04/01/2018 03:04PM]:   -> Locally signing key 0E8B644079F599DFC1DDC3973348882F6AC6A4C2...
 50  [04/01/2018 03:04PM]: ==> Importing owner trust values...
 51  [04/01/2018 03:04PM]: ==> Disabling revoked keys in keyring...
 52  [04/01/2018 03:04PM]:   -> Disabling key 7FA647CD89891DEDC060287BB9113D1ED21E1A55...
 53  [04/01/2018 03:04PM]:   -> Disabling key D4DE5ABDE2A7287644EAC7E36D1A9E70E19DAA50...
 54  [04/01/2018 03:04PM]:   -> Disabling key 40440DC037C05620984379A6761FAD69BA06C6A9...
 55  [04/01/2018 03:04PM]:   -> Disabling key B1F2C889CB2CCB2ADA36D963097D629E437520BD...
 56  [04/01/2018 03:04PM]:   -> Disabling key BC1FBE4D2826A0B51E47ED62E2539214C6C11350...
 57  [04/01/2018 03:04PM]:   -> Disabling key 63F395DE2D6398BBE458F281F2DBB4931985A992...
 58  [04/01/2018 03:04PM]:   -> Disabling key 8F76BEEA0289F9E1D3E229C05F946DED983D4366...
 59  [04/01/2018 03:04PM]:   -> Disabling key 4FCF887689C41B09506BE8D5F3E1D5C5D30DB0AD...
 60  [04/01/2018 03:04PM]:   -> Disabling key 81D7F8241DB38BC759C80FCE3A726C6170E80477...
 61  [04/01/2018 03:04PM]:   -> Disabling key 5E7585ADFF106BFFBBA319DC654B877A0864983E...
 62  [04/01/2018 03:04PM]:   -> Disabling key E7210A59715F6940CF9A4E36A001876699AD6E84...
 63  [04/01/2018 03:04PM]:   -> Disabling key F5A361A3A13554B85E57DDDAAF7EF7873CFD4BB6...
 64  [04/01/2018 03:04PM]:   -> Disabling key 8CF934E339CAD8ABF342E822E711306E3C4F88BC...
 65  [04/01/2018 03:04PM]:   -> Disabling key 5696C003B0854206450C8E5BE613C09CB4440678...
 66  [04/01/2018 03:04PM]:   -> Disabling key 9515D8A8EAB88E49BB65EDBCE6B456CAF15447D5...
 67  [04/01/2018 03:04PM]:   -> Disabling key 4A8B17E20B88ACA61860009B5CED81B7C2E5C0D2...
 68  [04/01/2018 03:04PM]:   -> Disabling key 0B20CA1931F5DA3A70D0F8D2EA6836E1AB441196...
 69  [04/01/2018 03:04PM]:   -> Disabling key 34C5D94FE7E7913E86DC427E7FB1A3800C84C0A5...
 70  [04/01/2018 03:04PM]:   -> Disabling key 39F880E50E49A4D11341E8F939E4F17F295AFBF4...
 71  [04/01/2018 03:04PM]:   -> Disabling key 66BD74A036D522F51DD70A3C7F2A16726521E06D...
 72  [04/01/2018 03:04PM]:   -> Disabling key 07DFD3A0BC213FA12EDC217559B3122E2FA915EC...
 73  [04/01/2018 03:04PM]:   -> Disabling key 44D4A033AC140143927397D47EFD567D4C7EA887...
 74  [04/01/2018 03:04PM]:   -> Disabling key 27FFC4769E19F096D41D9265A04F9397CDFD6BB0...
 75  [04/01/2018 03:04PM]:   -> Disabling key 8840BD07FC24CB7CE394A07CCF7037A4F27FB7DA...
 76  [04/01/2018 03:04PM]: ==> Updating trust database...
 77  [04/01/2018 03:04PM]: gpg: marginals needed: 3  completes needed: 1  trust model: pgp
 78  [04/01/2018 03:04PM]: gpg: depth: 0  valid:   1  signed:   8  trust: 0-, 0q, 0n, 0m, 0f, 1u
 79  [04/01/2018 03:04PM]: gpg: depth: 1  valid:   8  signed:  74  trust: 0-, 0q, 0n, 8m, 0f, 0u
 80  [04/01/2018 03:04PM]: gpg: depth: 2  valid:  74  signed:   8  trust: 74-, 0q, 0n, 0m, 0f, 0u
 81  [04/01/2018 03:04PM]: gpg: next trustdb check due at 2018-06-25
 82  [04/01/2018 03:04PM]: upgrading ca-certificates-mozilla...
 83  [04/01/2018 03:04PM]: New optional dependencies for gnupg
 84  [04/01/2018 03:04PM]: upgrading pacman-mirrorlist...
 85  [04/01/2018 03:04PM]: warning: /etc/pacman.d/mirrorlist installed as /etc/pacman.d/mirrorlist.pacnew
 86  [04/01/2018 03:04PM]: upgrading systemd-sysvcompat...
 87  [04/01/2018 03:04PM]: :: Running post-transaction hooks...
 88  [04/01/2018 03:04PM]: ( 1/10) Updating journal message catalog...
 89  [04/01/2018 03:04PM]: ( 2/10) Reloading system manager configuration...
 90  [04/01/2018 03:04PM]:   Skipped: Current root is not booted.
 91  [04/01/2018 03:04PM]: ( 3/10) Updating udev hardware database...
 92  [04/01/2018 03:04PM]: ( 4/10) Applying kernel sysctl settings...
 93  [04/01/2018 03:04PM]: ( 5/10) Creating system user accounts...
 94  [04/01/2018 03:04PM]: ( 6/10) Creating temporary files...
 95  [04/01/2018 03:04PM]:   Skipped: Device manager is not running.
 96  [04/01/2018 03:04PM]: ( 8/10) Arming ConditionNeedsUpdate...
 97  [04/01/2018 03:04PM]: ( 9/10) Updating the info directory file...
 98  [04/01/2018 03:04PM]: (10/10) Rebuilding certificate stores...
 99  [04/01/2018 03:04PM]: [\^/\^/^\^/^\^/\^/\^/^\^/^\^/]  TRYING BUILD  [\^/\^/^\^/^\^/\^/\^/^\^/^\^/]
100  [04/01/2018 03:04PM]: [\^/\^/^\^/^\^/\^/\^/^\^/^\^/]  UPDATING SOURCE CHECKSUMS  [\^/\^/^\^/^\^/\^/\^/^\^/^\^/]
101  [04/01/2018 03:04PM]: ==> Generating checksums for source files...
102  [04/01/2018 03:04PM]: ==> Making package: brave 0.19.88dev-1 (Sun Apr  1 20:04:57 UTC 2018)
103  [04/01/2018 03:04PM]: ==> Checking runtime dependencies...
104  [04/01/2018 03:04PM]: ==> Installing missing dependencies...
105  [04/01/2018 03:04PM]: :: There are 10 providers available for ttf-font:
106  [04/01/2018 03:04PM]:    1) ttf-google-fonts-typewolf
107  [04/01/2018 03:04PM]:    2) noto-fonts  3) noto-fonts-extra  4) ttf-bitstream-vera  5) ttf-croscore  6) ttf-dejavu  7) ttf-freefont
108  [04/01/2018 03:04PM]:    8) ttf-droid  9) ttf-liberation  10) ttf-ubuntu-font-family
109  [04/01/2018 03:04PM]: Enter a number (default=1):
110  [04/01/2018 03:04PM]: warning: dependency cycle detected:
111  [04/01/2018 03:04PM]: warning: harfbuzz will be installed before its freetype2 dependency
112  [04/01/2018 03:04PM]: Packages (61) atk-2.28.1-1  avahi-0.7-4  cairo-1.15.10+54+g1ed124ace-1  dbus-glib-0.110-1  fontconfig-2.13.0+10+g58f5285-1  freetype2-2.9-2  fribidi-1.0.1+8+gdf7252b-1  gdk-pixbuf2-2.36.11+70+g00e03a272-1  graphite-1:1.3.11-1  gtk-update-icon-cache-3.22.29+60+ge42d8598ca-1  harfbuzz-1.7.6-2  hicolor-icon-theme-0.17-1  icu-61.1-1  jasper-2.0.14-1  js-24.2.0-4  libcroco-0.6.12+4+g9ad7287-1  libcups-2.2.7-1  libdaemon-0.14-3  libdatrie-0.2.10-2  libfontenc-1.1.3-1  libjpeg-turbo-1.5.3-1  libpng-1.6.34-2  librsvg-2:2.42.3-1  libthai-0.1.27-1  libtiff-4.0.9-1  libx11-1.6.5-1  libxau-1.0.8-3  libxcb-1.13-1  libxcomposite-0.4.4-2  libxcursor-1.1.15-1  libxdamage-1.1.4-3  libxdmcp-1.1.2-1  libxext-1.3.3-1  libxfixes-5.0.3-2  libxft-2.3.2-1  libxi-1.7.9-1  libxinerama-1.1.3-2  libxml2-2.9.8-2  libxrandr-1.5.1-2  libxrender-0.9.10-1  lzo-2.10-1  nspr-4.19-1  pango-1.42.0-1  pixman-0.34.0-1  polkit-0.113+34+g29ba7af-1  shared-mime-info-1.9-1  xcb-proto-1.13-1  xorg-fonts-encodings-1.0.4-4  xorg-mkfontdir-1.0.7-8  xorg-mkfontscale-1.1.3-1  xorgproto-2018.4-1  alsa-lib-1.1.5-1  desktop-file-utils-0.23-1  gconf-3.2.6-5  gtk2-2.24.32-1  libgnome-keyring-3.12.0-2  libnotify-0.7.7-1  libxss-1.2.2-2  libxtst-1.2.3-1  nss-3.36-1  ttf-google-fonts-typewolf-17.11.git+2e2caa2-1
113  [04/01/2018 03:04PM]: Total Installed Size:  312.34 MiB
114  [04/01/2018 03:05PM]: Optional dependencies for harfbuzz
115  [04/01/2018 03:05PM]:     cairo: hb-view program [pending]
116  [04/01/2018 03:05PM]: warning: directory permissions differ on /var/
117  [04/01/2018 03:05PM]: filesystem: 777  package: 755
118  [04/01/2018 03:05PM]:   Fontconfig configuration is done via /etc/fonts/conf.avail and conf.d.
119  [04/01/2018 03:05PM]:   Read /etc/fonts/conf.d/README for more information.
120  [04/01/2018 03:05PM]:   Configuration via /etc/fonts/local.conf is still possible,
121  [04/01/2018 03:05PM]:   but is no longer recommended for options available in conf.avail.
122  [04/01/2018 03:05PM]:   Main systemwide configuration should be done by symlinks
123  [04/01/2018 03:05PM]:   (especially for autohinting, sub-pixel and lcdfilter):
124  [04/01/2018 03:05PM]:   ln -s ../conf.avail/XX-foo.conf
125  [04/01/2018 03:05PM]:   Check also https://wiki.archlinux.org/index.php/Font_Configuration
126  [04/01/2018 03:05PM]:   and https://wiki.archlinux.org/index.php/Fonts.
127  [04/01/2018 03:05PM]: Rebuilding fontconfig cache... done.
128  [04/01/2018 03:05PM]: Optional dependencies for libxcursor
129  [04/01/2018 03:05PM]:     gnome-themes-standard: fallback icon theme
130  [04/01/2018 03:05PM]: installing shared-mime-info...
131  [04/01/2018 03:05PM]: Optional dependencies for libtiff
132  [04/01/2018 03:05PM]:     freeglut: for using tiffgt
133  [04/01/2018 03:05PM]: Optional dependencies for avahi
134  [04/01/2018 03:05PM]:     gtk3: avahi-discover, avahi-discover-standalone, bshell, bssh, bvnc
135  [04/01/2018 03:05PM]:     gtk2: gtk2 bindings [pending]
136  [04/01/2018 03:05PM]:     pygtk: avahi-bookmarks
137  [04/01/2018 03:05PM]:     python2-twisted: avahi-bookmarks
138  [04/01/2018 03:05PM]:     nss-mdns: NSS support for mDNS
139  [04/01/2018 03:05PM]:     python-gobject: avahi-discover
140  [04/01/2018 03:05PM]:     python-dbus: avahi-discover
141  [04/01/2018 03:05PM]: Optional dependencies for jasper
142  [04/01/2018 03:05PM]:     jasper-doc: documentation
143  [04/01/2018 03:05PM]: installing hicolor-icon-theme...
144  [04/01/2018 03:05PM]: installing gtk-update-icon-cache...
145  [04/01/2018 03:05PM]: installing desktop-file-utils...
146  [04/01/2018 03:05PM]: Optional dependencies for gtk2
147  [04/01/2018 03:05PM]:     gnome-themes-standard: Default widget theme
148  [04/01/2018 03:05PM]:     adwaita-icon-theme: Default icon theme
149  [04/01/2018 03:05PM]: Optional dependencies for alsa-lib
150  [04/01/2018 03:05PM]:     python2: for python smixer plugin [installed]
151  [04/01/2018 03:05PM]: installing xorg-fonts-encodings...
152  [04/01/2018 03:05PM]: installing xorg-mkfontscale...
153  [04/01/2018 03:05PM]: installing xorg-mkfontdir...
154  [04/01/2018 03:05PM]: Creating X fontdir indices... done.
155  [04/01/2018 03:05PM]: installing ttf-google-fonts-typewolf...
156  [04/01/2018 03:05PM]: Optional dependencies for libgnome-keyring
157  [04/01/2018 03:05PM]:     gnome-keyring: key storage service (or use any other service implementing org.freedesktop.secrets)
158  [04/01/2018 03:05PM]: ( 1/11) Updating fontconfig cache...
159  [04/01/2018 03:05PM]: ( 2/11) Probing GDK-Pixbuf loader modules...
160  [04/01/2018 03:05PM]: ( 3/11) Updating GIO module cache...
161  [04/01/2018 03:05PM]: ( 4/11) Probing GTK2 input method modules...
162  [04/01/2018 03:05PM]: ( 5/11) Updating icon theme caches...
163  [04/01/2018 03:05PM]: ( 9/11) Updating the desktop file MIME type cache...
164  [04/01/2018 03:05PM]: (10/11) Updating the MIME type database...
165  [04/01/2018 03:05PM]: (11/11) Updating X fontdir indices...
166  [04/01/2018 03:05PM]: Packages (7) c-ares-1.13.0-1  http-parser-2.8.0-1  libuv-1.19.2-1  nodejs-9.10.1-1  openssl-1.0-1.0.2.n-1  semver-5.5.0-1  npm-5.7.1-1
167  [04/01/2018 03:05PM]: Total Download Size:    4.65 MiB
168  [04/01/2018 03:05PM]: Total Installed Size:  46.31 MiB
169  [04/01/2018 03:05PM]: downloading nodejs-9.10.1-1-x86_64.pkg.tar.xz...
170  [04/01/2018 03:05PM]: Optional dependencies for openssl-1.0
171  [04/01/2018 03:05PM]:     ca-certificates [installed]
172  [04/01/2018 03:05PM]: Optional dependencies for nodejs
173  [04/01/2018 03:05PM]:     npm: nodejs package manager [pending]
174  [04/01/2018 03:05PM]: Optional dependencies for npm
175  [04/01/2018 03:05PM]:     python2: for node-gyp [installed]
176  [04/01/2018 03:05PM]: (1/1) Arming ConditionNeedsUpdate...
177  [04/01/2018 03:05PM]:   -> Cloning browser-laptop git repo...
178  [04/01/2018 03:05PM]: Cloning into bare repository /pkg/browser-laptop...
179  [04/01/2018 03:05PM]: ==> Validating source files with md5sums...
180  [04/01/2018 03:05PM]:     brave.desktop ... Passed
181  [04/01/2018 03:05PM]:     browser-laptop ... Skipped
182  [04/01/2018 03:05PM]:   -> Creating working copy of browser-laptop git repo...
183  [04/01/2018 03:05PM]: Cloning into browser-laptop...
184  [04/01/2018 03:05PM]: Switched to a new branch makepkg
185  [04/01/2018 03:06PM]: > [email protected] install /pkg/src/browser-laptop/node_modules/dtrace-provider
186  [04/01/2018 03:06PM]: > [email protected] install /pkg/src/browser-laptop/node_modules/sha3
187  [04/01/2018 03:06PM]: make: Entering directory /pkg/src/browser-laptop/node_modules/sha3/build
188  [04/01/2018 03:06PM]:   CXX(target) Release/obj.target/sha3/src/addon.o
189  [04/01/2018 03:06PM]: In file included from ../../nan/nan.h:192:0,
190  [04/01/2018 03:06PM]:                  from ../src/addon.cpp:4:
191  [04/01/2018 03:06PM]: ../../nan/nan_maybe_43_inl.h: In function Nan::Maybe<bool> Nan::ForceSet(v8::Local<v8::Object>, v8::Local<v8::Value>, v8::Local<v8::Value>, v8::PropertyAttribute):
192  [04/01/2018 03:06PM]: ../../nan/nan_maybe_43_inl.h:112:73: warning: v8::Maybe<bool> v8::Object::ForceSet(v8::Local<v8::Context>, v8::Local<v8::Value>, v8::Local<v8::Value>, v8::PropertyAttribute) is deprecated: Use CreateDataProperty / DefineOwnProperty [-Wdeprecated-declarations]
193  [04/01/2018 03:06PM]:    return obj->ForceSet(isolate->GetCurrentContext(), key, value, attribs);
194  [04/01/2018 03:06PM]:                                                                          ^
195  [04/01/2018 03:06PM]: In file included from /pkg/src/.node-gyp/4.5.15/deps/v8/include/v8.h:26:0,
196  [04/01/2018 03:06PM]:                  from /pkg/src/.node-gyp/4.5.15/src/node.h:42,
197  [04/01/2018 03:06PM]:                  from ../src/addon.cpp:1:
198  [04/01/2018 03:06PM]: /pkg/src/.node-gyp/4.5.15/deps/v8/include/v8.h:3115:29: note: declared here
199  [04/01/2018 03:06PM]:                  Maybe<bool> ForceSet(Local<Context> context, Local<Value> key,
200  [04/01/2018 03:06PM]:                              ^
201  [04/01/2018 03:06PM]: /pkg/src/.node-gyp/4.5.15/deps/v8/include/v8config.h:318:3: note: in definition of macro V8_DEPRECATED
202  [04/01/2018 03:06PM]:    declarator __attribute__((deprecated(message)))
203  [04/01/2018 03:06PM]: ../src/addon.cpp: In static member function static Nan::NAN_METHOD_RETURN_TYPE SHA3Hash::New(Nan::NAN_METHOD_ARGS_TYPE):
204  [04/01/2018 03:06PM]: ../src/addon.cpp:49:23: warning: new of type SHA3Hash with extended alignment 32 [-Waligned-new=]
205  [04/01/2018 03:06PM]: ../src/addon.cpp:49:23: note: uses void* operator new(std::size_t), which does not have an alignment parameter
206  [04/01/2018 03:06PM]: ../src/addon.cpp:49:23: note: use -faligned-new to enable C++17 over-aligned new support
207  [04/01/2018 03:06PM]: ../src/addon.cpp:59:58: warning: v8::Local<v8::Object> v8::Function::NewInstance(int, v8::Local<v8::Value>*) const is deprecated: Use maybe version [-Wdeprecated-declarations]
208  [04/01/2018 03:06PM]:     info.GetReturnValue().Set(cons->NewInstance(argc, argv));
209  [04/01/2018 03:06PM]:                                                           ^
210  [04/01/2018 03:06PM]: /pkg/src/.node-gyp/4.5.15/deps/v8/include/v8.h:3844:31: note: declared here
211  [04/01/2018 03:06PM]:                  Local<Object> NewInstance(int argc, Local<Value> argv[]) const);
212  [04/01/2018 03:06PM]:                                ^
213  [04/01/2018 03:06PM]:   CXX(target) Release/obj.target/sha3/src/displayIntermediateValues.o
214  [04/01/2018 03:06PM]:   CXX(target) Release/obj.target/sha3/src/KeccakF-1600-reference.o
215  [04/01/2018 03:06PM]:   CXX(target) Release/obj.target/sha3/src/KeccakNISTInterface.o
216  [04/01/2018 03:06PM]:   CXX(target) Release/obj.target/sha3/src/KeccakSponge.o
217  [04/01/2018 03:06PM]:   SOLINK_MODULE(target) Release/obj.target/sha3.node
218  [04/01/2018 03:06PM]: make: Leaving directory /pkg/src/browser-laptop/node_modules/sha3/build
219  [04/01/2018 03:06PM]: > [email protected] install /pkg/src/browser-laptop/node_modules/bufferutil
220  [04/01/2018 03:06PM]: > prebuild-install || node-gyp rebuild
221  [04/01/2018 03:06PM]: /pkg/src/browser-laptop/node_modules/node-abi/index.js:45
222  [04/01/2018 03:06PM]:   throw new Error(Could not detect abi for version  + target +  and runtime  + runtime + .  Updating node-abi might help solve this issue if it is a new release of  + runtime)
223  [04/01/2018 03:06PM]: Error: Could not detect abi for version 4.5.15 and runtime electron.  Updating node-abi might help solve this issue if it is a new release of electron
224  [04/01/2018 03:06PM]:     at getAbi (/pkg/src/browser-laptop/node_modules/node-abi/index.js:45:9)
225  [04/01/2018 03:06PM]:     at module.exports (/pkg/src/browser-laptop/node_modules/prebuild-install/rc.js:57:12)
226  [04/01/2018 03:06PM]:     at Object.<anonymous> (/pkg/src/browser-laptop/node_modules/prebuild-install/bin.js:9:25)
227  [04/01/2018 03:06PM]:     at Module._compile (module.js:649:30)
228  [04/01/2018 03:06PM]:     at Object.Module._extensions..js (module.js:660:10)
229  [04/01/2018 03:06PM]:     at Module.load (module.js:561:32)
230  [04/01/2018 03:06PM]:     at tryModuleLoad (module.js:501:12)
231  [04/01/2018 03:06PM]:     at Function.Module._load (module.js:493:3)
232  [04/01/2018 03:06PM]:     at Function.Module.runMain (module.js:690:10)
233  [04/01/2018 03:06PM]:     at startup (bootstrap_node.js:194:16)
234  [04/01/2018 03:06PM]: make: Entering directory /pkg/src/browser-laptop/node_modules/bufferutil/build
235  [04/01/2018 03:06PM]:   CXX(target) Release/obj.target/bufferutil/src/bufferutil.o
236  [04/01/2018 03:06PM]: In file included from ../node_modules/nan/nan.h:192:0,
237  [04/01/2018 03:06PM]:                  from ../src/bufferutil.cc:7:
238  [04/01/2018 03:06PM]: ../node_modules/nan/nan_maybe_43_inl.h: In function Nan::Maybe<bool> Nan::ForceSet(v8::Local<v8::Object>, v8::Local<v8::Value>, v8::Local<v8::Value>, v8::PropertyAttribute):
239  [04/01/2018 03:06PM]: ../node_modules/nan/nan_maybe_43_inl.h:112:73: warning: v8::Maybe<bool> v8::Object::ForceSet(v8::Local<v8::Context>, v8::Local<v8::Value>, v8::Local<v8::Value>, v8::PropertyAttribute) is deprecated: Use CreateDataProperty / DefineOwnProperty [-Wdeprecated-declarations]
240  [04/01/2018 03:06PM]:                  from ../node_modules/nan/nan.h:49,
241  [04/01/2018 03:06PM]:   SOLINK_MODULE(target) Release/obj.target/bufferutil.node
242  [04/01/2018 03:06PM]:   COPY Release/bufferutil.node
243  [04/01/2018 03:06PM]: make: Leaving directory /pkg/src/browser-laptop/node_modules/bufferutil/build
244  [04/01/2018 03:06PM]: > [email protected] install /pkg/src/browser-laptop/node_modules/leveldown
245  [04/01/2018 03:06PM]: make: Entering directory /pkg/src/browser-laptop/node_modules/leveldown/build
246  [04/01/2018 03:06PM]:   CXX(target) Release/obj.target/leveldb/deps/leveldb/leveldb-1.20/db/builder.o
247  [04/01/2018 03:06PM]:   CXX(target) Release/obj.target/leveldb/deps/leveldb/leveldb-1.20/db/db_impl.o
248  [04/01/2018 03:06PM]:   CXX(target) Release/obj.target/leveldb/deps/leveldb/leveldb-1.20/db/db_iter.o
249  [04/01/2018 03:06PM]:   CXX(target) Release/obj.target/leveldb/deps/leveldb/leveldb-1.20/db/filename.o
250  [04/01/2018 03:06PM]:   CXX(target) Release/obj.target/leveldb/deps/leveldb/leveldb-1.20/db/dbformat.o
251  [04/01/2018 03:06PM]:   CXX(target) Release/obj.target/leveldb/deps/leveldb/leveldb-1.20/db/log_reader.o
252  [04/01/2018 03:06PM]:   CXX(target) Release/obj.target/leveldb/deps/leveldb/leveldb-1.20/db/log_writer.o
253  [04/01/2018 03:06PM]:   CXX(target) Release/obj.target/leveldb/deps/leveldb/leveldb-1.20/db/memtable.o
254  [04/01/2018 03:06PM]:   CXX(target) Release/obj.target/leveldb/deps/leveldb/leveldb-1.20/db/repair.o
255  [04/01/2018 03:06PM]:   CXX(target) Release/obj.target/leveldb/deps/leveldb/leveldb-1.20/db/table_cache.o
256  [04/01/2018 03:06PM]:   CXX(target) Release/obj.target/leveldb/deps/leveldb/leveldb-1.20/db/version_edit.o
257  [04/01/2018 03:06PM]:   CXX(target) Release/obj.target/leveldb/deps/leveldb/leveldb-1.20/db/version_set.o
258  [04/01/2018 03:06PM]:   CXX(target) Release/obj.target/leveldb/deps/leveldb/leveldb-1.20/db/write_batch.o
259  [04/01/2018 03:06PM]:   CXX(target) Release/obj.target/leveldb/deps/leveldb/leveldb-1.20/helpers/memenv/memenv.o
260  [04/01/2018 03:06PM]:   CXX(target) Release/obj.target/leveldb/deps/leveldb/leveldb-1.20/port/port_posix_sse.o
261  [04/01/2018 03:06PM]:   CXX(target) Release/obj.target/leveldb/deps/leveldb/leveldb-1.20/table/block.o
262  [04/01/2018 03:06PM]:   CXX(target) Release/obj.target/leveldb/deps/leveldb/leveldb-1.20/table/block_builder.o
263  [04/01/2018 03:06PM]:   CXX(target) Release/obj.target/leveldb/deps/leveldb/leveldb-1.20/table/filter_block.o
264  [04/01/2018 03:06PM]:   CXX(target) Release/obj.target/leveldb/deps/leveldb/leveldb-1.20/table/format.o
265  [04/01/2018 03:06PM]:   CXX(target) Release/obj.target/leveldb/deps/leveldb/leveldb-1.20/table/iterator.o
266  [04/01/2018 03:06PM]:   CXX(target) Release/obj.target/leveldb/deps/leveldb/leveldb-1.20/table/merger.o
267  [04/01/2018 03:07PM]:   CXX(target) Release/obj.target/leveldb/deps/leveldb/leveldb-1.20/table/table.o
268  [04/01/2018 03:07PM]:   CXX(target) Release/obj.target/leveldb/deps/leveldb/leveldb-1.20/table/table_builder.o
269  [04/01/2018 03:07PM]:   CXX(target) Release/obj.target/leveldb/deps/leveldb/leveldb-1.20/table/two_level_iterator.o
270  [04/01/2018 03:07PM]:   CXX(target) Release/obj.target/leveldb/deps/leveldb/leveldb-1.20/util/arena.o
271  [04/01/2018 03:07PM]:   CXX(target) Release/obj.target/leveldb/deps/leveldb/leveldb-1.20/util/bloom.o
272  [04/01/2018 03:07PM]:   CXX(target) Release/obj.target/leveldb/deps/leveldb/leveldb-1.20/util/cache.o
273  [04/01/2018 03:07PM]:   CXX(target) Release/obj.target/leveldb/deps/leveldb/leveldb-1.20/util/coding.o
274  [04/01/2018 03:07PM]:   CXX(target) Release/obj.target/leveldb/deps/leveldb/leveldb-1.20/util/comparator.o
275  [04/01/2018 03:07PM]:   CXX(target) Release/obj.target/leveldb/deps/leveldb/leveldb-1.20/util/crc32c.o
276  [04/01/2018 03:07PM]:   CXX(target) Release/obj.target/leveldb/deps/leveldb/leveldb-1.20/util/env.o
277  [04/01/2018 03:07PM]:   CXX(target) Release/obj.target/leveldb/deps/leveldb/leveldb-1.20/util/filter_policy.o
278  [04/01/2018 03:07PM]:   CXX(target) Release/obj.target/leveldb/deps/leveldb/leveldb-1.20/util/hash.o
279  [04/01/2018 03:07PM]: ../deps/leveldb/leveldb-1.20/util/hash.cc: In function uint32_t leveldb::Hash(const char*, size_t, uint32_t):
280  [04/01/2018 03:07PM]: ../deps/leveldb/leveldb-1.20/util/hash.cc:37:9: warning: this statement may fall through [-Wimplicit-fallthrough=]
281  [04/01/2018 03:07PM]:        h += static_cast<unsigned char>(data[2]) << 16;
282  [04/01/2018 03:07PM]:        ~~^~~~~~~~~~~~~~~~~~~~~~~~~~~~~~~~~~~~~~~~~~~~
283  [04/01/2018 03:07PM]: ../deps/leveldb/leveldb-1.20/util/hash.cc:39:5: note: here
284  [04/01/2018 03:07PM]: ../deps/leveldb/leveldb-1.20/util/hash.cc:40:9: warning: this statement may fall through [-Wimplicit-fallthrough=]
285  [04/01/2018 03:07PM]:        h += static_cast<unsigned char>(data[1]) << 8;
286  [04/01/2018 03:07PM]:        ~~^~~~~~~~~~~~~~~~~~~~~~~~~~~~~~~~~~~~~~~~~~~
287  [04/01/2018 03:07PM]: ../deps/leveldb/leveldb-1.20/util/hash.cc:42:5: note: here
288  [04/01/2018 03:07PM]:   CXX(target) Release/obj.target/leveldb/deps/leveldb/leveldb-1.20/util/logging.o
289  [04/01/2018 03:07PM]:   CXX(target) Release/obj.target/leveldb/deps/leveldb/leveldb-1.20/util/options.o
290  [04/01/2018 03:07PM]:   CXX(target) Release/obj.target/leveldb/deps/leveldb/leveldb-1.20/util/status.o
291  [04/01/2018 03:07PM]:   CXX(target) Release/obj.target/leveldb/deps/leveldb/leveldb-1.20/port/port_posix.o
292  [04/01/2018 03:07PM]:   CXX(target) Release/obj.target/leveldb/deps/leveldb/leveldb-1.20/util/env_posix.o
293  [04/01/2018 03:07PM]:   AR(target) Release/obj.target/deps/leveldb/leveldb.a
294  [04/01/2018 03:07PM]:   CXX(target) Release/obj.target/snappy/deps/snappy/snappy-1.1.4/snappy-sinksource.o
295  [04/01/2018 03:07PM]:   CXX(target) Release/obj.target/snappy/deps/snappy/snappy-1.1.4/snappy-stubs-internal.o
296  [04/01/2018 03:07PM]:   CXX(target) Release/obj.target/snappy/deps/snappy/snappy-1.1.4/snappy.o
297  [04/01/2018 03:07PM]:   AR(target) Release/obj.target/deps/snappy/snappy.a
298  [04/01/2018 03:07PM]:   CXX(target) Release/obj.target/leveldown/src/batch.o
299  [04/01/2018 03:07PM]:                  from ../src/batch.cc:3:
300  [04/01/2018 03:07PM]:                  from ../src/batch.cc:1:
301  [04/01/2018 03:07PM]:   CXX(target) Release/obj.target/leveldown/src/batch_async.o
302  [04/01/2018 03:07PM]:                  from ../src/database.h:16,
303  [04/01/2018 03:07PM]:                  from ../src/batch.h:9,
304  [04/01/2018 03:07PM]:                  from ../src/batch_async.cc:8:
305  [04/01/2018 03:07PM]:                  from ../src/batch.h:5,
306  [04/01/2018 03:07PM]:   CXX(target) Release/obj.target/leveldown/src/database.o
307  [04/01/2018 03:07PM]:                  from ../src/leveldown.h:11,
308  [04/01/2018 03:07PM]:                  from ../src/database.cc:12:
309  [04/01/2018 03:07PM]:                  from ../src/database.cc:6:
310  [04/01/2018 03:07PM]:   CXX(target) Release/obj.target/leveldown/src/database_async.o
311  [04/01/2018 03:07PM]:                  from ../src/database_async.cc:12:
312  [04/01/2018 03:07PM]:                  from ../src/database_async.cc:6:
313  [04/01/2018 03:07PM]:   CXX(target) Release/obj.target/leveldown/src/iterator.o
314  [04/01/2018 03:07PM]:                  from ../src/iterator.cc:9:
315  [04/01/2018 03:07PM]:                  from ../src/iterator.cc:6:
316  [04/01/2018 03:07PM]:   CXX(target) Release/obj.target/leveldown/src/iterator_async.o
317  [04/01/2018 03:07PM]:                  from ../src/iterator_async.cc:9:
318  [04/01/2018 03:07PM]:                  from ../src/iterator_async.cc:6:
319  [04/01/2018 03:07PM]:   CXX(target) Release/obj.target/leveldown/src/leveldown.o
320  [04/01/2018 03:07PM]:                  from ../src/leveldown.cc:8:
321  [04/01/2018 03:07PM]:                  from ../src/leveldown.cc:6:
322  [04/01/2018 03:07PM]:   CXX(target) Release/obj.target/leveldown/src/leveldown_async.o
323  [04/01/2018 03:07PM]:                  from ../src/leveldown_async.cc:8:
324  [04/01/2018 03:07PM]:                  from ../src/leveldown.h:8,
325  [04/01/2018 03:07PM]:   SOLINK_MODULE(target) Release/obj.target/leveldown.node
326  [04/01/2018 03:07PM]:   COPY Release/leveldown.node
327  [04/01/2018 03:07PM]: make: Leaving directory /pkg/src/browser-laptop/node_modules/leveldown/build
328  [04/01/2018 03:07PM]: > [email protected] install /pkg/src/browser-laptop/node_modules/prova-lib/node_modules/secp256k1
329  [04/01/2018 03:07PM]: > prebuild-install || node-gyp rebuild || echo Secp256k1 bindings compilation fail. Pure JS implementation will be used.
330  [04/01/2018 03:07PM]: make: Entering directory /pkg/src/browser-laptop/node_modules/prova-lib/node_modules/secp256k1/build
331  [04/01/2018 03:07PM]:   CXX(target) Release/obj.target/secp256k1/src/addon.o
332  [04/01/2018 03:07PM]: In file included from ../../../../nan/nan.h:192:0,
333  [04/01/2018 03:07PM]:                  from ../src/addon.cc:2:
334  [04/01/2018 03:07PM]: ../../../../nan/nan_maybe_43_inl.h: In function Nan::Maybe<bool> Nan::ForceSet(v8::Local<v8::Object>, v8::Local<v8::Value>, v8::Local<v8::Value>, v8::PropertyAttribute):
335  [04/01/2018 03:07PM]: ../../../../nan/nan_maybe_43_inl.h:112:73: warning: v8::Maybe<bool> v8::Object::ForceSet(v8::Local<v8::Context>, v8::Local<v8::Value>, v8::Local<v8::Value>, v8::PropertyAttribute) is deprecated: Use CreateDataProperty / DefineOwnProperty [-Wdeprecated-declarations]
336  [04/01/2018 03:07PM]:                  from ../src/addon.cc:1:
337  [04/01/2018 03:07PM]:   CXX(target) Release/obj.target/secp256k1/src/privatekey.o
338  [04/01/2018 03:07PM]:                  from ../src/privatekey.cc:2:
339  [04/01/2018 03:07PM]:                  from ../src/privatekey.cc:1:
340  [04/01/2018 03:07PM]:   CXX(target) Release/obj.target/secp256k1/src/publickey.o
341  [04/01/2018 03:07PM]:                  from ../src/publickey.cc:3:
342  [04/01/2018 03:07PM]:                  from ../src/publickey.cc:2:
343  [04/01/2018 03:07PM]:   CXX(target) Release/obj.target/secp256k1/src/signature.o
344  [04/01/2018 03:07PM]:                  from ../src/signature.cc:2:
345  [04/01/2018 03:07PM]:                  from ../src/signature.cc:1:
346  [04/01/2018 03:07PM]:   CXX(target) Release/obj.target/secp256k1/src/ecdsa.o
347  [04/01/2018 03:07PM]:                  from ../src/ecdsa.cc:2:
348  [04/01/2018 03:07PM]:                  from ../src/ecdsa.cc:1:
349  [04/01/2018 03:07PM]:   CXX(target) Release/obj.target/secp256k1/src/ecdh.o
350  [04/01/2018 03:07PM]:                  from ../src/ecdh.cc:2:
351  [04/01/2018 03:07PM]:                  from ../src/ecdh.cc:1:
352  [04/01/2018 03:07PM]:   CC(target) Release/obj.target/secp256k1/src/secp256k1-src/src/secp256k1.o
353  [04/01/2018 03:07PM]: ../src/secp256k1-src/src/secp256k1.c: In function secp256k1_ec_pubkey_parse:
354  [04/01/2018 03:07PM]: ../src/secp256k1-src/src/secp256k1.c:22:8: warning: nonnull argument pubkey compared to NULL [-Wnonnull-compare]
355  [04/01/2018 03:07PM]:      if (EXPECT(!(cond), 0)) { \
356  [04/01/2018 03:07PM]: ../src/secp256k1-src/src/secp256k1.c:154:5: note: in expansion of macro ARG_CHECK
357  [04/01/2018 03:07PM]:      ARG_CHECK(pubkey != NULL);
358  [04/01/2018 03:07PM]: ../src/secp256k1-src/src/secp256k1.c:22:8: warning: nonnull argument input compared to NULL [-Wnonnull-compare]
359  [04/01/2018 03:07PM]: ../src/secp256k1-src/src/secp256k1.c:156:5: note: in expansion of macro ARG_CHECK
360  [04/01/2018 03:07PM]:      ARG_CHECK(input != NULL);
361  [04/01/2018 03:07PM]: ../src/secp256k1-src/src/secp256k1.c: In function secp256k1_ec_pubkey_serialize:
362  [04/01/2018 03:07PM]: ../src/secp256k1-src/src/secp256k1.c:22:8: warning: nonnull argument output compared to NULL [-Wnonnull-compare]
363  [04/01/2018 03:07PM]: ../src/secp256k1-src/src/secp256k1.c:175:5: note: in expansion of macro ARG_CHECK
364  [04/01/2018 03:07PM]: ../src/secp256k1-src/src/secp256k1.c:22:8: warning: nonnull argument outputlen compared to NULL [-Wnonnull-compare]
365  [04/01/2018 03:07PM]: ../src/secp256k1-src/src/secp256k1.c:171:5: note: in expansion of macro ARG_CHECK
366  [04/01/2018 03:07PM]:      ARG_CHECK(outputlen != NULL);
367  [04/01/2018 03:07PM]: ../src/secp256k1-src/src/secp256k1.c:177:5: note: in expansion of macro ARG_CHECK
368  [04/01/2018 03:07PM]: ../src/secp256k1-src/src/secp256k1.c: In function secp256k1_ecdsa_signature_parse_der:
369  [04/01/2018 03:07PM]: ../src/secp256k1-src/src/secp256k1.c:22:8: warning: nonnull argument sig compared to NULL [-Wnonnull-compare]
370  [04/01/2018 03:07PM]: ../src/secp256k1-src/src/secp256k1.c:216:5: note: in expansion of macro ARG_CHECK
371  [04/01/2018 03:07PM]:      ARG_CHECK(sig != NULL);
372  [04/01/2018 03:07PM]: ../src/secp256k1-src/src/secp256k1.c:217:5: note: in expansion of macro ARG_CHECK
373  [04/01/2018 03:07PM]: ../src/secp256k1-src/src/secp256k1.c: In function secp256k1_ecdsa_signature_parse_compact:
374  [04/01/2018 03:07PM]: ../src/secp256k1-src/src/secp256k1.c:234:5: note: in expansion of macro ARG_CHECK
375  [04/01/2018 03:07PM]: ../src/secp256k1-src/src/secp256k1.c:22:8: warning: nonnull argument input64 compared to NULL [-Wnonnull-compare]
376  [04/01/2018 03:07PM]: ../src/secp256k1-src/src/secp256k1.c:235:5: note: in expansion of macro ARG_CHECK
377  [04/01/2018 03:07PM]:      ARG_CHECK(input64 != NULL);
378  [04/01/2018 03:07PM]: ../src/secp256k1-src/src/secp256k1.c: In function secp256k1_ecdsa_signature_serialize_der:
379  [04/01/2018 03:07PM]: ../src/secp256k1-src/src/secp256k1.c:253:5: note: in expansion of macro ARG_CHECK
380  [04/01/2018 03:07PM]: ../src/secp256k1-src/src/secp256k1.c:254:5: note: in expansion of macro ARG_CHECK
381  [04/01/2018 03:07PM]: ../src/secp256k1-src/src/secp256k1.c:255:5: note: in expansion of macro ARG_CHECK
382  [04/01/2018 03:07PM]: ../src/secp256k1-src/src/secp256k1.c: In function secp256k1_ecdsa_signature_serialize_compact:
383  [04/01/2018 03:07PM]: ../src/secp256k1-src/src/secp256k1.c:22:8: warning: nonnull argument output64 compared to NULL [-Wnonnull-compare]
384  [04/01/2018 03:07PM]: ../src/secp256k1-src/src/secp256k1.c:265:5: note: in expansion of macro ARG_CHECK
385  [04/01/2018 03:07PM]:      ARG_CHECK(output64 != NULL);
386  [04/01/2018 03:07PM]: ../src/secp256k1-src/src/secp256k1.c:266:5: note: in expansion of macro ARG_CHECK
387  [04/01/2018 03:07PM]: ../src/secp256k1-src/src/secp256k1.c: In function secp256k1_ecdsa_signature_normalize:
388  [04/01/2018 03:07PM]: ../src/secp256k1-src/src/secp256k1.c:22:8: warning: nonnull argument sigin compared to NULL [-Wnonnull-compare]
389  [04/01/2018 03:07PM]: ../src/secp256k1-src/src/secp256k1.c:279:5: note: in expansion of macro ARG_CHECK
390  [04/01/2018 03:07PM]: ../src/secp256k1-src/src/secp256k1.c: In function secp256k1_ecdsa_verify:
391  [04/01/2018 03:07PM]: ../src/secp256k1-src/src/secp256k1.c:300:5: note: in expansion of macro ARG_CHECK
392  [04/01/2018 03:07PM]: ../src/secp256k1-src/src/secp256k1.c:22:8: warning: nonnull argument msg32 compared to NULL [-Wnonnull-compare]
393  [04/01/2018 03:07PM]: ../src/secp256k1-src/src/secp256k1.c:299:5: note: in expansion of macro ARG_CHECK
394  [04/01/2018 03:07PM]: ../src/secp256k1-src/src/secp256k1.c:301:5: note: in expansion of macro ARG_CHECK
395  [04/01/2018 03:07PM]: ../src/secp256k1-src/src/secp256k1.c: In function secp256k1_ecdsa_sign:
396  [04/01/2018 03:07PM]: ../src/secp256k1-src/src/secp256k1.c:22:8: warning: nonnull argument signature compared to NULL [-Wnonnull-compare]
397  [04/01/2018 03:07PM]: ../src/secp256k1-src/src/secp256k1.c:353:5: note: in expansion of macro ARG_CHECK
398  [04/01/2018 03:07PM]: ../src/secp256k1-src/src/secp256k1.c:352:5: note: in expansion of macro ARG_CHECK
399  [04/01/2018 03:07PM]: ../src/secp256k1-src/src/secp256k1.c:22:8: warning: nonnull argument seckey compared to NULL [-Wnonnull-compare]
400  [04/01/2018 03:07PM]: ../src/secp256k1-src/src/secp256k1.c:354:5: note: in expansion of macro ARG_CHECK
401  [04/01/2018 03:07PM]: ../src/secp256k1-src/src/secp256k1.c: In function secp256k1_ec_seckey_verify:
402  [04/01/2018 03:07PM]: ../src/secp256k1-src/src/secp256k1.c:396:5: note: in expansion of macro ARG_CHECK
403  [04/01/2018 03:07PM]: ../src/secp256k1-src/src/secp256k1.c: In function secp256k1_ec_pubkey_create:
404  [04/01/2018 03:07PM]: ../src/secp256k1-src/src/secp256k1.c:411:5: note: in expansion of macro ARG_CHECK
405  [04/01/2018 03:07PM]: ../src/secp256k1-src/src/secp256k1.c:414:5: note: in expansion of macro ARG_CHECK
406  [04/01/2018 03:07PM]: ../src/secp256k1-src/src/secp256k1.c: In function secp256k1_ec_privkey_negate:
407  [04/01/2018 03:07PM]: ../src/secp256k1-src/src/secp256k1.c:430:5: note: in expansion of macro ARG_CHECK
408  [04/01/2018 03:07PM]: ../src/secp256k1-src/src/secp256k1.c: In function secp256k1_ec_pubkey_negate:
409  [04/01/2018 03:07PM]: ../src/secp256k1-src/src/secp256k1.c:443:5: note: in expansion of macro ARG_CHECK
410  [04/01/2018 03:07PM]: ../src/secp256k1-src/src/secp256k1.c: In function secp256k1_ec_privkey_tweak_add:
411  [04/01/2018 03:07PM]: ../src/secp256k1-src/src/secp256k1.c:460:5: note: in expansion of macro ARG_CHECK
412  [04/01/2018 03:07PM]: ../src/secp256k1-src/src/secp256k1.c:22:8: warning: nonnull argument tweak compared to NULL [-Wnonnull-compare]
413  [04/01/2018 03:07PM]: ../src/secp256k1-src/src/secp256k1.c:461:5: note: in expansion of macro ARG_CHECK
414  [04/01/2018 03:07PM]: ../src/secp256k1-src/src/secp256k1.c: In function secp256k1_ec_pubkey_tweak_add:
415  [04/01/2018 03:07PM]: ../src/secp256k1-src/src/secp256k1.c:484:5: note: in expansion of macro ARG_CHECK
416  [04/01/2018 03:07PM]: ../src/secp256k1-src/src/secp256k1.c:485:5: note: in expansion of macro ARG_CHECK
417  [04/01/2018 03:07PM]: ../src/secp256k1-src/src/secp256k1.c: In function secp256k1_ec_privkey_tweak_mul:
418  [04/01/2018 03:07PM]: ../src/secp256k1-src/src/secp256k1.c:507:5: note: in expansion of macro ARG_CHECK
419  [04/01/2018 03:07PM]: ../src/secp256k1-src/src/secp256k1.c:508:5: note: in expansion of macro ARG_CHECK
420  [04/01/2018 03:07PM]: ../src/secp256k1-src/src/secp256k1.c: In function secp256k1_ec_pubkey_tweak_mul:
421  [04/01/2018 03:07PM]: ../src/secp256k1-src/src/secp256k1.c:530:5: note: in expansion of macro ARG_CHECK
422  [04/01/2018 03:07PM]: ../src/secp256k1-src/src/secp256k1.c:531:5: note: in expansion of macro ARG_CHECK
423  [04/01/2018 03:07PM]: ../src/secp256k1-src/src/secp256k1.c: In function secp256k1_ec_pubkey_combine:
424  [04/01/2018 03:07PM]: ../src/secp256k1-src/src/secp256k1.c:22:8: warning: nonnull argument pubnonce compared to NULL [-Wnonnull-compare]
425  [04/01/2018 03:07PM]: ../src/secp256k1-src/src/secp256k1.c:559:5: note: in expansion of macro ARG_CHECK
426  [04/01/2018 03:07PM]: ../src/secp256k1-src/src/secp256k1.c:22:8: warning: nonnull argument pubnonces compared to NULL [-Wnonnull-compare]
427  [04/01/2018 03:07PM]: ../src/secp256k1-src/src/secp256k1.c:562:5: note: in expansion of macro ARG_CHECK
428  [04/01/2018 03:07PM]: ../src/secp256k1-src/src/secp256k1.c: In function secp256k1_ecdsa_recoverable_signature_parse_compact:
429  [04/01/2018 03:07PM]: ../src/secp256k1-src/src/modules/recovery/main_impl.h:44:5: note: in expansion of macro ARG_CHECK
430  [04/01/2018 03:07PM]: ../src/secp256k1-src/src/modules/recovery/main_impl.h:45:5: note: in expansion of macro ARG_CHECK
431  [04/01/2018 03:07PM]: ../src/secp256k1-src/src/secp256k1.c: In function secp256k1_ecdsa_recoverable_signature_serialize_compact:
432  [04/01/2018 03:07PM]: ../src/secp256k1-src/src/modules/recovery/main_impl.h:64:5: note: in expansion of macro ARG_CHECK
433  [04/01/2018 03:07PM]: ../src/secp256k1-src/src/secp256k1.c:22:8: warning: nonnull argument recid compared to NULL [-Wnonnull-compare]
434  [04/01/2018 03:07PM]: ../src/secp256k1-src/src/modules/recovery/main_impl.h:66:5: note: in expansion of macro ARG_CHECK
435  [04/01/2018 03:07PM]: ../src/secp256k1-src/src/modules/recovery/main_impl.h:65:5: note: in expansion of macro ARG_CHECK
436  [04/01/2018 03:07PM]: ../src/secp256k1-src/src/secp256k1.c: In function secp256k1_ecdsa_recoverable_signature_convert:
437  [04/01/2018 03:07PM]: ../src/secp256k1-src/src/modules/recovery/main_impl.h:79:5: note: in expansion of macro ARG_CHECK
438  [04/01/2018 03:07PM]: ../src/secp256k1-src/src/modules/recovery/main_impl.h:80:5: note: in expansion of macro ARG_CHECK
439  [04/01/2018 03:07PM]: ../src/secp256k1-src/src/secp256k1.c: In function secp256k1_ecdsa_sign_recoverable:
440  [04/01/2018 03:07PM]: ../src/secp256k1-src/src/modules/recovery/main_impl.h:132:5: note: in expansion of macro ARG_CHECK
441  [04/01/2018 03:07PM]: ../src/secp256k1-src/src/modules/recovery/main_impl.h:131:5: note: in expansion of macro ARG_CHECK
442  [04/01/2018 03:07PM]: ../src/secp256k1-src/src/modules/recovery/main_impl.h:133:5: note: in expansion of macro ARG_CHECK
443  [04/01/2018 03:07PM]: ../src/secp256k1-src/src/secp256k1.c: In function secp256k1_ecdsa_recover:
444  [04/01/2018 03:07PM]: ../src/secp256k1-src/src/modules/recovery/main_impl.h:179:5: note: in expansion of macro ARG_CHECK
445  [04/01/2018 03:07PM]: ../src/secp256k1-src/src/modules/recovery/main_impl.h:178:5: note: in expansion of macro ARG_CHECK
446  [04/01/2018 03:07PM]: ../src/secp256k1-src/src/modules/recovery/main_impl.h:177:5: note: in expansion of macro ARG_CHECK
447  [04/01/2018 03:07PM]:   CC(target) Release/obj.target/secp256k1/src/secp256k1-src/contrib/lax_der_parsing.o
448  [04/01/2018 03:07PM]:   CC(target) Release/obj.target/secp256k1/src/secp256k1-src/contrib/lax_der_privatekey_parsing.o
449  [04/01/2018 03:07PM]:   SOLINK_MODULE(target) Release/obj.target/secp256k1.node
450  [04/01/2018 03:07PM]: make: Leaving directory /pkg/src/browser-laptop/node_modules/prova-lib/node_modules/secp256k1/build
451  [04/01/2018 03:07PM]: > [email protected] install /pkg/src/browser-laptop/node_modules/secp256k1
452  [04/01/2018 03:07PM]: make: Entering directory /pkg/src/browser-laptop/node_modules/secp256k1/build
453  [04/01/2018 03:07PM]: ../src/secp256k1-src/src/secp256k1.c:433:5: note: in expansion of macro ARG_CHECK
454  [04/01/2018 03:07PM]: ../src/secp256k1-src/src/secp256k1.c:434:5: note: in expansion of macro ARG_CHECK
455  [04/01/2018 03:07PM]: ../src/secp256k1-src/src/secp256k1.c:457:5: note: in expansion of macro ARG_CHECK
456  [04/01/2018 03:07PM]: ../src/secp256k1-src/src/secp256k1.c:458:5: note: in expansion of macro ARG_CHECK
457  [04/01/2018 03:07PM]: ../src/secp256k1-src/src/secp256k1.c:480:5: note: in expansion of macro ARG_CHECK
458  [04/01/2018 03:07PM]: ../src/secp256k1-src/src/secp256k1.c:481:5: note: in expansion of macro ARG_CHECK
459  [04/01/2018 03:07PM]: ../src/secp256k1-src/src/secp256k1.c:503:5: note: in expansion of macro ARG_CHECK
460  [04/01/2018 03:07PM]: ../src/secp256k1-src/src/secp256k1.c:504:5: note: in expansion of macro ARG_CHECK
461  [04/01/2018 03:07PM]: ../src/secp256k1-src/src/secp256k1.c:532:5: note: in expansion of macro ARG_CHECK
462  [04/01/2018 03:07PM]: ../src/secp256k1-src/src/secp256k1.c:535:5: note: in expansion of macro ARG_CHECK
463  [04/01/2018 03:07PM]: make: Leaving directory /pkg/src/browser-laptop/node_modules/secp256k1/build
464  [04/01/2018 03:07PM]: > [email protected] install /pkg/src/browser-laptop/node_modules/spectron/node_modules/electron-chromedriver
465  [04/01/2018 03:07PM]: > node ./download-chromedriver.js
466  [04/01/2018 03:07PM]: > [email protected] install /pkg/src/browser-laptop/node_modules/electron-chromedriver
467  [04/01/2018 03:07PM]: > [email protected] install /pkg/src/browser-laptop/node_modules/keytar
468  [04/01/2018 03:07PM]: make: Entering directory /pkg/src/browser-laptop/node_modules/keytar/build
469  [04/01/2018 03:07PM]:   CXX(target) Release/obj.target/keytar/src/main.o
470  [04/01/2018 03:07PM]:   CXX(target) Release/obj.target/keytar/src/keytar_posix.o
471  [04/01/2018 03:07PM]:   SOLINK_MODULE(target) Release/obj.target/keytar.node
472  [04/01/2018 03:07PM]:   COPY Release/keytar.node
473  [04/01/2018 03:07PM]: make: Leaving directory /pkg/src/browser-laptop/node_modules/keytar/build
474  [04/01/2018 03:07PM]: > [email protected] install /pkg/src/browser-laptop/node_modules/nsp/node_modules/git-validate
475  [04/01/2018 03:07PM]: > [email protected] install /pkg/src/browser-laptop/node_modules/pre-commit
476  [04/01/2018 03:07PM]: (node:2206) MaxListenersExceededWarning: Possible EventEmitter memory leak detected. 11 SIGINT listeners added. Use emitter.setMaxListeners() to increase limit
477  [04/01/2018 03:07PM]: pre-commit: Detected an existing git pre-commit hook
478  [04/01/2018 03:07PM]: pre-commit: Old pre-commit hook backuped to pre-commit.old
479  [04/01/2018 03:07PM]: > [email protected] install /pkg/src/browser-laptop/node_modules/pre-push
480  [04/01/2018 03:07PM]: pre-push: Detected an existing git pre-push hook
481  [04/01/2018 03:07PM]: pre-push: Old pre-push hook backuped to pre-push.old
482  [04/01/2018 03:07PM]: > [email protected] postinstall /pkg/src/browser-laptop/node_modules/bat-publisher/node_modules/tldjs
483  [04/01/2018 03:07PM]: > node ./bin/postinstall.js
484  [04/01/2018 03:07PM]: > [email protected] postinstall /pkg/src/browser-laptop/node_modules/spawn-sync
485  [04/01/2018 03:07PM]: > [email protected] postinstall /pkg/src/browser-laptop/node_modules/electron-prebuilt
486  [04/01/2018 03:07PM]: Downloading brave-v4.5.15-linux-x64.zip
487  [04/01/2018 03:07PM]: [>                                            ] 0.0% (0 B/s)
488  [04/01/2018 03:07PM]: Downloading brave-v4.5.15-linux-x64.zip
489  [04/01/2018 03:07PM]: [>                                            ] 0.0% of 54.92 MB (0 B/s)
490  [04/01/2018 03:07PM]: [>                                            ] 1.1% of 54.92 MB (625.17 kB/s)
491  [04/01/2018 03:07PM]: [>                                            ] 2.5% of 54.92 MB (1.09 MB/s)
492  [04/01/2018 03:07PM]: [>                                            ] 4.3% of 54.92 MB (1.59 MB/s)
493  [04/01/2018 03:07PM]: [=>                                           ] 6.4% of 54.92 MB (2.02 MB/s)
494  [04/01/2018 03:07PM]: [===>                                         ] 9.5% of 54.92 MB (2.6 MB/s)
495  [04/01/2018 03:07PM]: [=======>                                     ] 18.3% of 54.92 MB (4.46 MB/s)
496  [04/01/2018 03:07PM]: [===============>                             ] 37.3% of 54.92 MB (8.19 MB/s)
497  [04/01/2018 03:07PM]: [============================>                ] 65.1% of 54.92 MB (13 MB/s)
498  [04/01/2018 03:07PM]: [============================================>] 100.0% of 54.92 MB (19.97 MB/s)
499  [04/01/2018 03:07PM]: > [email protected] postinstall /pkg/src/browser-laptop/node_modules/flow-bin
500  [04/01/2018 03:07PM]:   ✔ flow binary test passed successfully
501  [04/01/2018 03:07PM]: > [email protected] postinstall /pkg/src/browser-laptop
502  [04/01/2018 03:07PM]: > npm run download-sync-client && webpack
503  [04/01/2018 03:07PM]: > [email protected] download-sync-client /pkg/src/browser-laptop
504  [04/01/2018 03:07PM]: > node ./tools/downloadSyncClient
505  [04/01/2018 03:07PM]: writing sync bundle to /pkg/src/browser-laptop/app/extensions/brave/content/scripts/sync.js
506  [04/01/2018 03:08PM]: Hash: 834a07377273aaeca0ee4481bf6186814d724434da8873207db89a05aecd
507  [04/01/2018 03:08PM]:     Hash: 834a07377273aaeca0ee
508  [04/01/2018 03:08PM]:     Version: webpack 1.15.0
509  [04/01/2018 03:08PM]:                                      Asset       Size  Chunks             Chunk Names
510  [04/01/2018 03:08PM]:       de46bc0216c15ce3302139b3c2af4884.svg  789 bytes          [emitted]
511  [04/01/2018 03:08PM]:       41943a7d37ac5c61823a2a17c4e06070.svg  733 bytes          [emitted]
512  [04/01/2018 03:08PM]:     af7ae505a9eed503f8b8e6982036873e.woff2    77.2 kB          [emitted]
513  [04/01/2018 03:08PM]:      fee66e712a8a08eef5805a46892932ad.woff      98 kB          [emitted]
514  [04/01/2018 03:08PM]:       b06871f281fee6b241d60582ae9369b9.ttf     166 kB          [emitted]
515  [04/01/2018 03:08PM]:       912ec66d7572ff821749319396470bde.svg     444 kB          [emitted]
516  [04/01/2018 03:08PM]:       2ad15189f9772058209b9036ebf8bda1.svg    1.34 kB          [emitted]
517  [04/01/2018 03:08PM]:       292a09c3abb7e423680bb8be4de82460.svg  768 bytes          [emitted]
518  [04/01/2018 03:08PM]:       f9c5944d81cb03f5601faa8815856fc4.svg     1.3 kB          [emitted]
519  [04/01/2018 03:08PM]:       a42c3b4a1de787c14f05edf1ec49c9fd.svg    1.72 kB          [emitted]
520  [04/01/2018 03:08PM]:       dfd0990bd610a78a34d31bd751d140bd.svg    1.72 kB          [emitted]
521  [04/01/2018 03:08PM]:       b6dd4b1292cfd4470e58486c56ad0832.svg    3.69 kB          [emitted]
522  [04/01/2018 03:08PM]:       f3b9223a9b686682b28b618d9f28817e.svg  792 bytes          [emitted]
523  [04/01/2018 03:08PM]:       59023652f84793c67f7775cea1b33195.svg  670 bytes          [emitted]
524  [04/01/2018 03:08PM]:       fbb1a0acb7d12f9e64c82a8cc82aeb66.svg  615 bytes          [emitted]
525  [04/01/2018 03:08PM]:       7e57f5ffe33356122ffb083eecf8f2cf.svg    1.13 kB          [emitted]
526  [04/01/2018 03:08PM]:       ab6512b7dac5700b20f7de361aa47884.svg    1.03 kB          [emitted]
527  [04/01/2018 03:08PM]:       aa1e37293df5a3c347ea3784959aa105.svg  776 bytes          [emitted]
528  [04/01/2018 03:08PM]:       d50f42f7ea312cabab88d8eda5bb14a9.svg    2.88 kB          [emitted]
529  [04/01/2018 03:08PM]:       24e964b96ac35120541941897f6a01e3.svg  869 bytes          [emitted]
530  [04/01/2018 03:08PM]:       222f169694e4d1e956fce5a4fb5ad23d.svg  626 bytes          [emitted]
531  [04/01/2018 03:08PM]:       e606b7f6bbecaced0044c1052a99b7a9.svg    1.06 kB          [emitted]
532  [04/01/2018 03:08PM]:       eb1972095e43719a327e7fc4dd7691a4.svg    1.82 kB          [emitted]
533  [04/01/2018 03:08PM]:       7e7925a41b22d080e00c8d7309745420.svg  378 bytes          [emitted]
534  [04/01/2018 03:08PM]:       196262d2122e55e514d47f9e44b66520.svg  431 bytes          [emitted]
535  [04/01/2018 03:08PM]:       4bb98a05900622845d2e66b433711e32.png    2.93 kB          [emitted]
536  [04/01/2018 03:08PM]:       b6190b89305d7ca6eb2b6a84fb68d7bf.png     2.7 kB          [emitted]
537  [04/01/2018 03:08PM]:       4126c044e93c3caa1faaca0f4ec04e1e.png    11.1 kB          [emitted]
538  [04/01/2018 03:08PM]:       80c2dca1e4c4e1e3f495563a6952ee12.png    25.1 kB          [emitted]
539  [04/01/2018 03:08PM]:       4134ecd741d7d7b79fd1bb41ca3ad4d5.svg  472 bytes          [emitted]
540  [04/01/2018 03:08PM]:       89f9f5560225e5eee776ab6ae8f9f0b3.svg  840 bytes          [emitted]
541  [04/01/2018 03:08PM]:       f5ff01ecdaca34dc1cac01191958b4b3.svg  494 bytes          [emitted]
542  [04/01/2018 03:08PM]:       adc4e1913e1d98de46263c2dad9b914c.svg  820 bytes          [emitted]
543  [04/01/2018 03:08PM]:       bd7efdfbcb45f934ff13bfe5f5de5330.svg  990 bytes          [emitted]
544  [04/01/2018 03:08PM]:       e877f09f64a2ce7ec153e0efdd4ed1a1.svg  861 bytes          [emitted]
545  [04/01/2018 03:08PM]:       21db55dd9ae45888ef8d007135d7e243.svg    1.56 kB          [emitted]
546  [04/01/2018 03:08PM]:       d7876d48e80112e766d737346a616707.svg     1.5 kB          [emitted]
547  [04/01/2018 03:08PM]:       247d2a2d16b90d7364981e7224620a2a.svg  976 bytes          [emitted]
548  [04/01/2018 03:08PM]:       c74aae1d7c31e27b75eb9c779b6fab4c.svg    1.03 kB          [emitted]
549  [04/01/2018 03:08PM]:       674f50d287a8c48dc19ba404d20fe713.eot     166 kB          [emitted]
550  [04/01/2018 03:08PM]:       14ad83ede0f899bd6a66a37194df85c6.svg  934 bytes          [emitted]
551  [04/01/2018 03:08PM]:       493bc2b131dc439f27e05c4d3f4e93e7.png    12.1 kB          [emitted]
552  [04/01/2018 03:08PM]:       392507919f6ec931361b489a56c65ce9.svg  816 bytes          [emitted]
553  [04/01/2018 03:08PM]:       d5a535fdec793b2b9219ef7abfa185ce.svg  205 bytes          [emitted]
554  [04/01/2018 03:08PM]:       5ccced21c6505bfab561c1e015e407e1.svg  239 bytes          [emitted]
555  [04/01/2018 03:08PM]:       23b20b72da217563c4304c07c5206dd0.svg  213 bytes          [emitted]
556  [04/01/2018 03:08PM]:       e008bf562e79f9e1fd5110df9d61627d.svg  355 bytes          [emitted]
557  [04/01/2018 03:08PM]:       c11dbc2db4c1e34f10ac562b48e1d886.svg  289 bytes          [emitted]
558  [04/01/2018 03:08PM]:       430b679826c6e11b1767e7e05649e028.svg  615 bytes          [emitted]
559  [04/01/2018 03:08PM]:       2e7aa1b656ba910260191a20406af15f.svg  618 bytes          [emitted]
560  [04/01/2018 03:08PM]:       38ad268f3a41dc9191cc26857537e4c1.svg  452 bytes          [emitted]
561  [04/01/2018 03:08PM]:       a60b6ab6aaca89b5627cee5fb224ce64.svg  438 bytes          [emitted]
562  [04/01/2018 03:08PM]:       f88876b2519c8cbda6ef6fa17e83eeff.svg  687 bytes          [emitted]
563  [04/01/2018 03:08PM]:       bc90457507bcff2412ad0d500d7f92a9.svg  693 bytes          [emitted]
564  [04/01/2018 03:08PM]:       b6fb7a0b51d3af832d445c02e46d434d.png    2.13 kB          [emitted]
565  [04/01/2018 03:08PM]:       a34dd95ecb584ddb353a854a069d89a1.png    18.1 kB          [emitted]
566  [04/01/2018 03:08PM]:       0c4a088449e73ec59b36bb111c7e03b5.png    5.91 kB          [emitted]
567  [04/01/2018 03:08PM]:       69e1af008c893d635dabe4b7feb5f366.png    2.39 kB          [emitted]
568  [04/01/2018 03:08PM]:       51a0855604244165c58b5867df7d5676.png    4.69 kB          [emitted]
569  [04/01/2018 03:08PM]:       1be94b6e3fe1720c770ab40ab0c71cbe.png    7.22 kB          [emitted]
570  [04/01/2018 03:08PM]:       cd1a406ba824513a8d92a2e1418a2977.svg  418 bytes          [emitted]
571  [04/01/2018 03:08PM]:       1acaa76443941825560798bdb3936bf9.svg  437 bytes          [emitted]
572  [04/01/2018 03:08PM]:       3bad0d188335cbfe4a29bd448fa4d0e3.svg  430 bytes          [emitted]
573  [04/01/2018 03:08PM]:       f8aa9b15e2d849c26e84ec0dba7bebae.svg    1.27 kB          [emitted]
574  [04/01/2018 03:08PM]:       cbba55184f62c3df8728928b9016f9d7.svg     1.7 kB          [emitted]
575  [04/01/2018 03:08PM]:       1d10887913956d5ffe996a035b489730.svg    1.51 kB          [emitted]
576  [04/01/2018 03:08PM]:       df9d90f487acc18337a62e10623a2d87.svg    1.21 kB          [emitted]
577  [04/01/2018 03:08PM]:       4816047e6c690868e2f2dfb972e11263.svg    1.09 kB          [emitted]
578  [04/01/2018 03:08PM]:       e27fa9769059ed125a576fe851592410.svg  671 bytes          [emitted]
579  [04/01/2018 03:08PM]:       dafa0bbc64a10f10d65c8eadadd14c0a.svg  890 bytes          [emitted]
580  [04/01/2018 03:08PM]:       dba2dc28147a6dc7176d68287cb3fb74.svg    2.66 kB          [emitted]
581  [04/01/2018 03:08PM]:       8c9c38b16d3e35299481600c10f9bd19.svg  823 bytes          [emitted]
582  [04/01/2018 03:08PM]:       e61458fc4b59fafd5f6bb3a25b6d94ff.svg  824 bytes          [emitted]
583  [04/01/2018 03:08PM]:       f70c25409713b4132e79b004c03ef3cb.svg  428 bytes          [emitted]
584  [04/01/2018 03:08PM]:                        aboutPages.entry.js     4.2 MB       0  [emitted]  aboutPages
585  [04/01/2018 03:08PM]:                               app.entry.js    3.32 MB       1  [emitted]  app
586  [04/01/2018 03:08PM]:                    aboutPages.entry.js.map    5.62 MB       0  [emitted]  aboutPages
587  [04/01/2018 03:08PM]:                           app.entry.js.map    4.61 MB       1  [emitted]  app
588  [04/01/2018 03:08PM]:        [0] multi app 28 bytes {1} [built]
589  [04/01/2018 03:08PM]:        [0] multi aboutPages 28 bytes {0} [built]
590  [04/01/2018 03:08PM]:         + 920 hidden modules
591  [04/01/2018 03:08PM]:     Hash: 4481bf6186814d724434
592  [04/01/2018 03:08PM]:                   Asset    Size  Chunks             Chunk Names
593  [04/01/2018 03:08PM]:         lib.devTools.js  717 kB       0  [emitted]  devTools
594  [04/01/2018 03:08PM]:     lib.devTools.js.map  952 kB       0  [emitted]  devTools
595  [04/01/2018 03:08PM]:        [0] multi devTools 28 bytes {0} [built]
596  [04/01/2018 03:08PM]:         + 54 hidden modules
597  [04/01/2018 03:08PM]:     Hash: da8873207db89a05aecd
598  [04/01/2018 03:08PM]:                    webtorrentPage.entry.js     1.4 MB       0  [emitted]  main
599  [04/01/2018 03:08PM]:                webtorrentPage.entry.js.map    1.72 MB       0  [emitted]  main
600  [04/01/2018 03:08PM]:        [0] multi main 28 bytes {0} [built]
601  [04/01/2018 03:08PM]: npm WARN optional SKIPPING OPTIONAL DEPENDENCY: [email protected] (node_modules/7zip-bin-mac):
602  [04/01/2018 03:08PM]: npm WARN notsup SKIPPING OPTIONAL DEPENDENCY: Unsupported platform for [email protected]: wanted {os:darwin,arch:any} (current: {os:linux,arch:x64})
603  [04/01/2018 03:08PM]: npm WARN optional SKIPPING OPTIONAL DEPENDENCY: [email protected] (node_modules/fsevents):
604  [04/01/2018 03:08PM]: npm WARN notsup SKIPPING OPTIONAL DEPENDENCY: Unsupported platform for [email protected]: wanted {os:darwin,arch:any} (current: {os:linux,arch:x64})
605  [04/01/2018 03:08PM]: added 2326 packages from 1529 contributors in 174.12s
606  [04/01/2018 03:08PM]: > [email protected] build-package /pkg/src/browser-laptop
607  [04/01/2018 03:08PM]: > node ./tools/buildPackage.js
608  [04/01/2018 03:08PM]: Building version 0.19.88 in Brave-linux-x64 with Electron 4.5.15
609  [04/01/2018 03:08PM]: echo cleaning up target...&&rm -Rf Brave-linux-x64&&rm -Rf dist&&rm -f Brave.tar.bz2&&echo done&&echo starting build...&&./node_modules/.bin/webpack&&npm run checks&&node ./node_modules/electron-packager/cli.js . Brave --overwrite --ignore=pre-commit|pre-push|test/|docs/|tools/|signcode-tf|rx|nslog|eslint|cppunitlite|caniuse-db|cross-env|spectron|\.(0|13ctype|APACHE2|BSD|DOCS|DS_Store|LESSER|Makefile|a|ac|aff|after|am|arcconfig|arclint|babelrc|bat|before|bnf|brave-gyp|c|cardinalrc|cc|cfg|closure-compiler|cmake|cmd|covignore|cpp|csv|cxx|d|def|deps|dic|dll|dntrc|dockerignore|dsp|editorconfig|editorconfig~|el|enc|entitlements|eot|esprima|flow|flowconfig|gitattributes|githug|gitignore|gitattributes|gitignore|gitkeep|gitmodules|gnu|gradle|gyp|gypi|gz|h|hbs|hxx|idl|iml|in|inc|include|info|jade|java|jsfmtrc|jshint|jshintignore|jshintrc|jslintrc|jst|js~|keep|lint|lintignore|lock|log|ls|m4|mailmap|map|markdown|md|mdown|md~|mem|min-wd|mk|mkd|mm|mustache|myspell|myspell|name|nsh|nsi|nsprc|nuspec|nvmrc|o|old|orig|otf|param|patch|pegjs|post|pre|pro|py|rej|s|sage|scss|settings|sh|skip|source-map|stamp|swo|tap|targ|template|tern-port|tern-project|testignore|tm_properties|tmp|tpl|ts|txt|un~|vscode|xcf|xml|yaml|yml)$|/deps/|Release/obj|obj.target|ad-block/(node_modules|test|perf|sample|scripts|test|vendor|ABPFilterParserData.dat)|tracking-protection/(node_modules|test|data|scripts|vendor)|tracking-protection/build/node_modules|tracking-protection/build/Release/(sample.exe|test.exe)|sqlite3/src|nsp/node_modules|electron-installer-squirrel-windows|electron-chromedriver|electron-installer-debian|node-notifier/vendor|node-gyp|npm|jsdoc|docs|sinon|electron-download|electron-rebuild|electron-packager|electron-builder|electron-prebuilt|electron-rebuild|electron-winstaller-fixed|muon-winstaller|electron-installer-redhat|flow-bin|babel$|babel-(?!polyfill|regenerator-runtime|preset-env)|jsdom-global|react-addons-perf|react-addons-test-utils|enzyme|git-rev-sync|sqlite3|uglify-js|webdriverio|webpack-dev-server --platform=linux --arch=x64 --version=4.5.15 --icon=res/app.png --asar=true --app-version=0.19.88 --build-version=4.5.15 --protocol=http --protocol-name=HTTP Handler --protocol=https --protocol-name=HTTPS Handler --product-dir-name=brave --version-string.CompanyName=Brave Software --version-string.ProductName=Brave --version-string.Copyright=Copyright 2017, Brave Software --version-string.FileDescription=Brave&&mv Brave-linux-x64/Brave Brave-linux-x64/brave&&ncp ./app/extensions Brave-linux-x64/resources/extensions&&mkdirp Brave-linux-x64/resources/app.asar.unpacked/node_modules/node-anonize2-relic-emscripten&&ncp node_modules/node-anonize2-relic-emscripten/anonize2.js.mem Brave-linux-x64/resources/app.asar.unpacked/node_modules/node-anonize2-relic-emscripten/anonize2.js.mem
610  [04/01/2018 03:09PM]: Hash: b36783f2eda6b011c746393766448e1b3f95556d344503f66c6a3ab49da8
611  [04/01/2018 03:09PM]:     Hash: b36783f2eda6b011c746
612  [04/01/2018 03:09PM]:                        aboutPages.entry.js    4.14 MB       0  [emitted]  aboutPages
613  [04/01/2018 03:09PM]:                               app.entry.js    3.29 MB       1  [emitted]  app
614  [04/01/2018 03:09PM]:                    aboutPages.entry.js.map    5.54 MB       0  [emitted]  aboutPages
615  [04/01/2018 03:09PM]:                           app.entry.js.map    4.56 MB       1  [emitted]  app
616  [04/01/2018 03:09PM]:     ERROR in aboutPages.entry.js from UglifyJs
617  [04/01/2018 03:09PM]:     SyntaxError: Name expected [./app/renderer/components/styles/global.js:5,6]
618  [04/01/2018 03:09PM]:     ERROR in app.entry.js from UglifyJs
619  [04/01/2018 03:09PM]:     Hash: 393766448e1b3f95556d
620  [04/01/2018 03:09PM]:     ERROR in lib.devTools.js from UglifyJs
621  [04/01/2018 03:09PM]:     SyntaxError: Unexpected token: operator (>) [./js/constants/config.js:46,13]
622  [04/01/2018 03:09PM]:     Hash: 344503f66c6a3ab49da8
623  [04/01/2018 03:09PM]:                    webtorrentPage.entry.js    1.35 MB       0  [emitted]  main
624  [04/01/2018 03:09PM]:                webtorrentPage.entry.js.map    1.66 MB       0  [emitted]  main
625  [04/01/2018 03:09PM]:     ERROR in webtorrentPage.entry.js from UglifyJs
626  [04/01/2018 03:09PM]:     SyntaxError: Name expected [./app/renderer/components/styles/commonStyles.js:5,6]
627  [04/01/2018 03:09PM]: > [email protected] checks /pkg/src/browser-laptop
628  [04/01/2018 03:09PM]: > [email protected] check-security /pkg/src/browser-laptop
629  [04/01/2018 03:09PM]: (+) 8 vulnerabilities found
630  [04/01/2018 03:09PM]: ┌───────────────┬─────────────────────────────────────────────────────────────────┐
631  [04/01/2018 03:09PM]: │               │ Regular Expression Denial of Service                            │
632  [04/01/2018 03:09PM]: ├───────────────┼─────────────────────────────────────────────────────────────────┤
633  [04/01/2018 03:09PM]: │ Name          │ moment                                                          │
634  [04/01/2018 03:09PM]: │ CVSS          │ 7.5 (High)635  [04/01/2018 03:09PM]: │ Patched       │ >=2.19.3                                                        │
636  [04/01/2018 03:09PM]: │ Path          │ [email protected] > [email protected] > [email protected] > [email protected]… │
637  [04/01/2018 03:09PM]: │ More Info     │ https://nodesecurity.io/advisories/532                          │
638  [04/01/2018 03:09PM]: └───────────────┴─────────────────────────────────────────────────────────────────┘
639  [04/01/2018 03:09PM]: │ Path          │ [email protected] > [email protected] > [email protected] > meta… │
640  [04/01/2018 03:09PM]: │ Path          │ [email protected] > [email protected] > [email protected]… │
641  [04/01/2018 03:09PM]: │ Path          │ [email protected] > [email protected] > [email protected] > chro… │
642  [04/01/2018 03:09PM]: │ Path          │ [email protected] > [email protected]643  [04/01/2018 03:09PM]: │               │ Prototype pollution attack                                      │
644  [04/01/2018 03:09PM]: │ CVSS          │ 4 (Medium)645  [04/01/2018 03:09PM]: │ Vulnerable    │ <= 4.2.0 || >= 5.0.0 < 5.0.3                                    │
646  [04/01/2018 03:09PM]: │ Patched       │ > 4.2.0 < 5.0.0 || >= 5.0.3                                     │
647  [04/01/2018 03:09PM]: │ Path          │ [email protected] > [email protected] > [email protected] > [email protected]648  [04/01/2018 03:09PM]: │ More Info     │ https://nodesecurity.io/advisories/566                          │
649  [04/01/2018 03:09PM]: │ Path          │ [email protected] > [email protected] > [email protected] > [email protected]650  [04/01/2018 03:09PM]: │ Path          │ [email protected] > [email protected] > [email protected] > [email protected]651  [04/01/2018 03:09PM]: npm ERR! [email protected] check-security: `nsp check`
652  [04/01/2018 03:09PM]: npm ERR! Failed at the [email protected] check-security script.
653  [04/01/2018 03:09PM]: npm ERR! This is probably not a problem with npm. There is likely additional logging output above.
654  [04/01/2018 03:09PM]: npm ERR! A complete log of this run can be found in:
655  [04/01/2018 03:09PM]: npm ERR!     /pkg/src/.npm/_logs/2018-04-01T20_09_23_465Z-debug.log
656  [04/01/2018 03:09PM]: npm ERR! [email protected] checks: `npm run check-security`
657  [04/01/2018 03:09PM]: npm ERR! Failed at the [email protected] checks script.
658  [04/01/2018 03:09PM]: npm ERR!     /pkg/src/.npm/_logs/2018-04-01T20_09_23_478Z-debug.log
659  [04/01/2018 03:09PM]: buildPackage failed { Error: Command failed: echo cleaning up target...&&rm -Rf Brave-linux-x64&&rm -Rf dist&&rm -f Brave.tar.bz2&&echo done&&echo starting build...&&./node_modules/.bin/webpack&&npm run checks&&node ./node_modules/electron-packager/cli.js . Brave --overwrite --ignore=pre-commit|pre-push|test/|docs/|tools/|signcode-tf|rx|nslog|eslint|cppunitlite|caniuse-db|cross-env|spectron|\.(0|13ctype|APACHE2|BSD|DOCS|DS_Store|LESSER|Makefile|a|ac|aff|after|am|arcconfig|arclint|babelrc|bat|before|bnf|brave-gyp|c|cardinalrc|cc|cfg|closure-compiler|cmake|cmd|covignore|cpp|csv|cxx|d|def|deps|dic|dll|dntrc|dockerignore|dsp|editorconfig|editorconfig~|el|enc|entitlements|eot|esprima|flow|flowconfig|gitattributes|githug|gitignore|gitattributes|gitignore|gitkeep|gitmodules|gnu|gradle|gyp|gypi|gz|h|hbs|hxx|idl|iml|in|inc|include|info|jade|java|jsfmtrc|jshint|jshintignore|jshintrc|jslintrc|jst|js~|keep|lint|lintignore|lock|log|ls|m4|mailmap|map|markdown|md|mdown|md~|mem|min-wd|mk|mkd|mm|mustache|myspell|myspell|name|nsh|nsi|nsprc|nuspec|nvmrc|o|old|orig|otf|param|patch|pegjs|post|pre|pro|py|rej|s|sage|scss|settings|sh|skip|source-map|stamp|swo|tap|targ|template|tern-port|tern-project|testignore|tm_properties|tmp|tpl|ts|txt|un~|vscode|xcf|xml|yaml|yml)$|/deps/|Release/obj|obj.target|ad-block/(node_modules|test|perf|sample|scripts|test|vendor|ABPFilterParserData.dat)|tracking-protection/(node_modules|test|data|scripts|vendor)|tracking-protection/build/node_modules|tracking-protection/build/Release/(sample.exe|test.exe)|sqlite3/src|nsp/node_modules|electron-installer-squirrel-windows|electron-chromedriver|electron-installer-debian|node-notifier/vendor|node-gyp|npm|jsdoc|docs|sinon|electron-download|electron-rebuild|electron-packager|electron-builder|electron-prebuilt|electron-rebuild|electron-winstaller-fixed|muon-winstaller|electron-installer-redhat|flow-bin|babel$|babel-(?!polyfill|regenerator-runtime|preset-env)|jsdom-global|react-addons-perf|react-addons-test-utils|enzyme|git-rev-sync|sqlite3|uglify-js|webdriverio|webpack-dev-server --platform=linux --arch=x64 --version=4.5.15 --icon=res/app.png --asar=true --app-version=0.19.88 --build-version=4.5.15 --protocol=http --protocol-name=HTTP Handler --protocol=https --protocol-name=HTTPS Handler --product-dir-name=brave --version-string.CompanyName=Brave Software --version-string.ProductName=Brave --version-string.Copyright=Copyright 2017, Brave Software --version-string.FileDescription=Brave&&mv Brave-linux-x64/Brave Brave-linux-x64/brave&&ncp ./app/extensions Brave-linux-x64/resources/extensions&&mkdirp Brave-linux-x64/resources/app.asar.unpacked/node_modules/node-anonize2-relic-emscripten&&ncp node_modules/node-anonize2-relic-emscripten/anonize2.js.mem Brave-linux-x64/resources/app.asar.unpacked/node_modules/node-anonize2-relic-emscripten/anonize2.js.mem
660  [04/01/2018 03:09PM]:     at ChildProcess.exithandler (child_process.js:273:12)
661  [04/01/2018 03:09PM]:     at ChildProcess.emit (events.js:180:13)
662  [04/01/2018 03:09PM]:     at maybeClose (internal/child_process.js:936:16)
663  [04/01/2018 03:09PM]:     at Process.ChildProcess._handle.onexit (internal/child_process.js:220:5)
664  [04/01/2018 03:09PM]:   cmd: echo cleaning up target...&&rm -Rf Brave-linux-x64&&rm -Rf dist&&rm -f Brave.tar.bz2&&echo done&&echo starting build...&&./node_modules/.bin/webpack&&npm run checks&&node ./node_modules/electron-packager/cli.js . Brave --overwrite --ignore=pre-commit|pre-push|test/|docs/|tools/|signcode-tf|rx|nslog|eslint|cppunitlite|caniuse-db|cross-env|spectron|\\.(0|13ctype|APACHE2|BSD|DOCS|DS_Store|LESSER|Makefile|a|ac|aff|after|am|arcconfig|arclint|babelrc|bat|before|bnf|brave-gyp|c|cardinalrc|cc|cfg|closure-compiler|cmake|cmd|covignore|cpp|csv|cxx|d|def|deps|dic|dll|dntrc|dockerignore|dsp|editorconfig|editorconfig~|el|enc|entitlements|eot|esprima|flow|flowconfig|gitattributes|githug|gitignore|gitattributes|gitignore|gitkeep|gitmodules|gnu|gradle|gyp|gypi|gz|h|hbs|hxx|idl|iml|in|inc|include|info|jade|java|jsfmtrc|jshint|jshintignore|jshintrc|jslintrc|jst|js~|keep|lint|lintignore|lock|log|ls|m4|mailmap|map|markdown|md|mdown|md~|mem|min-wd|mk|mkd|mm|mustache|myspell|myspell|name|nsh|nsi|nsprc|nuspec|nvmrc|o|old|orig|otf|param|patch|pegjs|post|pre|pro|py|rej|s|sage|scss|settings|sh|skip|source-map|stamp|swo|tap|targ|template|tern-port|tern-project|testignore|tm_properties|tmp|tpl|ts|txt|un~|vscode|xcf|xml|yaml|yml)$|/deps/|Release/obj|obj.target|ad-block/(node_modules|test|perf|sample|scripts|test|vendor|ABPFilterParserData.dat)|tracking-protection/(node_modules|test|data|scripts|vendor)|tracking-protection/build/node_modules|tracking-protection/build/Release/(sample.exe|test.exe)|sqlite3/src|nsp/node_modules|electron-installer-squirrel-windows|electron-chromedriver|electron-installer-debian|node-notifier/vendor|node-gyp|npm|jsdoc|docs|sinon|electron-download|electron-rebuild|electron-packager|electron-builder|electron-prebuilt|electron-rebuild|electron-winstaller-fixed|muon-winstaller|electron-installer-redhat|flow-bin|babel$|babel-(?!polyfill|regenerator-runtime|preset-env)|jsdom-global|react-addons-perf|react-addons-test-utils|enzyme|git-rev-sync|sqlite3|uglify-js|webdriverio|webpack-dev-server --platform=linux --arch=x64 --version=4.5.15 --icon=res/app.png --asar=true --app-version=0.19.88 --build-version=4.5.15 --protocol=http --protocol-name=HTTP Handler --protocol=https --protocol-name=HTTPS Handler --product-dir-name=brave --version-string.CompanyName=Brave Software --version-string.ProductName=Brave --version-string.Copyright=Copyright 2017, Brave Software --version-string.FileDescription=Brave&&mv Brave-linux-x64/Brave Brave-linux-x64/brave&&ncp ./app/extensions Brave-linux-x64/resources/extensions&&mkdirp Brave-linux-x64/resources/app.asar.unpacked/node_modules/node-anonize2-relic-emscripten&&ncp node_modules/node-anonize2-relic-emscripten/anonize2.js.mem Brave-linux-x64/resources/app.asar.unpacked/node_modules/node-anonize2-relic-emscripten/anonize2.js.mem }
665  [04/01/2018 03:09PM]: npm ERR! [email protected] build-package: `node ./tools/buildPackage.js`
666  [04/01/2018 03:09PM]: npm ERR! Failed at the [email protected] build-package script.
667  [04/01/2018 03:09PM]: npm ERR!     /pkg/src/.npm/_logs/2018-04-01T20_09_23_509Z-debug.log
668  [04/01/2018 03:09PM]: ==> ERROR: A failure occurred in build().
669  [04/01/2018 03:09PM]: rm: cannot remove **.pkg.**: No such file or directory
670  [04/01/2018 03:09PM]: [\^/\^/^\^/^\^/\^/\^/^\^/^\^/]  BUILD FAILED  [\^/\^/^\^/^\^/\^/\^/^\^/^\^/]