Build Record

Build Number: 7962

Transaction: 3978
Package: albert
Version: 0.14.18-1
Start: 05/07/2018 11:09AM
Finish: 05/07/2018 11:19AM
Result: failed
 albert/PKGBUILD CHANGED

Build Log

  1 [05/07/2018 11:10AM]: [\^/\^/^\^/^\^/\^/\^/^\^/^\^/]  SETTING UP ENVIRONMENT  [\^/\^/^\^/^\^/\^/\^/^\^/^\^/]
  2  [05/07/2018 11:10AM]: [\^/\^/^\^/^\^/\^/\^/^\^/^\^/]  ADDING UPSTREAM PGP KEYS TO KEYRING  [\^/\^/^\^/^\^/\^/\^/^\^/^\^/]
  3  [05/07/2018 11:10AM]: gpg: WARNING: unsafe ownership on homedir /tmp/antbs/.gnupg
  4  [05/07/2018 11:10AM]: gpg: keybox /tmp/antbs/.gnupg/pubring.kbx created
  5  [05/07/2018 11:11AM]: gpg: key 7434390BDBE9B9C5: 4 signatures not checked due to missing keys
  6  [05/07/2018 11:11AM]: gpg: /tmp/antbs/.gnupg/trustdb.gpg: trustdb created
  7  [05/07/2018 11:11AM]: gpg: key 7434390BDBE9B9C5: public key Colin Ihrig <[email protected]> imported
  8  [05/07/2018 11:11AM]: gpg: key 61B7B526D98F0353: 26 signatures not checked due to missing keys
  9  [05/07/2018 11:11AM]: gpg: key 61B7B526D98F0353: public key Mozilla Software Releases <[email protected]> imported
 10  [05/07/2018 11:11AM]: gpg: key 61B7B526D98F0353: Mozilla Software Releases <[email protected]> not changed
 11  [05/07/2018 11:11AM]: gpg: no ultimately trusted keys found
 12  [05/07/2018 11:11AM]: gpg: Total number processed: 3
 13  [05/07/2018 11:11AM]: gpg:               imported: 2
 14  [05/07/2018 11:11AM]: gpg:              unchanged: 1
 15  [05/07/2018 11:11AM]: [\^/\^/^\^/^\^/\^/\^/^\^/^\^/]  SYNCING REPO DATABASES  [\^/\^/^\^/^\^/\^/\^/^\^/^\^/]
 16  [05/07/2018 11:11AM]: :: Synchronizing package databases...
 17  [05/07/2018 11:11AM]: downloading antergos-staging.db...
 18  [05/07/2018 11:11AM]: downloading antergos.db...
 19  [05/07/2018 11:11AM]: downloading core.db...
 20  [05/07/2018 11:11AM]: downloading community.db...
 21  [05/07/2018 11:11AM]: :: Starting full system upgrade...
 22  [05/07/2018 11:11AM]: looking for conflicting packages...
 23  [05/07/2018 11:11AM]: Packages (75) archlinux-keyring-20180404-1  bash-4.4.019-1  binutils-2.30-4  bzip2-1.0.6-7  ca-certificates-mozilla-3.36.1-1  cryptsetup-2.0.3-1  curl-7.59.0-2  dbus-1.12.8-1  device-mapper-2.02.177-5  dhcpcd-7.0.4-1  e2fsprogs-1.44.1-1  expect-5.45.4-1  file-5.33-1  filesystem-2018.1-2  gawk-4.2.1-1  gc-7.6.4-1  gcc-8.1.0-1  gcc-libs-8.1.0-1  git-2.17.0-1  glib2-2.56.1-1  glibc-2.27-3  gnupg-2.2.6-1  gnutls-3.5.18-1  gpgme-1.11.1-1  iana-etc-20180221-1  iproute2-4.16.0-1  iptables-1.6.2-2  less-530-1  libatomic_ops-7.6.4-1  libcap-ng-0.7.9-1  libgpg-error-1.29-1  libidn-1.34-2  libldap-2.4.46-1  libnghttp2-1.31.1-1  libnsl-1.2.0-1  libpsl-0.20.1-2  libsecret-0.18.6-1  libsystemd-238.76-1  libtirpc-1.0.3-1  libtool-2.4.6+40+g6ca5e224-6  libunistring-0.9.9-1  libusb-1.0.22-1  libutil-linux-2.32-3  linux-api-headers-4.16.1-1  logrotate-3.14.0-1  lz4-1:1.8.1.2-1  mercurial-4.5.3-1  mpfr-4.0.1-1  nano-2.9.6-1  ncurses-6.1-3  openssh-7.7p1-1  openssl-1.1.0.h-1  p11-kit-0.23.10-1  pacman-5.0.2-3  pacman-mirrorlist-20180415-1  pam-1.3.0-2  patch-2.7.6-1  pcre-8.42-1  pcre2-10.31-1  perl-5.26.2-1  perl-mailtools-2.20-1  perl-timedate-2.30-4  pinentry-1.1.0-2  python-3.6.5-2  python2-2.7.15-1  reflector-2018-1  sed-4.5-1  sqlite-3.23.1-1  systemd-238.76-1  systemd-sysvcompat-238.76-1  tcl-8.6.8-3  tzdata-2018d-1  util-linux-2.32-3  wget-1.19.4-3  xz-5.2.4-1
 24  [05/07/2018 11:11AM]: Total Download Size:   114.78 MiB
 25  [05/07/2018 11:11AM]: Total Installed Size:  789.20 MiB
 26  [05/07/2018 11:11AM]: Net Upgrade Size:       28.36 MiB
 27  [05/07/2018 11:11AM]: :: Proceed with installation? [Y/n]
 28  [05/07/2018 11:11AM]: downloading gcc-libs-8.1.0-1-x86_64.pkg.tar.xz...
 29  [05/07/2018 11:11AM]: downloading perl-5.26.2-1-x86_64.pkg.tar.xz...
 30  [05/07/2018 11:11AM]: downloading file-5.33-1-x86_64.pkg.tar.xz...
 31  [05/07/2018 11:11AM]: downloading pacman-5.0.2-3-x86_64.pkg.tar.xz...
 32  [05/07/2018 11:11AM]: downloading systemd-sysvcompat-238.76-1-x86_64.pkg.tar.xz...
 33  [05/07/2018 11:11AM]: downloading perl-mailtools-2.20-1-any.pkg.tar.xz...
 34  [05/07/2018 11:11AM]: downloading python2-2.7.15-1-x86_64.pkg.tar.xz...
 35  [05/07/2018 11:11AM]: downloading python-3.6.5-2-x86_64.pkg.tar.xz...
 36  [05/07/2018 11:11AM]: checking package integrity...
 37  [05/07/2018 11:11AM]: checking for file conflicts...
 38  [05/07/2018 11:11AM]: :: Processing package changes...
 39  [05/07/2018 11:11AM]: upgrading archlinux-keyring...
 40  [05/07/2018 11:11AM]: ==> Appending keys from archlinux.gpg...
 41  [05/07/2018 11:11AM]: ==> Locally signing trusted keys in keyring...
 42  [05/07/2018 11:11AM]:   -> Locally signing key DDB867B92AA789C165EEFA799B729B06A680C281...
 43  [05/07/2018 11:11AM]:   -> Locally signing key 684148BB25B49E986A4944C55184252D824B18E8...
 44  [05/07/2018 11:11AM]:   -> Locally signing key 91FFE0700E80619CEB73235CA88E23E377514E00...
 45  [05/07/2018 11:11AM]:   -> Locally signing key AB19265E5D7D20687D303246BA1DFB64FFF979E7...
 46  [05/07/2018 11:11AM]:   -> Locally signing key 0E8B644079F599DFC1DDC3973348882F6AC6A4C2...
 47  [05/07/2018 11:11AM]: ==> Importing owner trust values...
 48  [05/07/2018 11:11AM]: ==> Disabling revoked keys in keyring...
 49  [05/07/2018 11:11AM]:   -> Disabling key 7FA647CD89891DEDC060287BB9113D1ED21E1A55...
 50  [05/07/2018 11:11AM]:   -> Disabling key D4DE5ABDE2A7287644EAC7E36D1A9E70E19DAA50...
 51  [05/07/2018 11:11AM]:   -> Disabling key 40440DC037C05620984379A6761FAD69BA06C6A9...
 52  [05/07/2018 11:11AM]:   -> Disabling key B1F2C889CB2CCB2ADA36D963097D629E437520BD...
 53  [05/07/2018 11:11AM]:   -> Disabling key BC1FBE4D2826A0B51E47ED62E2539214C6C11350...
 54  [05/07/2018 11:11AM]:   -> Disabling key 63F395DE2D6398BBE458F281F2DBB4931985A992...
 55  [05/07/2018 11:11AM]:   -> Disabling key 8F76BEEA0289F9E1D3E229C05F946DED983D4366...
 56  [05/07/2018 11:11AM]:   -> Disabling key 4FCF887689C41B09506BE8D5F3E1D5C5D30DB0AD...
 57  [05/07/2018 11:11AM]:   -> Disabling key 81D7F8241DB38BC759C80FCE3A726C6170E80477...
 58  [05/07/2018 11:11AM]:   -> Disabling key 5E7585ADFF106BFFBBA319DC654B877A0864983E...
 59  [05/07/2018 11:11AM]:   -> Disabling key E7210A59715F6940CF9A4E36A001876699AD6E84...
 60  [05/07/2018 11:11AM]:   -> Disabling key F5A361A3A13554B85E57DDDAAF7EF7873CFD4BB6...
 61  [05/07/2018 11:11AM]:   -> Disabling key 8CF934E339CAD8ABF342E822E711306E3C4F88BC...
 62  [05/07/2018 11:11AM]:   -> Disabling key 5696C003B0854206450C8E5BE613C09CB4440678...
 63  [05/07/2018 11:11AM]:   -> Disabling key 9515D8A8EAB88E49BB65EDBCE6B456CAF15447D5...
 64  [05/07/2018 11:11AM]:   -> Disabling key 4A8B17E20B88ACA61860009B5CED81B7C2E5C0D2...
 65  [05/07/2018 11:11AM]:   -> Disabling key 0B20CA1931F5DA3A70D0F8D2EA6836E1AB441196...
 66  [05/07/2018 11:11AM]:   -> Disabling key 34C5D94FE7E7913E86DC427E7FB1A3800C84C0A5...
 67  [05/07/2018 11:11AM]:   -> Disabling key 39F880E50E49A4D11341E8F939E4F17F295AFBF4...
 68  [05/07/2018 11:11AM]:   -> Disabling key 66BD74A036D522F51DD70A3C7F2A16726521E06D...
 69  [05/07/2018 11:11AM]:   -> Disabling key DBE7D3DD8C81D58D0A13D0E76BC26A17B9B7018A...
 70  [05/07/2018 11:11AM]:   -> Disabling key 07DFD3A0BC213FA12EDC217559B3122E2FA915EC...
 71  [05/07/2018 11:11AM]:   -> Disabling key 44D4A033AC140143927397D47EFD567D4C7EA887...
 72  [05/07/2018 11:11AM]:   -> Disabling key 27FFC4769E19F096D41D9265A04F9397CDFD6BB0...
 73  [05/07/2018 11:11AM]:   -> Disabling key 8840BD07FC24CB7CE394A07CCF7037A4F27FB7DA...
 74  [05/07/2018 11:11AM]: ==> Updating trust database...
 75  [05/07/2018 11:11AM]: gpg: marginals needed: 3  completes needed: 1  trust model: pgp
 76  [05/07/2018 11:11AM]: gpg: depth: 0  valid:   1  signed:   8  trust: 0-, 0q, 0n, 0m, 0f, 1u
 77  [05/07/2018 11:11AM]: gpg: depth: 1  valid:   8  signed:  74  trust: 0-, 0q, 0n, 8m, 0f, 0u
 78  [05/07/2018 11:11AM]: gpg: depth: 2  valid:  74  signed:   8  trust: 74-, 0q, 0n, 0m, 0f, 0u
 79  [05/07/2018 11:11AM]: gpg: next trustdb check due at 2018-06-25
 80  [05/07/2018 11:11AM]: upgrading linux-api-headers...
 81  [05/07/2018 11:11AM]: warning: /etc/locale.gen installed as /etc/locale.gen.pacnew
 82  [05/07/2018 11:12AM]: upgrading ca-certificates-mozilla...
 83  [05/07/2018 11:12AM]: installing perl-mailtools...
 84  [05/07/2018 11:12AM]: New optional dependencies for glib2
 85  [05/07/2018 11:12AM]:     python: gdbus-codegen, glib-genmarshal, glib-mkenums, gtester-report [installed]
 86  [05/07/2018 11:12AM]: New optional dependencies for gnupg
 87  [05/07/2018 11:12AM]: upgrading pacman-mirrorlist...
 88  [05/07/2018 11:12AM]: warning: /etc/pacman.d/mirrorlist installed as /etc/pacman.d/mirrorlist.pacnew
 89  [05/07/2018 11:12AM]: warning: directory permissions differ on /var/cache/pacman/
 90  [05/07/2018 11:12AM]: filesystem: 777  package: 755
 91  [05/07/2018 11:12AM]: upgrading systemd-sysvcompat...
 92  [05/07/2018 11:12AM]: :: Running post-transaction hooks...
 93  [05/07/2018 11:12AM]: ( 1/11) Warn about old perl modules
 94  [05/07/2018 11:12AM]: ( 2/11) Updating journal message catalog...
 95  [05/07/2018 11:12AM]: ( 3/11) Reloading system manager configuration...
 96  [05/07/2018 11:12AM]:   Skipped: Current root is not booted.
 97  [05/07/2018 11:12AM]: ( 4/11) Updating udev hardware database...
 98  [05/07/2018 11:12AM]: ( 5/11) Applying kernel sysctl settings...
 99  [05/07/2018 11:12AM]: ( 6/11) Creating system user accounts...
100  [05/07/2018 11:12AM]: ( 7/11) Creating temporary files...
101  [05/07/2018 11:12AM]:   Skipped: Device manager is not running.
102  [05/07/2018 11:12AM]: ( 9/11) Arming ConditionNeedsUpdate...
103  [05/07/2018 11:12AM]: (10/11) Updating the info directory file...
104  [05/07/2018 11:12AM]: (11/11) Rebuilding certificate stores...
105  [05/07/2018 11:12AM]: [\^/\^/^\^/^\^/\^/\^/^\^/^\^/]  i686 DETECTED  [\^/\^/^\^/^\^/\^/\^/^\^/^\^/]
106  [05/07/2018 11:12AM]: cp: -r not specified; omitting directory /pkg/32bit
107  [05/07/2018 11:12AM]: cp: -r not specified; omitting directory /pkg/32build
108  [05/07/2018 11:12AM]: [\^/\^/^\^/^\^/\^/\^/^\^/^\^/]  TRYING BUILD  [\^/\^/^\^/^\^/\^/\^/^\^/^\^/]
109  [05/07/2018 11:12AM]: [\^/\^/^\^/^\^/\^/\^/^\^/^\^/]  UPDATING SOURCE CHECKSUMS  [\^/\^/^\^/^\^/\^/\^/^\^/^\^/]
110  [05/07/2018 11:12AM]: ==> Generating checksums for source files...
111  [05/07/2018 11:12AM]: ==> Making package: albert 0.14.18-1 (Mon May  7 16:12:24 UTC 2018)
112  [05/07/2018 11:12AM]: ==> Checking runtime dependencies...
113  [05/07/2018 11:12AM]: ==> Installing missing dependencies...
114  [05/07/2018 11:12AM]: :: There are 2 providers available for libgl:
115  [05/07/2018 11:12AM]:    1) libglvnd  2) nvidia-340xx-utils
116  [05/07/2018 11:12AM]: Enter a number (default=1):
117  [05/07/2018 11:12AM]: warning: dependency cycle detected:
118  [05/07/2018 11:12AM]: warning: mesa will be installed before its libglvnd dependency
119  [05/07/2018 11:12AM]: warning: harfbuzz will be installed before its freetype2 dependency
120  [05/07/2018 11:12AM]: Packages (64) avahi-0.7+4+gd8d8c67-1  double-conversion-3.0.0-1  fontconfig-2.13.0+10+g58f5285-1  freetype2-2.9.1-1  graphite-1:1.3.11-1  harfbuzz-1.7.6-2  icu-61.1-1  libcups-2.2.7-2  libdaemon-0.14-3  libdrm-2.4.91-3  libevdev-1.5.9-1  libglvnd-1.0.0-1  libgudev-232-1  libice-1.0.9-2  libinput-1.10.6-1  libjpeg-turbo-1.5.3-1  libomxil-bellagio-0.9.3-1  libpciaccess-0.14-1  libpng-1.6.34-2  libproxy-0.4.15-6  libsm-1.2.2-2  libtiff-4.0.9-1  libunwind-1.2.1-1  libwacom-0.29-1  libxau-1.0.8-3  libxcb-1.13-1  libxdamage-1.1.4-3  libxdmcp-1.1.2-1  libxext-1.3.3-1  libxfixes-5.0.3-2  libxi-1.7.9-1  libxkbcommon-0.8.0-1  libxkbcommon-x11-0.8.0-1  libxml2-2.9.8-2  libxmu-1.1.2-1  libxrender-0.9.10-1  libxshmfence-1.3-1  libxt-1.1.5-1  libxxf86vm-1.1.4-1  llvm-libs-6.0.0-4  lm_sensors-3.4.0-2  mesa-18.0.2-1  mtdev-1.1.5-1  qt5-base-5.10.1-8  qt5-declarative-5.10.1-4  qt5-xmlpatterns-5.10.1-1  shared-mime-info-1.9-1  tslib-1.16-1  wayland-1.14.0-1  xcb-proto-1.13-1  xcb-util-0.4.0-1  xcb-util-image-0.4.0-1  xcb-util-keysyms-0.4.0-1  xcb-util-renderutil-0.3.9-1  xcb-util-wm-0.4.1-1  xdg-utils-1.1.2-2  xkeyboard-config-2.23.1-3  xorg-xset-1.2.4-1  xorgproto-2018.4-1  libx11-1.6.5-1  qt5-graphicaleffects-5.10.1-1  qt5-quickcontrols-5.10.1-1  qt5-svg-5.10.1-1  qt5-x11extras-5.10.1-1
121  [05/07/2018 11:12AM]: Total Download Size:     0.84 MiB
122  [05/07/2018 11:12AM]: Total Installed Size:  314.33 MiB
123  [05/07/2018 11:12AM]: downloading xcb-util-keysyms-0.4.0-1-x86_64.pkg.tar.xz...
124  [05/07/2018 11:12AM]: downloading xcb-util-renderutil-0.3.9-1-x86_64.pkg.tar.xz...
125  [05/07/2018 11:12AM]: downloading xcb-util-wm-0.4.1-1-x86_64.pkg.tar.xz...
126  [05/07/2018 11:12AM]: downloading libxkbcommon-x11-0.8.0-1-x86_64.pkg.tar.xz...
127  [05/07/2018 11:12AM]: installing xcb-util-keysyms...
128  [05/07/2018 11:12AM]: installing xcb-util-renderutil...
129  [05/07/2018 11:12AM]: installing libomxil-bellagio...
130  [05/07/2018 11:12AM]: Optional dependencies for lm_sensors
131  [05/07/2018 11:12AM]:     rrdtool: for logging with sensord
132  [05/07/2018 11:12AM]: Optional dependencies for mesa
133  [05/07/2018 11:12AM]:     opengl-man-pages: for the OpenGL API man pages
134  [05/07/2018 11:12AM]:     mesa-vdpau: for accelerated video playback
135  [05/07/2018 11:12AM]:     libva-mesa-driver: for accelerated video playback
136  [05/07/2018 11:12AM]: Optional dependencies for harfbuzz
137  [05/07/2018 11:12AM]:     cairo: hb-view program
138  [05/07/2018 11:12AM]: warning: directory permissions differ on /var/
139  [05/07/2018 11:12AM]:   Fontconfig configuration is done via /etc/fonts/conf.avail and conf.d.
140  [05/07/2018 11:12AM]:   Read /etc/fonts/conf.d/README for more information.
141  [05/07/2018 11:12AM]:   Configuration via /etc/fonts/local.conf is still possible,
142  [05/07/2018 11:12AM]:   but is no longer recommended for options available in conf.avail.
143  [05/07/2018 11:12AM]:   Main systemwide configuration should be done by symlinks
144  [05/07/2018 11:12AM]:   (especially for autohinting, sub-pixel and lcdfilter):
145  [05/07/2018 11:12AM]:   ln -s ../conf.avail/XX-foo.conf
146  [05/07/2018 11:12AM]:   Check also https://wiki.archlinux.org/index.php/Font_Configuration
147  [05/07/2018 11:12AM]:   and https://wiki.archlinux.org/index.php/Fonts.
148  [05/07/2018 11:12AM]: Rebuilding fontconfig cache... done.
149  [05/07/2018 11:12AM]: Optional dependencies for xdg-utils
150  [05/07/2018 11:12AM]:     kde-cli-tools: for KDE Plasma5 support in xdg-open
151  [05/07/2018 11:12AM]:     exo: for Xfce support in xdg-open
152  [05/07/2018 11:12AM]:     xorg-xprop: for Xfce support in xdg-open
153  [05/07/2018 11:12AM]:     pcmanfm: for LXDE support in xdg-open
154  [05/07/2018 11:12AM]:     perl-file-mimeinfo: for generic support in xdg-open
155  [05/07/2018 11:12AM]:     perl-net-dbus: Perl extension to dbus used in xdg-screensaver
156  [05/07/2018 11:12AM]:     perl-x11-protocol: Perl X11 protocol used in xdg-screensaver
157  [05/07/2018 11:12AM]: installing shared-mime-info...
158  [05/07/2018 11:12AM]: Optional dependencies for libinput
159  [05/07/2018 11:12AM]:     gtk3: libinput debug-gui
160  [05/07/2018 11:12AM]:     python-pyudev: libinput measure
161  [05/07/2018 11:12AM]:     python-evdev: libinput measure
162  [05/07/2018 11:12AM]: installing xkeyboard-config...
163  [05/07/2018 11:12AM]: installing libxkbcommon-x11...
164  [05/07/2018 11:12AM]: Optional dependencies for libproxy
165  [05/07/2018 11:12AM]:     networkmanager: NetworkManager configuration module
166  [05/07/2018 11:12AM]:     perl: Perl bindings [installed]
167  [05/07/2018 11:12AM]:     python2: Python 2.x bindings [installed]
168  [05/07/2018 11:12AM]:     python: Python 3.x bindings [installed]
169  [05/07/2018 11:12AM]:     glib2: gsettings configuration module [installed]
170  [05/07/2018 11:12AM]:     webkit2gtk: PAC proxy support (Webkit2gtk engine)
171  [05/07/2018 11:12AM]: Optional dependencies for libtiff
172  [05/07/2018 11:12AM]:     freeglut: for using tiffgt
173  [05/07/2018 11:12AM]: Optional dependencies for avahi
174  [05/07/2018 11:12AM]:     gtk3: avahi-discover, avahi-discover-standalone, bshell, bssh, bvnc
175  [05/07/2018 11:12AM]:     pygtk: avahi-bookmarks
176  [05/07/2018 11:12AM]:     python2-twisted: avahi-bookmarks
177  [05/07/2018 11:12AM]:     nss-mdns: NSS support for mDNS
178  [05/07/2018 11:12AM]:     python-gobject: avahi-discover
179  [05/07/2018 11:12AM]:     python-dbus: avahi-discover
180  [05/07/2018 11:12AM]: installing double-conversion...
181  [05/07/2018 11:12AM]: Optional dependencies for qt5-base
182  [05/07/2018 11:12AM]:     qt5-svg: to use SVG icon themes [pending]
183  [05/07/2018 11:12AM]:     postgresql-libs: PostgreSQL driver
184  [05/07/2018 11:12AM]:     libmariadbclient: MariaDB driver
185  [05/07/2018 11:12AM]:     libfbclient: Firebird/iBase driver
186  [05/07/2018 11:12AM]:     freetds: MS SQL driver
187  [05/07/2018 11:12AM]:     gtk3: GTK platform plugin
188  [05/07/2018 11:12AM]: installing qt5-xmlpatterns...
189  [05/07/2018 11:12AM]: installing qt5-declarative...
190  [05/07/2018 11:12AM]: installing qt5-graphicaleffects...
191  [05/07/2018 11:12AM]: installing qt5-quickcontrols...
192  [05/07/2018 11:12AM]: (1/7) Warn about old perl modules
193  [05/07/2018 11:12AM]: (2/7) Reloading system manager configuration...
194  [05/07/2018 11:12AM]: (3/7) Updating udev hardware database...
195  [05/07/2018 11:12AM]: (4/7) Creating system user accounts...
196  [05/07/2018 11:12AM]: (6/7) Arming ConditionNeedsUpdate...
197  [05/07/2018 11:12AM]: (7/7) Updating the MIME type database...
198  [05/07/2018 11:12AM]: :: There are 2 providers available for VIRTUALBOX-HOST-MODULES:
199  [05/07/2018 11:12AM]:    1) virtualbox-host-dkms  2) virtualbox-host-modules-arch
200  [05/07/2018 11:12AM]: Packages (14) dkms-2.5-1  jsoncpp-1.8.4-2  libuv-1.20.2-1  libvpx-1.7.0-1  libxcursor-1.1.15-1  libxinerama-1.1.3-2  procps-ng-3.3.14-1  rhash-1.3.6-1  sdl-1.2.15-9  virtualbox-host-dkms-5.2.10-1  cmake-3.11.1-1  muparser-2.2.5-2  virtualbox-5.2.10-1  virtualbox-sdk-5.2.10-1
201  [05/07/2018 11:12AM]: Total Download Size:    34.26 MiB
202  [05/07/2018 11:12AM]: Total Installed Size:  175.32 MiB
203  [05/07/2018 11:12AM]: downloading cmake-3.11.1-1-x86_64.pkg.tar.xz...
204  [05/07/2018 11:12AM]: downloading muparser-2.2.5-2-x86_64.pkg.tar.xz...
205  [05/07/2018 11:12AM]: downloading sdl-1.2.15-9-x86_64.pkg.tar.xz...
206  [05/07/2018 11:12AM]: downloading virtualbox-host-dkms-5.2.10-1-x86_64.pkg.tar.xz...
207  [05/07/2018 11:12AM]: downloading virtualbox-5.2.10-1-x86_64.pkg.tar.xz...
208  [05/07/2018 11:12AM]: downloading virtualbox-sdk-5.2.10-1-x86_64.pkg.tar.xz...
209  [05/07/2018 11:12AM]: Optional dependencies for jsoncpp
210  [05/07/2018 11:12AM]:     jsoncpp-doc: documentation
211  [05/07/2018 11:12AM]: Optional dependencies for cmake
212  [05/07/2018 11:12AM]:     libxkbcommon-x11: cmake-gui [installed]
213  [05/07/2018 11:12AM]: Optional dependencies for sdl
214  [05/07/2018 11:12AM]:     alsa-lib: ALSA audio driver
215  [05/07/2018 11:12AM]:     libpulse: PulseAudio audio driver
216  [05/07/2018 11:12AM]: Optional dependencies for libxcursor
217  [05/07/2018 11:12AM]:     gnome-themes-standard: fallback icon theme
218  [05/07/2018 11:12AM]: Optional dependencies for dkms
219  [05/07/2018 11:12AM]:     linux-headers: build modules against the Arch kernel
220  [05/07/2018 11:12AM]:     linux-lts-headers: build modules against the LTS kernel
221  [05/07/2018 11:12AM]:     linux-zen-headers: build modules against the ZEN kernel
222  [05/07/2018 11:12AM]:     linux-hardened-headers: build modules against the HARDENED kernel
223  [05/07/2018 11:12AM]: installing virtualbox-host-dkms...
224  [05/07/2018 11:12AM]: Optional dependencies for virtualbox-host-dkms
225  [05/07/2018 11:12AM]:     linux-headers: build modules against Arch kernel
226  [05/07/2018 11:12AM]:     linux-lts-headers: build modules against LTS kernel
227  [05/07/2018 11:12AM]:     linux-zen-headers: build modules against ZEN kernel
228  [05/07/2018 11:12AM]: Optional dependencies for virtualbox
229  [05/07/2018 11:12AM]:     vde2: Virtual Distributed Ethernet support
230  [05/07/2018 11:12AM]:     virtualbox-guest-iso: Guest Additions CD image
231  [05/07/2018 11:12AM]:     virtualbox-ext-vnc: VNC server support
232  [05/07/2018 11:12AM]:     virtualbox-sdk: Developer kit [pending]
233  [05/07/2018 11:12AM]: ==> Missing mandatory directory: /usr/lib/modules. Exiting!
234  [05/07/2018 11:12AM]: error: command failed to execute correctly
235  [05/07/2018 11:12AM]:   -> Cloning mirrors/albert git repo...
236  [05/07/2018 11:12AM]: Cloning into bare repository /pkg/mirrors/albert...
237  [05/07/2018 11:12AM]:   -> Cloning mirrors/plugins git repo...
238  [05/07/2018 11:12AM]: Cloning into bare repository /pkg/mirrors/plugins...
239  [05/07/2018 11:12AM]:   -> Cloning mirrors/python git repo...
240  [05/07/2018 11:12AM]: Cloning into bare repository /pkg/mirrors/python...
241  [05/07/2018 11:12AM]:   -> Cloning mirrors/pybind11 git repo...
242  [05/07/2018 11:12AM]: Cloning into bare repository /pkg/mirrors/pybind11...
243  [05/07/2018 11:12AM]: ==> Validating source files with md5sums...
244  [05/07/2018 11:12AM]:     mirrors/albert ... Skipped
245  [05/07/2018 11:12AM]:     mirrors/plugins ... Skipped
246  [05/07/2018 11:12AM]:     mirrors/pybind11 ... Skipped
247  [05/07/2018 11:12AM]:   -> Creating working copy of albert git repo...
248  [05/07/2018 11:12AM]: Switched to a new branch makepkg
249  [05/07/2018 11:12AM]:   -> Creating working copy of plugins git repo...
250  [05/07/2018 11:12AM]:   -> Creating working copy of python git repo...
251  [05/07/2018 11:12AM]:   -> Creating working copy of pybind11 git repo...
252  [05/07/2018 11:12AM]: Submodule plugins (https://github.com/albertlauncher/plugins.git) registered for path plugins
253  [05/07/2018 11:12AM]: Cloning into /pkg/src/albert/plugins...
254  [05/07/2018 11:12AM]: Submodule path plugins: checked out ea3a077cc6fa6e5977441e9c49781a6925d068e4
255  [05/07/2018 11:12AM]: Submodule python/pybind11 (https://github.com/pybind/pybind11.git) registered for path python/pybind11
256  [05/07/2018 11:12AM]: Submodule python/share/modules (https://github.com/albertlauncher/python.git) registered for path python/share/modules
257  [05/07/2018 11:12AM]: Cloning into /pkg/src/albert/plugins/python/pybind11...
258  [05/07/2018 11:12AM]: Cloning into /pkg/src/albert/plugins/python/share/modules...
259  [05/07/2018 11:12AM]: Submodule path python/pybind11: checked out 86e2ad4f77442c3350f9a2476650da6bee253c52
260  [05/07/2018 11:12AM]: Submodule path python/share/modules: checked out 3b3788b31de768f4d9b40b207db728a6c03f4207
261  [05/07/2018 11:12AM]:    ╭──────────────────────────────────────────────╮
262  [05/07/2018 11:12AM]:    │                                              │
263  [05/07/2018 11:12AM]:    │      This is a plugin based application      │
264  [05/07/2018 11:12AM]:    │       Check the optional dependencies        │
265  [05/07/2018 11:12AM]:    │   If you plan to report bugs please modify   │
266  [05/07/2018 11:12AM]:    │   the PKGBUILD to build the debug version.   │
267  [05/07/2018 11:12AM]:    ╰──────────────────────────────────────────────╯
268  [05/07/2018 11:12AM]: -- The C compiler identification is GNU 8.1.0
269  [05/07/2018 11:12AM]: -- The CXX compiler identification is GNU 8.1.0
270  [05/07/2018 11:12AM]: -- Check for working C compiler: /usr/sbin/cc
271  [05/07/2018 11:12AM]: -- Check for working C compiler: /usr/sbin/cc -- works
272  [05/07/2018 11:12AM]: -- Detecting C compiler ABI info
273  [05/07/2018 11:12AM]: -- Detecting C compiler ABI info - done
274  [05/07/2018 11:12AM]: -- Detecting C compile features
275  [05/07/2018 11:12AM]: -- Detecting C compile features - done
276  [05/07/2018 11:12AM]: -- Check for working CXX compiler: /usr/sbin/c++
277  [05/07/2018 11:12AM]: -- Check for working CXX compiler: /usr/sbin/c++ -- works
278  [05/07/2018 11:12AM]: -- Detecting CXX compiler ABI info
279  [05/07/2018 11:12AM]: -- Detecting CXX compiler ABI info - done
280  [05/07/2018 11:12AM]: -- Detecting CXX compile features
281  [05/07/2018 11:12AM]: -- Detecting CXX compile features - done
282  [05/07/2018 11:12AM]: -- Found PythonInterp: /usr/sbin/python3.6 (found version 3.6.5)
283  [05/07/2018 11:12AM]: -- Found PythonLibs: /usr/lib/libpython3.6m.so
284  [05/07/2018 11:12AM]: -- Build files have been written to: /pkg/src/build
285  [05/07/2018 11:12AM]: Scanning dependencies of target globalshortcut_autogen
286  [05/07/2018 11:12AM]: [  0%] Automatic MOC and UIC for target globalshortcut
287  [05/07/2018 11:12AM]: [  0%] Built target globalshortcut_autogen
288  [05/07/2018 11:12AM]: Scanning dependencies of target globalshortcut
289  [05/07/2018 11:12AM]: [  0%] Building CXX object lib/globalshortcut/CMakeFiles/globalshortcut.dir/src/hotkeymanager.cpp.o
290  [05/07/2018 11:12AM]: [  1%] Building CXX object lib/globalshortcut/CMakeFiles/globalshortcut.dir/src/hotkeymanager_x11.cpp.o
291  [05/07/2018 11:12AM]: [  1%] Building CXX object lib/globalshortcut/CMakeFiles/globalshortcut.dir/globalshortcut_autogen/mocs_compilation.cpp.o
292  [05/07/2018 11:13AM]: [  2%] Linking CXX shared library ../libglobalshortcut.so
293  [05/07/2018 11:13AM]: [  2%] Built target globalshortcut
294  [05/07/2018 11:13AM]: Scanning dependencies of target xdg_autogen
295  [05/07/2018 11:13AM]: [  3%] Automatic MOC and UIC for target xdg
296  [05/07/2018 11:13AM]: [  3%] Built target xdg_autogen
297  [05/07/2018 11:13AM]: Scanning dependencies of target xdg
298  [05/07/2018 11:13AM]: [  3%] Building CXX object lib/xdg/CMakeFiles/xdg.dir/src/iconlookup.cpp.o
299  [05/07/2018 11:13AM]: [  4%] Building CXX object lib/xdg/CMakeFiles/xdg.dir/src/themefileparser.cpp.o
300  [05/07/2018 11:13AM]: [  4%] Building CXX object lib/xdg/CMakeFiles/xdg.dir/xdg_autogen/mocs_compilation.cpp.o
301  [05/07/2018 11:13AM]: [  5%] Linking CXX shared library ../libxdg.so
302  [05/07/2018 11:13AM]: Scanning dependencies of target albertcore_autogen
303  [05/07/2018 11:13AM]: [  6%] Automatic MOC and UIC for target albertcore
304  [05/07/2018 11:13AM]: [  6%] Built target albertcore_autogen
305  [05/07/2018 11:13AM]: [  6%] Automatic RCC for resources.qrc
306  [05/07/2018 11:13AM]: Scanning dependencies of target albertcore
307  [05/07/2018 11:13AM]: [  7%] Building CXX object lib/albertcore/CMakeFiles/albertcore.dir/src/core/albert.cpp.o
308  [05/07/2018 11:13AM]: [  7%] Building CXX object lib/albertcore/CMakeFiles/albertcore.dir/src/core/extension.cpp.o
309  [05/07/2018 11:13AM]: [  8%] Building CXX object lib/albertcore/CMakeFiles/albertcore.dir/src/core/extensionmanager.cpp.o
310  [05/07/2018 11:13AM]: [  9%] Building CXX object lib/albertcore/CMakeFiles/albertcore.dir/src/core/frontendmanager.cpp.o
311  [05/07/2018 11:13AM]: [  9%] Building CXX object lib/albertcore/CMakeFiles/albertcore.dir/src/core/history.cpp.o
312  [05/07/2018 11:13AM]: [ 10%] Building CXX object lib/albertcore/CMakeFiles/albertcore.dir/src/core/matchcompare.cpp.o
313  [05/07/2018 11:13AM]: [ 10%] Building CXX object lib/albertcore/CMakeFiles/albertcore.dir/src/core/plugin.cpp.o
314  [05/07/2018 11:13AM]: [ 11%] Building CXX object lib/albertcore/CMakeFiles/albertcore.dir/src/core/pluginspec.cpp.o
315  [05/07/2018 11:13AM]: [ 11%] Building CXX object lib/albertcore/CMakeFiles/albertcore.dir/src/core/query.cpp.o
316  [05/07/2018 11:13AM]: [ 12%] Building CXX object lib/albertcore/CMakeFiles/albertcore.dir/src/core/queryexecution.cpp.o
317  [05/07/2018 11:13AM]: [ 13%] Building CXX object lib/albertcore/CMakeFiles/albertcore.dir/src/core/querymanager.cpp.o
318  [05/07/2018 11:13AM]: [ 13%] Building CXX object lib/albertcore/CMakeFiles/albertcore.dir/src/core/settingswidget/grabkeybutton.cpp.o
319  [05/07/2018 11:13AM]: [ 14%] Building CXX object lib/albertcore/CMakeFiles/albertcore.dir/src/core/settingswidget/loadermodel.cpp.o
320  [05/07/2018 11:13AM]: /pkg/src/albert/lib/albertcore/src/core/settingswidget/loadermodel.cpp: In member function virtual QVariant Core::LoaderModel::data(const QModelIndex&, int) const:
321  [05/07/2018 11:13AM]: /pkg/src/albert/lib/albertcore/src/core/settingswidget/loadermodel.cpp:61:9: warning: this statement may fall through [-Wimplicit-fallthrough=]
322  [05/07/2018 11:13AM]:          switch (loader->state()) {
323  [05/07/2018 11:13AM]: /pkg/src/albert/lib/albertcore/src/core/settingswidget/loadermodel.cpp:69:5: note: here
324  [05/07/2018 11:13AM]:      case Qt::CheckStateRole:
325  [05/07/2018 11:13AM]: [ 14%] Building CXX object lib/albertcore/CMakeFiles/albertcore.dir/src/core/settingswidget/settingswidget.cpp.o
326  [05/07/2018 11:13AM]: [ 15%] Building CXX object lib/albertcore/CMakeFiles/albertcore.dir/src/core/trayicon.cpp.o
327  [05/07/2018 11:13AM]: [ 15%] Building CXX object lib/albertcore/CMakeFiles/albertcore.dir/src/core/usagedatabase.cpp.o
328  [05/07/2018 11:13AM]: [ 16%] Building CXX object lib/albertcore/CMakeFiles/albertcore.dir/src/util/fuzzysearch.cpp.o
329  [05/07/2018 11:14AM]: [ 17%] Building CXX object lib/albertcore/CMakeFiles/albertcore.dir/src/util/offlineindex.cpp.o
330  [05/07/2018 11:14AM]: [ 17%] Building CXX object lib/albertcore/CMakeFiles/albertcore.dir/src/util/prefixsearch.cpp.o
331  [05/07/2018 11:14AM]: [ 18%] Building CXX object lib/albertcore/CMakeFiles/albertcore.dir/src/util/searchbase.cpp.o
332  [05/07/2018 11:14AM]: [ 18%] Building CXX object lib/albertcore/CMakeFiles/albertcore.dir/src/util/shutil.cpp.o
333  [05/07/2018 11:14AM]: [ 19%] Building CXX object lib/albertcore/CMakeFiles/albertcore.dir/albertcore_autogen/mocs_compilation.cpp.o
334  [05/07/2018 11:14AM]: [ 19%] Building CXX object lib/albertcore/CMakeFiles/albertcore.dir/albertcore_autogen/EWIEGA46WW/qrc_resources.cpp.o
335  [05/07/2018 11:14AM]: [ 20%] Linking CXX shared library ../libalbertcore.so
336  [05/07/2018 11:14AM]: [ 20%] Built target albertcore
337  [05/07/2018 11:14AM]: Scanning dependencies of target albert
338  [05/07/2018 11:14AM]: [ 20%] Building CXX object application/CMakeFiles/albert.dir/main.cpp.o
339  [05/07/2018 11:14AM]: [ 21%] Linking CXX executable ../bin/albert
340  [05/07/2018 11:14AM]: [ 21%] Built target albert
341  [05/07/2018 11:14AM]: Scanning dependencies of target widgetboxmodel_autogen
342  [05/07/2018 11:14AM]: [ 22%] Automatic MOC and UIC for target widgetboxmodel
343  [05/07/2018 11:14AM]: [ 22%] Built target widgetboxmodel_autogen
344  [05/07/2018 11:14AM]: Scanning dependencies of target widgetboxmodel
345  [05/07/2018 11:14AM]: [ 22%] Building CXX object plugins/widgetboxmodel/CMakeFiles/widgetboxmodel.dir/src/actionlist.cpp.o
346  [05/07/2018 11:14AM]: [ 23%] Building CXX object plugins/widgetboxmodel/CMakeFiles/widgetboxmodel.dir/src/configwidget.cpp.o
347  [05/07/2018 11:14AM]: [ 24%] Building CXX object plugins/widgetboxmodel/CMakeFiles/widgetboxmodel.dir/src/frontendplugin.cpp.o
348  [05/07/2018 11:14AM]: [ 24%] Building CXX object plugins/widgetboxmodel/CMakeFiles/widgetboxmodel.dir/src/frontendwidget.cpp.o
349  [05/07/2018 11:14AM]: [ 25%] Building CXX object plugins/widgetboxmodel/CMakeFiles/widgetboxmodel.dir/src/resizinglist.cpp.o
350  [05/07/2018 11:14AM]: [ 25%] Building CXX object plugins/widgetboxmodel/CMakeFiles/widgetboxmodel.dir/src/resultslist.cpp.o
351  [05/07/2018 11:14AM]: [ 26%] Building CXX object plugins/widgetboxmodel/CMakeFiles/widgetboxmodel.dir/src/settingsbutton.cpp.o
352  [05/07/2018 11:14AM]: [ 26%] Building CXX object plugins/widgetboxmodel/CMakeFiles/widgetboxmodel.dir/widgetboxmodel_autogen/mocs_compilation.cpp.o
353  [05/07/2018 11:14AM]: [ 27%] Linking CXX shared library ../../lib/libwidgetboxmodel.so
354  [05/07/2018 11:14AM]: [ 27%] Built target widgetboxmodel
355  [05/07/2018 11:14AM]: Scanning dependencies of target qmlboxmodel_autogen
356  [05/07/2018 11:14AM]: [ 28%] Automatic MOC and UIC for target qmlboxmodel
357  [05/07/2018 11:14AM]: [ 28%] Built target qmlboxmodel_autogen
358  [05/07/2018 11:14AM]: Scanning dependencies of target qmlboxmodel
359  [05/07/2018 11:14AM]: [ 28%] Building CXX object plugins/qmlboxmodel/CMakeFiles/qmlboxmodel.dir/src/configwidget.cpp.o
360  [05/07/2018 11:14AM]: [ 29%] Building CXX object plugins/qmlboxmodel/CMakeFiles/qmlboxmodel.dir/src/frontendplugin.cpp.o
361  [05/07/2018 11:14AM]: [ 30%] Building CXX object plugins/qmlboxmodel/CMakeFiles/qmlboxmodel.dir/src/mainwindow.cpp.o
362  [05/07/2018 11:14AM]: [ 30%] Building CXX object plugins/qmlboxmodel/CMakeFiles/qmlboxmodel.dir/src/propertyeditor.cpp.o
363  [05/07/2018 11:14AM]: [ 31%] Building CXX object plugins/qmlboxmodel/CMakeFiles/qmlboxmodel.dir/qmlboxmodel_autogen/mocs_compilation.cpp.o
364  [05/07/2018 11:14AM]: [ 31%] Linking CXX shared library ../../lib/libqmlboxmodel.so
365  [05/07/2018 11:14AM]: [ 31%] Built target qmlboxmodel
366  [05/07/2018 11:14AM]: Scanning dependencies of target applications_autogen
367  [05/07/2018 11:14AM]: [ 32%] Automatic MOC and UIC for target applications
368  [05/07/2018 11:14AM]: [ 32%] Built target applications_autogen
369  [05/07/2018 11:14AM]: [ 32%] Automatic RCC for applications.qrc
370  [05/07/2018 11:14AM]: Scanning dependencies of target applications
371  [05/07/2018 11:14AM]: [ 33%] Building CXX object plugins/applications/CMakeFiles/applications.dir/src/configwidget.cpp.o
372  [05/07/2018 11:15AM]: [ 33%] Building CXX object plugins/applications/CMakeFiles/applications.dir/src/extension.cpp.o
373  [05/07/2018 11:15AM]: [ 34%] Building CXX object plugins/applications/CMakeFiles/applications.dir/applications_autogen/mocs_compilation.cpp.o
374  [05/07/2018 11:15AM]: [ 34%] Building CXX object plugins/applications/CMakeFiles/applications.dir/applications_autogen/EWIEGA46WW/qrc_applications.cpp.o
375  [05/07/2018 11:15AM]: [ 35%] Linking CXX shared library ../../lib/libapplications.so
376  [05/07/2018 11:15AM]: [ 35%] Built target applications
377  [05/07/2018 11:15AM]: Scanning dependencies of target calculator_autogen
378  [05/07/2018 11:15AM]: [ 36%] Automatic MOC and UIC for target calculator
379  [05/07/2018 11:15AM]: [ 36%] Built target calculator_autogen
380  [05/07/2018 11:15AM]: [ 36%] Automatic RCC for calculator.qrc
381  [05/07/2018 11:15AM]: Scanning dependencies of target calculator
382  [05/07/2018 11:15AM]: [ 37%] Building CXX object plugins/calculator/CMakeFiles/calculator.dir/src/configwidget.cpp.o
383  [05/07/2018 11:15AM]: [ 37%] Building CXX object plugins/calculator/CMakeFiles/calculator.dir/src/extension.cpp.o
384  [05/07/2018 11:15AM]: [ 38%] Building CXX object plugins/calculator/CMakeFiles/calculator.dir/calculator_autogen/mocs_compilation.cpp.o
385  [05/07/2018 11:15AM]: [ 38%] Building CXX object plugins/calculator/CMakeFiles/calculator.dir/calculator_autogen/EWIEGA46WW/qrc_calculator.cpp.o
386  [05/07/2018 11:15AM]: [ 39%] Linking CXX shared library ../../lib/libcalculator.so
387  [05/07/2018 11:15AM]: [ 39%] Built target calculator
388  [05/07/2018 11:15AM]: Scanning dependencies of target chromebookmarks_autogen
389  [05/07/2018 11:15AM]: [ 40%] Automatic MOC and UIC for target chromebookmarks
390  [05/07/2018 11:15AM]: [ 40%] Built target chromebookmarks_autogen
391  [05/07/2018 11:15AM]: [ 40%] Automatic RCC for chromebookmarks.qrc
392  [05/07/2018 11:15AM]: Scanning dependencies of target chromebookmarks
393  [05/07/2018 11:15AM]: [ 41%] Building CXX object plugins/chromebookmarks/CMakeFiles/chromebookmarks.dir/src/configwidget.cpp.o
394  [05/07/2018 11:15AM]: [ 41%] Building CXX object plugins/chromebookmarks/CMakeFiles/chromebookmarks.dir/src/extension.cpp.o
395  [05/07/2018 11:15AM]: [ 42%] Building CXX object plugins/chromebookmarks/CMakeFiles/chromebookmarks.dir/chromebookmarks_autogen/mocs_compilation.cpp.o
396  [05/07/2018 11:15AM]: [ 43%] Building CXX object plugins/chromebookmarks/CMakeFiles/chromebookmarks.dir/chromebookmarks_autogen/EWIEGA46WW/qrc_chromebookmarks.cpp.o
397  [05/07/2018 11:15AM]: [ 43%] Linking CXX shared library ../../lib/libchromebookmarks.so
398  [05/07/2018 11:15AM]: [ 43%] Built target chromebookmarks
399  [05/07/2018 11:15AM]: Scanning dependencies of target externalextensions_autogen
400  [05/07/2018 11:15AM]: [ 44%] Automatic MOC and UIC for target externalextensions
401  [05/07/2018 11:15AM]: [ 44%] Built target externalextensions_autogen
402  [05/07/2018 11:15AM]: Scanning dependencies of target externalextensions
403  [05/07/2018 11:15AM]: [ 44%] Building CXX object plugins/externalextensions/CMakeFiles/externalextensions.dir/src/configwidget.cpp.o
404  [05/07/2018 11:15AM]: [ 45%] Building CXX object plugins/externalextensions/CMakeFiles/externalextensions.dir/src/extension.cpp.o
405  [05/07/2018 11:15AM]: [ 45%] Building CXX object plugins/externalextensions/CMakeFiles/externalextensions.dir/src/externalextension.cpp.o
406  [05/07/2018 11:15AM]: [ 46%] Building CXX object plugins/externalextensions/CMakeFiles/externalextensions.dir/src/externalextensionmodel.cpp.o
407  [05/07/2018 11:15AM]: [ 47%] Building CXX object plugins/externalextensions/CMakeFiles/externalextensions.dir/externalextensions_autogen/mocs_compilation.cpp.o
408  [05/07/2018 11:15AM]: [ 47%] Linking CXX shared library ../../lib/libexternalextensions.so
409  [05/07/2018 11:15AM]: [ 47%] Built target externalextensions
410  [05/07/2018 11:15AM]: Scanning dependencies of target files_autogen
411  [05/07/2018 11:15AM]: [ 48%] Automatic MOC and UIC for target files
412  [05/07/2018 11:15AM]: [ 48%] Built target files_autogen
413  [05/07/2018 11:15AM]: [ 48%] Automatic RCC for files.qrc
414  [05/07/2018 11:15AM]: Scanning dependencies of target files
415  [05/07/2018 11:15AM]: [ 49%] Building CXX object plugins/files/CMakeFiles/files.dir/src/configwidget.cpp.o
416  [05/07/2018 11:16AM]: [ 49%] Building CXX object plugins/files/CMakeFiles/files.dir/src/extension.cpp.o
417  [05/07/2018 11:16AM]: [ 50%] Building CXX object plugins/files/CMakeFiles/files.dir/src/file.cpp.o
418  [05/07/2018 11:16AM]: [ 51%] Building CXX object plugins/files/CMakeFiles/files.dir/src/indexfile.cpp.o
419  [05/07/2018 11:16AM]: [ 51%] Building CXX object plugins/files/CMakeFiles/files.dir/src/indextreenode.cpp.o
420  [05/07/2018 11:16AM]: [ 52%] Building CXX object plugins/files/CMakeFiles/files.dir/src/mimetypedialog.cpp.o
421  [05/07/2018 11:16AM]: [ 52%] Building CXX object plugins/files/CMakeFiles/files.dir/src/standardfile.cpp.o
422  [05/07/2018 11:16AM]: [ 53%] Building CXX object plugins/files/CMakeFiles/files.dir/files_autogen/mocs_compilation.cpp.o
423  [05/07/2018 11:16AM]: [ 53%] Building CXX object plugins/files/CMakeFiles/files.dir/files_autogen/EWIEGA46WW/qrc_files.cpp.o
424  [05/07/2018 11:16AM]: [ 54%] Linking CXX shared library ../../lib/libfiles.so
425  [05/07/2018 11:16AM]: Scanning dependencies of target firefoxbookmarks_autogen
426  [05/07/2018 11:16AM]: [ 55%] Automatic MOC and UIC for target firefoxbookmarks
427  [05/07/2018 11:16AM]: [ 55%] Built target firefoxbookmarks_autogen
428  [05/07/2018 11:16AM]: [ 55%] Automatic RCC for firefoxbookmarks.qrc
429  [05/07/2018 11:16AM]: Scanning dependencies of target firefoxbookmarks
430  [05/07/2018 11:16AM]: [ 56%] Building CXX object plugins/firefoxbookmarks/CMakeFiles/firefoxbookmarks.dir/src/configwidget.cpp.o
431  [05/07/2018 11:16AM]: [ 56%] Building CXX object plugins/firefoxbookmarks/CMakeFiles/firefoxbookmarks.dir/src/extension.cpp.o
432  [05/07/2018 11:16AM]: [ 57%] Building CXX object plugins/firefoxbookmarks/CMakeFiles/firefoxbookmarks.dir/firefoxbookmarks_autogen/mocs_compilation.cpp.o
433  [05/07/2018 11:16AM]: [ 57%] Building CXX object plugins/firefoxbookmarks/CMakeFiles/firefoxbookmarks.dir/firefoxbookmarks_autogen/EWIEGA46WW/qrc_firefoxbookmarks.cpp.o
434  [05/07/2018 11:16AM]: [ 58%] Linking CXX shared library ../../lib/libfirefoxbookmarks.so
435  [05/07/2018 11:16AM]: [ 58%] Built target firefoxbookmarks
436  [05/07/2018 11:16AM]: Scanning dependencies of target hashgenerator_autogen
437  [05/07/2018 11:16AM]: [ 59%] Automatic MOC and UIC for target hashgenerator
438  [05/07/2018 11:16AM]: [ 59%] Built target hashgenerator_autogen
439  [05/07/2018 11:16AM]: [ 60%] Automatic RCC for hashgenerator.qrc
440  [05/07/2018 11:16AM]: Scanning dependencies of target hashgenerator
441  [05/07/2018 11:16AM]: [ 61%] Building CXX object plugins/hashgenerator/CMakeFiles/hashgenerator.dir/src/configwidget.cpp.o
442  [05/07/2018 11:16AM]: [ 61%] Building CXX object plugins/hashgenerator/CMakeFiles/hashgenerator.dir/src/extension.cpp.o
443  [05/07/2018 11:16AM]: [ 62%] Building CXX object plugins/hashgenerator/CMakeFiles/hashgenerator.dir/hashgenerator_autogen/mocs_compilation.cpp.o
444  [05/07/2018 11:16AM]: [ 62%] Building CXX object plugins/hashgenerator/CMakeFiles/hashgenerator.dir/hashgenerator_autogen/EWIEGA46WW/qrc_hashgenerator.cpp.o
445  [05/07/2018 11:16AM]: [ 63%] Linking CXX shared library ../../lib/libhashgenerator.so
446  [05/07/2018 11:16AM]: [ 63%] Built target hashgenerator
447  [05/07/2018 11:16AM]: Scanning dependencies of target mpris_autogen
448  [05/07/2018 11:16AM]: [ 64%] Automatic MOC and UIC for target mpris
449  [05/07/2018 11:16AM]: [ 64%] Automatic RCC for mpris.qrc
450  [05/07/2018 11:16AM]: Scanning dependencies of target mpris
451  [05/07/2018 11:16AM]: [ 65%] Building CXX object plugins/mpris/CMakeFiles/mpris.dir/src/command.cpp.o
452  [05/07/2018 11:16AM]: [ 65%] Building CXX object plugins/mpris/CMakeFiles/mpris.dir/src/configwidget.cpp.o
453  [05/07/2018 11:16AM]: [ 66%] Building CXX object plugins/mpris/CMakeFiles/mpris.dir/src/extension.cpp.o
454  [05/07/2018 11:17AM]: [ 66%] Building CXX object plugins/mpris/CMakeFiles/mpris.dir/src/item.cpp.o
455  [05/07/2018 11:17AM]: [ 67%] Building CXX object plugins/mpris/CMakeFiles/mpris.dir/mpris_autogen/mocs_compilation.cpp.o
456  [05/07/2018 11:17AM]: [ 68%] Building CXX object plugins/mpris/CMakeFiles/mpris.dir/mpris_autogen/EWIEGA46WW/qrc_mpris.cpp.o
457  [05/07/2018 11:17AM]: [ 68%] Linking CXX shared library ../../lib/libmpris.so
458  [05/07/2018 11:17AM]: Scanning dependencies of target python_autogen
459  [05/07/2018 11:17AM]: [ 69%] Automatic MOC and UIC for target python
460  [05/07/2018 11:17AM]: [ 69%] Built target python_autogen
461  [05/07/2018 11:17AM]: [ 69%] Automatic RCC for python.qrc
462  [05/07/2018 11:17AM]: Scanning dependencies of target python
463  [05/07/2018 11:17AM]: [ 70%] Building CXX object plugins/python/CMakeFiles/python.dir/src/configwidget.cpp.o
464  [05/07/2018 11:17AM]: [ 70%] Building CXX object plugins/python/CMakeFiles/python.dir/src/extension.cpp.o
465  [05/07/2018 11:17AM]: In file included from /pkg/src/albert/plugins/python/pybind11/include/pybind11/embed.h:12,
466  [05/07/2018 11:17AM]:                  from /pkg/src/albert/plugins/python/src/extension.cpp:3:
467  [05/07/2018 11:17AM]: /pkg/src/albert/plugins/python/pybind11/include/pybind11/pybind11.h: In member function void pybind11::cpp_function::initialize_generic(pybind11::detail::function_record*, const char*, const std::type_info* const*, pybind11::size_t):
468  [05/07/2018 11:17AM]: /pkg/src/albert/plugins/python/pybind11/include/pybind11/pybind11.h:320:74: warning: cast between incompatible function types from PyObject* (*)(PyObject*, PyObject*, PyObject*) {aka _object* (*)(_object*, _object*, _object*)} to PyCFunction {aka _object* (*)(_object*, _object*)} [-Wcast-function-type]
469  [05/07/2018 11:17AM]:              rec->def->ml_meth = reinterpret_cast<PyCFunction>(*dispatcher);
470  [05/07/2018 11:17AM]:                                                                           ^
471  [05/07/2018 11:17AM]: [ 71%] Building CXX object plugins/python/CMakeFiles/python.dir/src/modulesmodel.cpp.o
472  [05/07/2018 11:17AM]: [ 72%] Building CXX object plugins/python/CMakeFiles/python.dir/src/pythonmodulev1.cpp.o
473  [05/07/2018 11:17AM]:                  from /pkg/src/albert/plugins/python/src/pythonmodulev1.cpp:3:
474  [05/07/2018 11:17AM]: [ 72%] Building CXX object plugins/python/CMakeFiles/python.dir/python_autogen/mocs_compilation.cpp.o
475  [05/07/2018 11:17AM]: [ 73%] Building CXX object plugins/python/CMakeFiles/python.dir/python_autogen/EWIEGA46WW/qrc_python.cpp.o
476  [05/07/2018 11:17AM]: [ 73%] Linking CXX shared library ../../lib/libpython.so
477  [05/07/2018 11:17AM]: [ 73%] Built target python
478  [05/07/2018 11:17AM]: Scanning dependencies of target snippets_autogen
479  [05/07/2018 11:17AM]: [ 73%] Automatic MOC and UIC for target snippets
480  [05/07/2018 11:17AM]: [ 73%] Built target snippets_autogen
481  [05/07/2018 11:17AM]: [ 73%] Automatic RCC for snippets.qrc
482  [05/07/2018 11:17AM]: Scanning dependencies of target snippets
483  [05/07/2018 11:17AM]: [ 74%] Building CXX object plugins/snippets/CMakeFiles/snippets.dir/src/configwidget.cpp.o
484  [05/07/2018 11:17AM]: [ 75%] Building CXX object plugins/snippets/CMakeFiles/snippets.dir/src/extension.cpp.o
485  [05/07/2018 11:17AM]: [ 75%] Building CXX object plugins/snippets/CMakeFiles/snippets.dir/src/snippeteditordialog.cpp.o
486  [05/07/2018 11:17AM]: [ 76%] Building CXX object plugins/snippets/CMakeFiles/snippets.dir/snippets_autogen/mocs_compilation.cpp.o
487  [05/07/2018 11:18AM]: [ 76%] Building CXX object plugins/snippets/CMakeFiles/snippets.dir/snippets_autogen/EWIEGA46WW/qrc_snippets.cpp.o
488  [05/07/2018 11:18AM]: [ 77%] Linking CXX shared library ../../lib/libsnippets.so
489  [05/07/2018 11:18AM]: [ 77%] Built target snippets
490  [05/07/2018 11:18AM]: Scanning dependencies of target ssh_autogen
491  [05/07/2018 11:18AM]: [ 77%] Automatic MOC and UIC for target ssh
492  [05/07/2018 11:18AM]: [ 78%] Automatic RCC for ssh.qrc
493  [05/07/2018 11:18AM]: Scanning dependencies of target ssh
494  [05/07/2018 11:18AM]: [ 79%] Building CXX object plugins/ssh/CMakeFiles/ssh.dir/src/configwidget.cpp.o
495  [05/07/2018 11:18AM]: [ 79%] Building CXX object plugins/ssh/CMakeFiles/ssh.dir/src/extension.cpp.o
496  [05/07/2018 11:18AM]: [ 80%] Building CXX object plugins/ssh/CMakeFiles/ssh.dir/ssh_autogen/mocs_compilation.cpp.o
497  [05/07/2018 11:18AM]: [ 80%] Building CXX object plugins/ssh/CMakeFiles/ssh.dir/ssh_autogen/EWIEGA46WW/qrc_ssh.cpp.o
498  [05/07/2018 11:18AM]: [ 81%] Linking CXX shared library ../../lib/libssh.so
499  [05/07/2018 11:18AM]: Scanning dependencies of target system_autogen
500  [05/07/2018 11:18AM]: [ 82%] Automatic MOC and UIC for target system
501  [05/07/2018 11:18AM]: [ 82%] Built target system_autogen
502  [05/07/2018 11:18AM]: [ 83%] Automatic RCC for system.qrc
503  [05/07/2018 11:18AM]: Scanning dependencies of target system
504  [05/07/2018 11:18AM]: [ 84%] Building CXX object plugins/system/CMakeFiles/system.dir/src/configwidget.cpp.o
505  [05/07/2018 11:18AM]: [ 84%] Building CXX object plugins/system/CMakeFiles/system.dir/src/extension.cpp.o
506  [05/07/2018 11:18AM]: [ 85%] Building CXX object plugins/system/CMakeFiles/system.dir/system_autogen/mocs_compilation.cpp.o
507  [05/07/2018 11:18AM]: [ 85%] Building CXX object plugins/system/CMakeFiles/system.dir/system_autogen/EWIEGA46WW/qrc_system.cpp.o
508  [05/07/2018 11:18AM]: [ 86%] Linking CXX shared library ../../lib/libsystem.so
509  [05/07/2018 11:18AM]: Scanning dependencies of target terminal_autogen
510  [05/07/2018 11:18AM]: [ 87%] Automatic MOC and UIC for target terminal
511  [05/07/2018 11:18AM]: [ 87%] Built target terminal_autogen
512  [05/07/2018 11:18AM]: [ 87%] Automatic RCC for terminal.qrc
513  [05/07/2018 11:18AM]: Scanning dependencies of target terminal
514  [05/07/2018 11:18AM]: [ 88%] Building CXX object plugins/terminal/CMakeFiles/terminal.dir/src/configwidget.cpp.o
515  [05/07/2018 11:18AM]: [ 88%] Building CXX object plugins/terminal/CMakeFiles/terminal.dir/src/extension.cpp.o
516  [05/07/2018 11:18AM]: [ 89%] Building CXX object plugins/terminal/CMakeFiles/terminal.dir/terminal_autogen/mocs_compilation.cpp.o
517  [05/07/2018 11:18AM]: [ 89%] Building CXX object plugins/terminal/CMakeFiles/terminal.dir/terminal_autogen/EWIEGA46WW/qrc_terminal.cpp.o
518  [05/07/2018 11:18AM]: [ 90%] Linking CXX shared library ../../lib/libterminal.so
519  [05/07/2018 11:18AM]: [ 90%] Built target terminal
520  [05/07/2018 11:18AM]: Scanning dependencies of target virtualbox_autogen
521  [05/07/2018 11:18AM]: [ 91%] Automatic MOC and UIC for target virtualbox
522  [05/07/2018 11:18AM]: [ 91%] Built target virtualbox_autogen
523  [05/07/2018 11:18AM]: [ 91%] Automatic RCC for virtualbox.qrc
524  [05/07/2018 11:18AM]: Scanning dependencies of target virtualbox
525  [05/07/2018 11:18AM]: [ 92%] Building CXX object plugins/virtualbox/CMakeFiles/virtualbox.dir/src/configwidget.cpp.o
526  [05/07/2018 11:18AM]: [ 92%] Building CXX object plugins/virtualbox/CMakeFiles/virtualbox.dir/src/extension.cpp.o
527  [05/07/2018 11:18AM]: In file included from /usr/lib/virtualbox/sdk/bindings/xpcom/include/string/nsString.h:73,
528  [05/07/2018 11:18AM]:                  from /pkg/src/albert/plugins/virtualbox/src/extension.cpp:36:
529  [05/07/2018 11:18AM]: /usr/lib/virtualbox/sdk/bindings/xpcom/include/string/nsTString.h: In copy constructor nsAdoptingString::nsAdoptingString(const self_type&):
530  [05/07/2018 11:18AM]: /usr/lib/virtualbox/sdk/bindings/xpcom/include/string/string-template-def-unichar.h:56:45: warning: base class class nsXPIDLString should be explicitly initialized in the copy constructor [-Wextra]
531  [05/07/2018 11:18AM]:  #define nsTAdoptingString_CharT             nsAdoptingString
532  [05/07/2018 11:18AM]:                                              ^~~~~~~~~~~~~~~~
533  [05/07/2018 11:18AM]: /usr/lib/virtualbox/sdk/bindings/xpcom/include/string/string-template-def-unichar.h:56:45: note: in definition of macro nsTAdoptingString_CharT
534  [05/07/2018 11:18AM]: In file included from /usr/lib/virtualbox/sdk/bindings/xpcom/include/string/nsString.h:78,
535  [05/07/2018 11:18AM]: /usr/lib/virtualbox/sdk/bindings/xpcom/include/string/nsTString.h: In copy constructor nsAdoptingCString::nsAdoptingCString(const self_type&):
536  [05/07/2018 11:18AM]: /usr/lib/virtualbox/sdk/bindings/xpcom/include/string/string-template-def-char.h:56:45: warning: base class class nsXPIDLCString should be explicitly initialized in the copy constructor [-Wextra]
537  [05/07/2018 11:18AM]:  #define nsTAdoptingString_CharT             nsAdoptingCString
538  [05/07/2018 11:18AM]:                                              ^~~~~~~~~~~~~~~~~
539  [05/07/2018 11:18AM]: /usr/lib/virtualbox/sdk/bindings/xpcom/include/string/string-template-def-char.h:56:45: note: in definition of macro nsTAdoptingString_CharT
540  [05/07/2018 11:18AM]: [ 93%] Building CXX object plugins/virtualbox/CMakeFiles/virtualbox.dir/src/vm.cpp.o
541  [05/07/2018 11:18AM]:                  from /pkg/src/albert/plugins/virtualbox/src/vm.cpp:25:
542  [05/07/2018 11:18AM]: [ 93%] Building CXX object plugins/virtualbox/CMakeFiles/virtualbox.dir/src/vmitem.cpp.o
543  [05/07/2018 11:18AM]: [ 94%] Building CXX object plugins/virtualbox/CMakeFiles/virtualbox.dir/virtualbox_autogen/mocs_compilation.cpp.o
544  [05/07/2018 11:18AM]: [ 95%] Building CXX object plugins/virtualbox/CMakeFiles/virtualbox.dir/virtualbox_autogen/EWIEGA46WW/qrc_virtualbox.cpp.o
545  [05/07/2018 11:18AM]: [ 95%] Linking CXX shared library ../../lib/libvirtualbox.so
546  [05/07/2018 11:18AM]: [ 95%] Built target virtualbox
547  [05/07/2018 11:18AM]: Scanning dependencies of target websearch_autogen
548  [05/07/2018 11:18AM]: [ 96%] Automatic MOC and UIC for target websearch
549  [05/07/2018 11:18AM]: [ 96%] Built target websearch_autogen
550  [05/07/2018 11:18AM]: [ 96%] Automatic RCC for websearch.qrc
551  [05/07/2018 11:18AM]: Scanning dependencies of target websearch
552  [05/07/2018 11:18AM]: [ 97%] Building CXX object plugins/websearch/CMakeFiles/websearch.dir/src/configwidget.cpp.o
553  [05/07/2018 11:18AM]: [ 97%] Building CXX object plugins/websearch/CMakeFiles/websearch.dir/src/enginesmodel.cpp.o
554  [05/07/2018 11:18AM]: /pkg/src/albert/plugins/websearch/src/enginesmodel.cpp: In member function virtual QVariant Websearch::EnginesModel::data(const QModelIndex&, int) const:
555  [05/07/2018 11:18AM]: /pkg/src/albert/plugins/websearch/src/enginesmodel.cpp:109:9: warning: this statement may fall through [-Wimplicit-fallthrough=]
556  [05/07/2018 11:18AM]:          switch (static_cast<Section>(index.column())) {
557  [05/07/2018 11:18AM]: /pkg/src/albert/plugins/websearch/src/enginesmodel.cpp:118:5: note: here
558  [05/07/2018 11:18AM]:      case Qt::DecorationRole: {
559  [05/07/2018 11:18AM]: [ 98%] Building CXX object plugins/websearch/CMakeFiles/websearch.dir/src/extension.cpp.o
560  [05/07/2018 11:19AM]: [ 99%] Building CXX object plugins/websearch/CMakeFiles/websearch.dir/src/searchengineeditor.cpp.o
561  [05/07/2018 11:19AM]: [ 99%] Building CXX object plugins/websearch/CMakeFiles/websearch.dir/websearch_autogen/mocs_compilation.cpp.o
562  [05/07/2018 11:19AM]: [100%] Building CXX object plugins/websearch/CMakeFiles/websearch.dir/websearch_autogen/EWIEGA46WW/qrc_websearch.cpp.o
563  [05/07/2018 11:19AM]: [100%] Linking CXX shared library ../../lib/libwebsearch.so
564  [05/07/2018 11:19AM]: [100%] Built target websearch
565  [05/07/2018 11:19AM]: ==> Entering fakeroot environment...
566  [05/07/2018 11:19AM]: -- Install configuration: RelWithDebInfo
567  [05/07/2018 11:19AM]: -- Installing: /pkg/pkg/albert/usr/share/applications/albert.desktop
568  [05/07/2018 11:19AM]: -- Installing: /pkg/pkg/albert/usr/share/icons/hicolor/scalable/apps/albert.svg
569  [05/07/2018 11:19AM]: -- Installing: /pkg/pkg/albert/usr/bin/albert
570  [05/07/2018 11:19AM]: -- Set runtime path of /pkg/pkg/albert//usr/bin/albert to $ORIGIN/../lib/albert/
571  [05/07/2018 11:19AM]: -- Installing: /pkg/pkg/albert/usr/lib/albert/libalbertcore.so
572  [05/07/2018 11:19AM]: -- Set runtime path of /pkg/pkg/albert//usr/lib/albert/libalbertcore.so to $ORIGIN
573  [05/07/2018 11:19AM]: -- Installing: /pkg/pkg/albert/usr/lib/albert/libxdg.so
574  [05/07/2018 11:19AM]: -- Installing: /pkg/pkg/albert/usr/lib/albert/libglobalshortcut.so
575  [05/07/2018 11:19AM]: -- Installing: /pkg/pkg/albert/usr/lib/albert/plugins/libwidgetboxmodel.so
576  [05/07/2018 11:19AM]: -- Set runtime path of /pkg/pkg/albert//usr/lib/albert/plugins/libwidgetboxmodel.so to $ORIGIN/../
577  [05/07/2018 11:19AM]: -- Installing: /pkg/pkg/albert/usr/share/albert/org.albert.frontend.boxmodel.widgets
578  [05/07/2018 11:19AM]: -- Installing: /pkg/pkg/albert/usr/share/albert/org.albert.frontend.boxmodel.widgets/SpotlightTemplate.qss
579  [05/07/2018 11:19AM]: -- Installing: /pkg/pkg/albert/usr/share/albert/org.albert.frontend.boxmodel.widgets/ArcTemplate.qss
580  [05/07/2018 11:19AM]: -- Installing: /pkg/pkg/albert/usr/share/albert/org.albert.frontend.boxmodel.widgets/SpotlightTemplate.sh
581  [05/07/2018 11:19AM]: -- Installing: /pkg/pkg/albert/usr/share/albert/org.albert.frontend.boxmodel.widgets/ArcTemplate.sh
582  [05/07/2018 11:19AM]: -- Installing: /pkg/pkg/albert/usr/share/albert/org.albert.frontend.boxmodel.widgets/StandardThemeTemplate.qss
583  [05/07/2018 11:19AM]: -- Installing: /pkg/pkg/albert/usr/share/albert/org.albert.frontend.boxmodel.widgets/StandardThemeTemplate.sh
584  [05/07/2018 11:19AM]: -- Installing: /pkg/pkg/albert/usr/share/albert/org.albert.frontend.boxmodel.widgets/themes
585  [05/07/2018 11:19AM]: -- Installing: /pkg/pkg/albert/usr/share/albert/org.albert.frontend.boxmodel.widgets/themes/SolarizedBrightViolet.qss
586  [05/07/2018 11:19AM]: -- Installing: /pkg/pkg/albert/usr/share/albert/org.albert.frontend.boxmodel.widgets/themes/BrightMint.qss
587  [05/07/2018 11:19AM]: -- Installing: /pkg/pkg/albert/usr/share/albert/org.albert.frontend.boxmodel.widgets/themes/Arc Dark Blue.qss
588  [05/07/2018 11:19AM]: -- Installing: /pkg/pkg/albert/usr/share/albert/org.albert.frontend.boxmodel.widgets/themes/Arc Blue.qss
589  [05/07/2018 11:19AM]: -- Installing: /pkg/pkg/albert/usr/share/albert/org.albert.frontend.boxmodel.widgets/themes/SolarizedDarkBlue.qss
590  [05/07/2018 11:19AM]: -- Installing: /pkg/pkg/albert/usr/share/albert/org.albert.frontend.boxmodel.widgets/themes/SolarizedBrightMagenta.qss
591  [05/07/2018 11:19AM]: -- Installing: /pkg/pkg/albert/usr/share/albert/org.albert.frontend.boxmodel.widgets/themes/SolarizedDarkGreen.qss
592  [05/07/2018 11:19AM]: -- Installing: /pkg/pkg/albert/usr/share/albert/org.albert.frontend.boxmodel.widgets/themes/DarkViolet.qss
593  [05/07/2018 11:19AM]: -- Installing: /pkg/pkg/albert/usr/share/albert/org.albert.frontend.boxmodel.widgets/themes/Spotlight Dark.qss
594  [05/07/2018 11:19AM]: -- Installing: /pkg/pkg/albert/usr/share/albert/org.albert.frontend.boxmodel.widgets/themes/SolarizedBrightOrange.qss
595  [05/07/2018 11:19AM]: -- Installing: /pkg/pkg/albert/usr/share/albert/org.albert.frontend.boxmodel.widgets/themes/Bright.qss
596  [05/07/2018 11:19AM]: -- Installing: /pkg/pkg/albert/usr/share/albert/org.albert.frontend.boxmodel.widgets/themes/DarkBlue.qss
597  [05/07/2018 11:19AM]: -- Installing: /pkg/pkg/albert/usr/share/albert/org.albert.frontend.boxmodel.widgets/themes/DarkOrange.qss
598  [05/07/2018 11:19AM]: -- Installing: /pkg/pkg/albert/usr/share/albert/org.albert.frontend.boxmodel.widgets/themes/Dark.qss
599  [05/07/2018 11:19AM]: -- Installing: /pkg/pkg/albert/usr/share/albert/org.albert.frontend.boxmodel.widgets/themes/DarkMagenta.qss
600  [05/07/2018 11:19AM]: -- Installing: /pkg/pkg/albert/usr/share/albert/org.albert.frontend.boxmodel.widgets/themes/Yosemite.qss
601  [05/07/2018 11:19AM]: -- Installing: /pkg/pkg/albert/usr/share/albert/org.albert.frontend.boxmodel.widgets/themes/SolarizedDarkRed.qss
602  [05/07/2018 11:19AM]: -- Installing: /pkg/pkg/albert/usr/share/albert/org.albert.frontend.boxmodel.widgets/themes/BrightOrange.qss
603  [05/07/2018 11:19AM]: -- Installing: /pkg/pkg/albert/usr/share/albert/org.albert.frontend.boxmodel.widgets/themes/SolarizedBrightYellow.qss
604  [05/07/2018 11:19AM]: -- Installing: /pkg/pkg/albert/usr/share/albert/org.albert.frontend.boxmodel.widgets/themes/BrightMagenta.qss
605  [05/07/2018 11:19AM]: -- Installing: /pkg/pkg/albert/usr/share/albert/org.albert.frontend.boxmodel.widgets/themes/SolarizedDarkViolet.qss
606  [05/07/2018 11:19AM]: -- Installing: /pkg/pkg/albert/usr/share/albert/org.albert.frontend.boxmodel.widgets/themes/SolarizedBrightCyan.qss
607  [05/07/2018 11:19AM]: -- Installing: /pkg/pkg/albert/usr/share/albert/org.albert.frontend.boxmodel.widgets/themes/SolarizedDarkCyan.qss
608  [05/07/2018 11:19AM]: -- Installing: /pkg/pkg/albert/usr/share/albert/org.albert.frontend.boxmodel.widgets/themes/SolarizedDarkYellow.qss
609  [05/07/2018 11:19AM]: -- Installing: /pkg/pkg/albert/usr/share/albert/org.albert.frontend.boxmodel.widgets/themes/BrightViolet.qss
610  [05/07/2018 11:19AM]: -- Installing: /pkg/pkg/albert/usr/share/albert/org.albert.frontend.boxmodel.widgets/themes/Numix Rounded.qss
611  [05/07/2018 11:19AM]: -- Installing: /pkg/pkg/albert/usr/share/albert/org.albert.frontend.boxmodel.widgets/themes/DarkMint.qss
612  [05/07/2018 11:19AM]: -- Installing: /pkg/pkg/albert/usr/share/albert/org.albert.frontend.boxmodel.widgets/themes/BrightGreen.qss
613  [05/07/2018 11:19AM]: -- Installing: /pkg/pkg/albert/usr/share/albert/org.albert.frontend.boxmodel.widgets/themes/Arc Grey.qss
614  [05/07/2018 11:19AM]: -- Installing: /pkg/pkg/albert/usr/share/albert/org.albert.frontend.boxmodel.widgets/themes/SolarizedBrightRed.qss
615  [05/07/2018 11:19AM]: -- Installing: /pkg/pkg/albert/usr/share/albert/org.albert.frontend.boxmodel.widgets/themes/DarkGreen.qss
616  [05/07/2018 11:19AM]: -- Installing: /pkg/pkg/albert/usr/share/albert/org.albert.frontend.boxmodel.widgets/themes/Yosemite Dark.qss
617  [05/07/2018 11:19AM]: -- Installing: /pkg/pkg/albert/usr/share/albert/org.albert.frontend.boxmodel.widgets/themes/Elementary.qss
618  [05/07/2018 11:19AM]: -- Installing: /pkg/pkg/albert/usr/share/albert/org.albert.frontend.boxmodel.widgets/themes/SolarizedBrightBlue.qss
619  [05/07/2018 11:19AM]: -- Installing: /pkg/pkg/albert/usr/share/albert/org.albert.frontend.boxmodel.widgets/themes/Adapta.qss
620  [05/07/2018 11:19AM]: -- Installing: /pkg/pkg/albert/usr/share/albert/org.albert.frontend.boxmodel.widgets/themes/SolarizedBrightGreen.qss
621  [05/07/2018 11:19AM]: -- Installing: /pkg/pkg/albert/usr/share/albert/org.albert.frontend.boxmodel.widgets/themes/Spotlight.qss
622  [05/07/2018 11:19AM]: -- Installing: /pkg/pkg/albert/usr/share/albert/org.albert.frontend.boxmodel.widgets/themes/SolarizedDarkMagenta.qss
623  [05/07/2018 11:19AM]: -- Installing: /pkg/pkg/albert/usr/share/albert/org.albert.frontend.boxmodel.widgets/themes/Numix.qss
624  [05/07/2018 11:19AM]: -- Installing: /pkg/pkg/albert/usr/share/albert/org.albert.frontend.boxmodel.widgets/themes/Arc Dark Grey.qss
625  [05/07/2018 11:19AM]: -- Installing: /pkg/pkg/albert/usr/share/albert/org.albert.frontend.boxmodel.widgets/themes/BrightBlue.qss
626  [05/07/2018 11:19AM]: -- Installing: /pkg/pkg/albert/usr/share/albert/org.albert.frontend.boxmodel.widgets/themes/SolarizedDarkOrange.qss
627  [05/07/2018 11:19AM]: -- Installing: /pkg/pkg/albert/usr/lib/albert/plugins/libqmlboxmodel.so
628  [05/07/2018 11:19AM]: -- Set runtime path of /pkg/pkg/albert//usr/lib/albert/plugins/libqmlboxmodel.so to $ORIGIN/../
629  [05/07/2018 11:19AM]: -- Installing: /pkg/pkg/albert/usr/share/albert/org.albert.frontend.boxmodel.qml
630  [05/07/2018 11:19AM]: -- Installing: /pkg/pkg/albert/usr/share/albert/org.albert.frontend.boxmodel.qml/styles
631  [05/07/2018 11:19AM]: -- Installing: /pkg/pkg/albert/usr/share/albert/org.albert.frontend.boxmodel.qml/styles/BoxModel
632  [05/07/2018 11:19AM]: -- Installing: /pkg/pkg/albert/usr/share/albert/org.albert.frontend.boxmodel.qml/styles/BoxModel/fonts
633  [05/07/2018 11:19AM]: -- Installing: /pkg/pkg/albert/usr/share/albert/org.albert.frontend.boxmodel.qml/styles/BoxModel/fonts/Roboto-Thin.ttf
634  [05/07/2018 11:19AM]: -- Installing: /pkg/pkg/albert/usr/share/albert/org.albert.frontend.boxmodel.qml/styles/BoxModel/gear.svg
635  [05/07/2018 11:19AM]: -- Installing: /pkg/pkg/albert/usr/share/albert/org.albert.frontend.boxmodel.qml/styles/BoxModel/MainComponent.qml
636  [05/07/2018 11:19AM]: -- Installing: /pkg/pkg/albert/usr/share/albert/org.albert.frontend.boxmodel.qml/styles/BoxModel/HistoryTextInput.qml
637  [05/07/2018 11:19AM]: -- Installing: /pkg/pkg/albert/usr/share/albert/org.albert.frontend.boxmodel.qml/styles/BoxModel/SettingsButton.qml
638  [05/07/2018 11:19AM]: -- Installing: /pkg/pkg/albert/usr/share/albert/org.albert.frontend.boxmodel.qml/styles/BoxModel/ItemViewDelegate.qml
639  [05/07/2018 11:19AM]: -- Installing: /pkg/pkg/albert/usr/share/albert/org.albert.frontend.boxmodel.qml/styles/BoxModel/themes.js
640  [05/07/2018 11:19AM]: -- Installing: /pkg/pkg/albert/usr/share/albert/org.albert.frontend.boxmodel.qml/styles/BoxModel/DesktopListView.qml
641  [05/07/2018 11:19AM]: -- Installing: /pkg/pkg/albert/usr/share/albert/org.albert.frontend.boxmodel.qml/styles/BoxModel/Preferences.qml
642  [05/07/2018 11:19AM]: -- Installing: /pkg/pkg/albert/usr/share/albert/org.albert.frontend.boxmodel.qml/styles/BoxModel/metadata.json
643  [05/07/2018 11:19AM]: -- Installing: /pkg/pkg/albert/usr/lib/albert/plugins/libapplications.so
644  [05/07/2018 11:19AM]: -- Set runtime path of /pkg/pkg/albert//usr/lib/albert/plugins/libapplications.so to $ORIGIN/../
645  [05/07/2018 11:19AM]: -- Installing: /pkg/pkg/albert/usr/lib/albert/plugins/libcalculator.so
646  [05/07/2018 11:19AM]: -- Set runtime path of /pkg/pkg/albert//usr/lib/albert/plugins/libcalculator.so to $ORIGIN/../
647  [05/07/2018 11:19AM]: -- Installing: /pkg/pkg/albert/usr/lib/albert/plugins/libchromebookmarks.so
648  [05/07/2018 11:19AM]: -- Set runtime path of /pkg/pkg/albert//usr/lib/albert/plugins/libchromebookmarks.so to $ORIGIN/../
649  [05/07/2018 11:19AM]: -- Installing: /pkg/pkg/albert/usr/lib/albert/plugins/libexternalextensions.so
650  [05/07/2018 11:19AM]: -- Set runtime path of /pkg/pkg/albert//usr/lib/albert/plugins/libexternalextensions.so to $ORIGIN/../
651  [05/07/2018 11:19AM]: -- Installing: /pkg/pkg/albert/usr/lib/albert/plugins/libfiles.so
652  [05/07/2018 11:19AM]: -- Set runtime path of /pkg/pkg/albert//usr/lib/albert/plugins/libfiles.so to $ORIGIN/../
653  [05/07/2018 11:19AM]: -- Installing: /pkg/pkg/albert/usr/lib/albert/plugins/libfirefoxbookmarks.so
654  [05/07/2018 11:19AM]: -- Set runtime path of /pkg/pkg/albert//usr/lib/albert/plugins/libfirefoxbookmarks.so to $ORIGIN/../
655  [05/07/2018 11:19AM]: -- Installing: /pkg/pkg/albert/usr/lib/albert/plugins/libhashgenerator.so
656  [05/07/2018 11:19AM]: -- Set runtime path of /pkg/pkg/albert//usr/lib/albert/plugins/libhashgenerator.so to $ORIGIN/../
657  [05/07/2018 11:19AM]: -- Installing: /pkg/pkg/albert/usr/lib/albert/plugins/libmpris.so
658  [05/07/2018 11:19AM]: -- Set runtime path of /pkg/pkg/albert//usr/lib/albert/plugins/libmpris.so to $ORIGIN/../
659  [05/07/2018 11:19AM]: -- Installing: /pkg/pkg/albert/usr/lib/albert/plugins/libpython.so
660  [05/07/2018 11:19AM]: -- Set runtime path of /pkg/pkg/albert//usr/lib/albert/plugins/libpython.so to $ORIGIN/../
661  [05/07/2018 11:19AM]: -- Installing: /pkg/pkg/albert/usr/share/albert/org.albert.extension.python
662  [05/07/2018 11:19AM]: -- Installing: /pkg/pkg/albert/usr/share/albert/org.albert.extension.python/modules
663  [05/07/2018 11:19AM]: -- Installing: /pkg/pkg/albert/usr/share/albert/org.albert.extension.python/modules/MultiGoogleTranslate.py
664  [05/07/2018 11:19AM]: -- Installing: /pkg/pkg/albert/usr/share/albert/org.albert.extension.python/modules/Python
665  [05/07/2018 11:19AM]: -- Installing: /pkg/pkg/albert/usr/share/albert/org.albert.extension.python/modules/Python/__init__.py
666  [05/07/2018 11:19AM]: -- Installing: /pkg/pkg/albert/usr/share/albert/org.albert.extension.python/modules/Python/python.svg
667  [05/07/2018 11:19AM]: -- Installing: /pkg/pkg/albert/usr/share/albert/org.albert.extension.python/modules/CopyQ.py
668  [05/07/2018 11:19AM]: -- Installing: /pkg/pkg/albert/usr/share/albert/org.albert.extension.python/modules/AUR
669  [05/07/2018 11:19AM]: -- Installing: /pkg/pkg/albert/usr/share/albert/org.albert.extension.python/modules/AUR/arch.svg
670  [05/07/2018 11:19AM]: -- Installing: /pkg/pkg/albert/usr/share/albert/org.albert.extension.python/modules/AUR/__init__.py
671  [05/07/2018 11:19AM]: -- Installing: /pkg/pkg/albert/usr/share/albert/org.albert.extension.python/modules/Timer
672  [05/07/2018 11:19AM]: -- Installing: /pkg/pkg/albert/usr/share/albert/org.albert.extension.python/modules/Timer/__init__.py
673  [05/07/2018 11:19AM]: -- Installing: /pkg/pkg/albert/usr/share/albert/org.albert.extension.python/modules/Timer/bing.wav
674  [05/07/2018 11:19AM]: -- Installing: /pkg/pkg/albert/usr/share/albert/org.albert.extension.python/modules/Timer/time.svg
675  [05/07/2018 11:19AM]: -- Installing: /pkg/pkg/albert/usr/share/albert/org.albert.extension.python/modules/.git
676  [05/07/2018 11:19AM]: -- Installing: /pkg/pkg/albert/usr/share/albert/org.albert.extension.python/modules/Scrot.py
677  [05/07/2018 11:19AM]: -- Installing: /pkg/pkg/albert/usr/share/albert/org.albert.extension.python/modules/Pomodoro
678  [05/07/2018 11:19AM]: -- Installing: /pkg/pkg/albert/usr/share/albert/org.albert.extension.python/modules/Pomodoro/__init__.py
679  [05/07/2018 11:19AM]: -- Installing: /pkg/pkg/albert/usr/share/albert/org.albert.extension.python/modules/Pomodoro/bing.wav
680  [05/07/2018 11:19AM]: -- Installing: /pkg/pkg/albert/usr/share/albert/org.albert.extension.python/modules/Pomodoro/pomodoro.svg
681  [05/07/2018 11:19AM]: -- Installing: /pkg/pkg/albert/usr/share/albert/org.albert.extension.python/modules/GoogleTranslate.py
682  [05/07/2018 11:19AM]: -- Installing: /pkg/pkg/albert/usr/share/albert/org.albert.extension.python/modules/dangoemoji
683  [05/07/2018 11:19AM]: -- Installing: /pkg/pkg/albert/usr/share/albert/org.albert.extension.python/modules/dangoemoji/__init__.py
684  [05/07/2018 11:19AM]: -- Installing: /pkg/pkg/albert/usr/share/albert/org.albert.extension.python/modules/dangoemoji/dangoemoji.png
685  [05/07/2018 11:19AM]: -- Installing: /pkg/pkg/albert/usr/share/albert/org.albert.extension.python/modules/Wikipedia
686  [05/07/2018 11:19AM]: -- Installing: /pkg/pkg/albert/usr/share/albert/org.albert.extension.python/modules/Wikipedia/__init__.py
687  [05/07/2018 11:19AM]: -- Installing: /pkg/pkg/albert/usr/share/albert/org.albert.extension.python/modules/Wikipedia/wikipedia.svg
688  [05/07/2018 11:19AM]: -- Installing: /pkg/pkg/albert/usr/share/albert/org.albert.extension.python/modules/GnomeDictionary.py
689  [05/07/2018 11:19AM]: -- Installing: /pkg/pkg/albert/usr/share/albert/org.albert.extension.python/modules/mathematica_eval.py
690  [05/07/2018 11:19AM]: -- Installing: /pkg/pkg/albert/usr/share/albert/org.albert.extension.python/modules/.gitignore
691  [05/07/2018 11:19AM]: -- Installing: /pkg/pkg/albert/usr/share/albert/org.albert.extension.python/modules/Gnote.py
692  [05/07/2018 11:19AM]: -- Installing: /pkg/pkg/albert/usr/share/albert/org.albert.extension.python/modules/Pass.py
693  [05/07/2018 11:19AM]: -- Installing: /pkg/pkg/albert/usr/share/albert/org.albert.extension.python/modules/README.md
694  [05/07/2018 11:19AM]: -- Installing: /pkg/pkg/albert/usr/share/albert/org.albert.extension.python/modules/Epoch.py
695  [05/07/2018 11:19AM]: -- Installing: /pkg/pkg/albert/usr/share/albert/org.albert.extension.python/modules/Pacman.py
696  [05/07/2018 11:19AM]: -- Installing: /pkg/pkg/albert/usr/share/albert/org.albert.extension.python/modules/ArchWiki
697  [05/07/2018 11:19AM]: -- Installing: /pkg/pkg/albert/usr/share/albert/org.albert.extension.python/modules/ArchWiki/ArchWiki.svg
698  [05/07/2018 11:19AM]: -- Installing: /pkg/pkg/albert/usr/share/albert/org.albert.extension.python/modules/ArchWiki/__init__.py
699  [05/07/2018 11:19AM]: -- Installing: /pkg/pkg/albert/usr/share/albert/org.albert.extension.python/modules/Binance
700  [05/07/2018 11:19AM]: -- Installing: /pkg/pkg/albert/usr/share/albert/org.albert.extension.python/modules/Binance/__init__.py
701  [05/07/2018 11:19AM]: -- Installing: /pkg/pkg/albert/usr/share/albert/org.albert.extension.python/modules/Binance/Binance.svg
702  [05/07/2018 11:19AM]: -- Installing: /pkg/pkg/albert/usr/share/albert/org.albert.extension.python/modules/CoinMarketCap
703  [05/07/2018 11:19AM]: -- Installing: /pkg/pkg/albert/usr/share/albert/org.albert.extension.python/modules/CoinMarketCap/__init__.py
704  [05/07/2018 11:19AM]: -- Installing: /pkg/pkg/albert/usr/share/albert/org.albert.extension.python/modules/CoinMarketCap/emblem-money.svg
705  [05/07/2018 11:19AM]: -- Installing: /pkg/pkg/albert/usr/share/albert/org.albert.extension.python/modules/Tomboy.py
706  [05/07/2018 11:19AM]: -- Installing: /pkg/pkg/albert/usr/share/albert/org.albert.extension.python/modules/Packagist
707  [05/07/2018 11:19AM]: -- Installing: /pkg/pkg/albert/usr/share/albert/org.albert.extension.python/modules/Packagist/__init__.py
708  [05/07/2018 11:19AM]: -- Installing: /pkg/pkg/albert/usr/share/albert/org.albert.extension.python/modules/Packagist/logo.png
709  [05/07/2018 11:19AM]: -- Installing: /pkg/pkg/albert/usr/share/albert/org.albert.extension.python/modules/Currency.py
710  [05/07/2018 11:19AM]: -- Installing: /pkg/pkg/albert/usr/share/albert/org.albert.extension.python/modules/dangokao
711  [05/07/2018 11:19AM]: -- Installing: /pkg/pkg/albert/usr/share/albert/org.albert.extension.python/modules/dangokao/__init__.py
712  [05/07/2018 11:19AM]: -- Installing: /pkg/pkg/albert/usr/share/albert/org.albert.extension.python/modules/dangokao/kaoicon.svg
713  [05/07/2018 11:19AM]: -- Installing: /pkg/pkg/albert/usr/share/albert/org.albert.extension.python/modules/ApiTest
714  [05/07/2018 11:19AM]: -- Installing: /pkg/pkg/albert/usr/share/albert/org.albert.extension.python/modules/ApiTest/__init__.py
715  [05/07/2018 11:19AM]: -- Installing: /pkg/pkg/albert/usr/share/albert/org.albert.extension.python/modules/ApiTest/plugin.svg
716  [05/07/2018 11:19AM]: -- Installing: /pkg/pkg/albert/usr/share/albert/org.albert.extension.python/modules/BaseConverter.py
717  [05/07/2018 11:19AM]: -- Installing: /pkg/pkg/albert/usr/share/albert/org.albert.extension.python/modules/tex_to_unicode.py
718  [05/07/2018 11:19AM]: -- Installing: /pkg/pkg/albert/usr/share/albert/org.albert.extension.python/modules/Ip.py
719  [05/07/2018 11:19AM]: -- Installing: /pkg/pkg/albert/usr/share/albert/org.albert.extension.python/modules/Npm
720  [05/07/2018 11:19AM]: -- Installing: /pkg/pkg/albert/usr/share/albert/org.albert.extension.python/modules/Npm/__init__.py
721  [05/07/2018 11:19AM]: -- Installing: /pkg/pkg/albert/usr/share/albert/org.albert.extension.python/modules/Npm/logo.svg
722  [05/07/2018 11:19AM]: -- Installing: /pkg/pkg/albert/usr/share/albert/org.albert.extension.python/modules/Trash.py
723  [05/07/2018 11:19AM]: -- Installing: /pkg/pkg/albert/usr/share/albert/org.albert.extension.python/modules/GoldenDict.py
724  [05/07/2018 11:19AM]: -- Installing: /pkg/pkg/albert/usr/share/albert/org.albert.extension.python/modules/Units.py
725  [05/07/2018 11:19AM]: -- Installing: /pkg/pkg/albert/usr/share/albert/org.albert.extension.python/modules/Kill.py
726  [05/07/2018 11:19AM]: -- Installing: /pkg/pkg/albert/usr/share/albert/org.albert.extension.python/modules/Locate.py
727  [05/07/2018 11:19AM]: -- Installing: /pkg/pkg/albert/usr/share/albert/org.albert.extension.python/modules/Zeal.py
728  [05/07/2018 11:19AM]: -- Installing: /pkg/pkg/albert/usr/lib/albert/plugins/libsnippets.so
729  [05/07/2018 11:19AM]: -- Set runtime path of /pkg/pkg/albert//usr/lib/albert/plugins/libsnippets.so to $ORIGIN/../
730  [05/07/2018 11:19AM]: -- Installing: /pkg/pkg/albert/usr/lib/albert/plugins/libssh.so
731  [05/07/2018 11:19AM]: -- Set runtime path of /pkg/pkg/albert//usr/lib/albert/plugins/libssh.so to $ORIGIN/../
732  [05/07/2018 11:19AM]: -- Installing: /pkg/pkg/albert/usr/lib/albert/plugins/libsystem.so
733  [05/07/2018 11:19AM]: -- Set runtime path of /pkg/pkg/albert//usr/lib/albert/plugins/libsystem.so to $ORIGIN/../
734  [05/07/2018 11:19AM]: -- Installing: /pkg/pkg/albert/usr/lib/albert/plugins/libterminal.so
735  [05/07/2018 11:19AM]: -- Set runtime path of /pkg/pkg/albert//usr/lib/albert/plugins/libterminal.so to $ORIGIN/../
736  [05/07/2018 11:19AM]: -- Installing: /pkg/pkg/albert/usr/lib/albert/plugins/libvirtualbox.so
737  [05/07/2018 11:19AM]: -- Set runtime path of /pkg/pkg/albert//usr/lib/albert/plugins/libvirtualbox.so to /usr/lib/virtualbox
738  [05/07/2018 11:19AM]: -- Installing: /pkg/pkg/albert/usr/lib/albert/plugins/libwebsearch.so
739  [05/07/2018 11:19AM]: -- Set runtime path of /pkg/pkg/albert//usr/lib/albert/plugins/libwebsearch.so to $ORIGIN/../
740  [05/07/2018 11:19AM]:   -> Removing libtool files...
741  [05/07/2018 11:19AM]:   -> Removing static library files...
742  [05/07/2018 11:19AM]:   -> Stripping unneeded symbols from binaries and libraries...
743  [05/07/2018 11:19AM]:   -> Compressing man and info pages...
744  [05/07/2018 11:19AM]: ==> Checking for packaging issue...
745  [05/07/2018 11:19AM]: ==> Creating package albert...
746  [05/07/2018 11:19AM]:   -> Generating .PKGINFO file...
747  [05/07/2018 11:19AM]:   -> Generating .BUILDINFO file...
748  [05/07/2018 11:19AM]:   -> Generating .MTREE file...
749  [05/07/2018 11:19AM]: ==> Leaving fakeroot environment.
750  [05/07/2018 11:19AM]: ==> Finished making: albert 0.14.18-1 (Mon May  7 16:19:16 UTC 2018)
751  [05/07/2018 11:19AM]: [\^/\^/^\^/^\^/\^/\^/^\^/^\^/]  Getting packages that would be generated by PKGBUILD...  [\^/\^/^\^/^\^/\^/\^/^\^/^\^/]
752  [05/07/2018 11:19AM]: [\^/\^/^\^/^\^/\^/\^/^\^/^\^/]  albert-0.14.18-1-i686
753  [05/07/2018 11:19AM]: albert-0.14.18-1-armv7h  [\^/\^/^\^/^\^/\^/\^/^\^/^\^/]
754  [05/07/2018 11:19AM]: [\^/\^/^\^/^\^/\^/\^/^\^/^\^/]  CREATING 32-BIT BUILD ENVIRONMENT  [\^/\^/^\^/^\^/\^/\^/^\^/^\^/]
755  [05/07/2018 11:19AM]: cp: cannot stat /usr/share/devtools/makepkg-i686.conf: No such file or directory
756  [05/07/2018 11:19AM]: sed: cant read /32bit/makepkg.conf: No such file or directory
757  [05/07/2018 11:19AM]: ==> Creating install root at /32build/root
758  [05/07/2018 11:19AM]: ==> Installing packages to /32build/root
759  [05/07/2018 11:19AM]: error: failed retrieving file core.db from arch.mirror.square-r00t.net : The requested URL returned error: 404
760  [05/07/2018 11:19AM]: error: failed retrieving file core.db from mirror.csclub.uwaterloo.ca : The requested URL returned error: 404
761  [05/07/2018 11:19AM]: error: failed retrieving file core.db from arch.mirror.square-r00t.net : Protocol rsync not supported or disabled in libcurl
762  [05/07/2018 11:19AM]: error: failed to update core (download library error)
763  [05/07/2018 11:19AM]: error: failed retrieving file extra.db from arch.mirror.square-r00t.net : The requested URL returned error: 404
764  [05/07/2018 11:19AM]: error: failed retrieving file extra.db from mirror.csclub.uwaterloo.ca : The requested URL returned error: 404
765  [05/07/2018 11:19AM]: error: failed retrieving file extra.db from arch.mirror.square-r00t.net : Protocol rsync not supported or disabled in libcurl
766  [05/07/2018 11:19AM]: error: failed to update extra (download library error)
767  [05/07/2018 11:19AM]: error: failed retrieving file community.db from arch.mirror.square-r00t.net : The requested URL returned error: 404
768  [05/07/2018 11:19AM]: error: failed retrieving file community.db from mirror.csclub.uwaterloo.ca : The requested URL returned error: 404
769  [05/07/2018 11:19AM]: error: failed retrieving file community.db from arch.mirror.square-r00t.net : Protocol rsync not supported or disabled in libcurl
770  [05/07/2018 11:19AM]: error: failed to update community (download library error)
771  [05/07/2018 11:19AM]: error: target not found: base-devel
772  [05/07/2018 11:19AM]: error: target not found: wget
773  [05/07/2018 11:19AM]: error: target not found: sudo
774  [05/07/2018 11:19AM]: error: target not found: git
775  [05/07/2018 11:19AM]: error: target not found: reflector
776  [05/07/2018 11:19AM]: ==> ERROR: Failed to install packages to new root
777  [05/07/2018 11:19AM]: ==> ERROR: Failed to install all packages
778  [05/07/2018 11:19AM]: cp: cannot create regular file /32build/root/etc/sudoers.d/: Not a directory
779  [05/07/2018 11:19AM]: chmod: cannot access /32build/root/etc/sudoers.d: No such file or directory
780  [05/07/2018 11:19AM]: chmod: cannot access /32build/root/usr/lib/sudo: No such file or directory
781  [05/07/2018 11:19AM]: chmod: cannot access /32build/root/usr/lib/sudo/*.so: No such file or directory
782  [05/07/2018 11:19AM]: chroot: failed to run command reflector: No such file or directory
783  [05/07/2018 11:19AM]: chroot: failed to run command pacman: No such file or directory
784  [05/07/2018 11:19AM]: [\^/\^/^\^/^\^/\^/\^/^\^/^\^/]  UPDATING 32BIT SOURCE CHECKSUMS  [\^/\^/^\^/^\^/\^/\^/^\^/^\^/]
785  [05/07/2018 11:19AM]: chroot: failed to run command /usr/bin/bash: No such file or directory
786  [05/07/2018 11:19AM]: [\^/\^/^\^/^\^/\^/\^/^\^/^\^/]  BUILD FAILED  [\^/\^/^\^/^\^/\^/\^/^\^/^\^/]