Build Record

Build Number: 8267

Transaction: 4229
Package: python-efl
Version: 1.20.0-1
Start: 08/08/2018 04:01AM
Finish: 08/08/2018 04:02AM
Result: failed
 python-efl/PKGBUILD CHANGED

Build Log

  1 [08/08/2018 04:01AM]: [\^/\^/^\^/^\^/\^/\^/^\^/^\^/]  SETTING UP ENVIRONMENT  [\^/\^/^\^/^\^/\^/\^/^\^/^\^/]
  2  [08/08/2018 04:01AM]: [\^/\^/^\^/^\^/\^/\^/^\^/^\^/]  ADDING UPSTREAM PGP KEYS TO KEYRING  [\^/\^/^\^/^\^/\^/\^/^\^/^\^/]
  3  [08/08/2018 04:01AM]: gpg: WARNING: unsafe ownership on homedir /tmp/antbs/.gnupg
  4  [08/08/2018 04:01AM]: gpg: keybox /tmp/antbs/.gnupg/pubring.kbx created
  5  [08/08/2018 04:01AM]: gpg: key 23EFEFE93C4CFFFE: 1 signature not checked due to a missing key
  6  [08/08/2018 04:01AM]: gpg: /tmp/antbs/.gnupg/trustdb.gpg: trustdb created
  7  [08/08/2018 04:01AM]: gpg: key 23EFEFE93C4CFFFE: public key Italo A. Casas <[email protected]> imported
  8  [08/08/2018 04:01AM]: gpg: key B63B535A4C206CA9: 9 signatures not checked due to missing keys
  9  [08/08/2018 04:01AM]: gpg: key B63B535A4C206CA9: public key Evan Lucas <[email protected]> imported
 10  [08/08/2018 04:01AM]: gpg: key E73BC641CC11F4C8: 14 signatures not checked due to missing keys
 11  [08/08/2018 04:01AM]: gpg: bad data signature from key DEA16371974031A5: Wrong key usage (0x19, 0x2)
 12  [08/08/2018 04:01AM]: gpg: key E73BC641CC11F4C8: public key Myles Borins <[email protected]> imported
 13  [08/08/2018 04:01AM]: gpg: key C273792F7D83545D: 4 signatures not checked due to missing keys
 14  [08/08/2018 04:01AM]: gpg: key C273792F7D83545D: public key Rod Vagg <[email protected]> imported
 15  [08/08/2018 04:01AM]: gpg: key C97EC7A07EDE3FC1: 19 signatures not checked due to missing keys
 16  [08/08/2018 04:01AM]: gpg: bad data signature from key 8975BA8B6100C6B1: Wrong key usage (0x19, 0x2)
 17  [08/08/2018 04:01AM]: gpg: key C97EC7A07EDE3FC1: public key keybase.io/jasnell <[email protected]> imported
 18  [08/08/2018 04:01AM]: gpg: key 09FE44734EB7990E: 2 signatures not checked due to missing keys
 19  [08/08/2018 04:01AM]: gpg: key 09FE44734EB7990E: public key Jeremiah Senkpiel <[email protected]> imported
 20  [08/08/2018 04:01AM]: gpg: key 7434390BDBE9B9C5: public key Colin Ihrig <[email protected]> imported
 21  [08/08/2018 04:01AM]: gpg: key 61B7B526D98F0353: 26 signatures not checked due to missing keys
 22  [08/08/2018 04:01AM]: gpg: key 61B7B526D98F0353: public key Mozilla Software Releases <[email protected]> imported
 23  [08/08/2018 04:01AM]: gpg: key 61B7B526D98F0353: Mozilla Software Releases <[email protected]> not changed
 24  [08/08/2018 04:01AM]: gpg: no ultimately trusted keys found
 25  [08/08/2018 04:01AM]: gpg: Total number processed: 9
 26  [08/08/2018 04:01AM]: gpg:               imported: 8
 27  [08/08/2018 04:01AM]: gpg:              unchanged: 1
 28  [08/08/2018 04:01AM]: [\^/\^/^\^/^\^/\^/\^/^\^/^\^/]  SYNCING REPO DATABASES  [\^/\^/^\^/^\^/\^/\^/^\^/^\^/]
 29  [08/08/2018 04:01AM]: :: Synchronizing package databases...
 30  [08/08/2018 04:01AM]: downloading antergos-staging.db...
 31  [08/08/2018 04:01AM]: downloading antergos.db...
 32  [08/08/2018 04:01AM]: downloading core.db...
 33  [08/08/2018 04:01AM]: downloading community.db...
 34  [08/08/2018 04:01AM]: :: Starting full system upgrade...
 35  [08/08/2018 04:01AM]: [\^/\^/^\^/^\^/\^/\^/^\^/^\^/]  TRYING BUILD  [\^/\^/^\^/^\^/\^/\^/^\^/^\^/]
 36  [08/08/2018 04:01AM]: [\^/\^/^\^/^\^/\^/\^/^\^/^\^/]  UPDATING SOURCE CHECKSUMS  [\^/\^/^\^/^\^/\^/\^/^\^/^\^/]
 37  [08/08/2018 04:01AM]: Copyright (c) 2006-2018 Pacman Development Team <[email protected]>.
 38  [08/08/2018 04:01AM]: Copyright (C) 2002-2006 Judd Vinet <[email protected]>.
 39  [08/08/2018 04:01AM]: This is free software; see the source for copying conditions.
 40  [08/08/2018 04:01AM]: There is NO WARRANTY, to the extent permitted by law.
 41  [08/08/2018 04:01AM]:   -> Downloading python-efl-1.20.0.tar.xz...
 42  [08/08/2018 04:01AM]:   % Total    % Received % Xferd  Average Speed   Time    Time     Time  Current
 43  [08/08/2018 04:01AM]:                                  Dload  Upload   Total   Spent    Left  Speed
 44  [08/08/2018 04:01AM]: 
 45   0     0    0     0    0     0      0      0 --:--:-- --:--:-- --:--:--     0
 46   0     0    0     0    0     0      0      0 --:--:-- --:--:-- --:--:--     0
 47   0     0    0     0    0     0      0      0 --:--:-- --:--:-- --:--:--     0
 48  [08/08/2018 04:01AM]: 
 49   1 8773k    1 97694    0     0  75849      0  0:01:58  0:00:01  0:01:57 75849
 50  83 8773k   83 7352k    0     0  3127k      0  0:00:02  0:00:02 --:--:-- 6826k
 51 100 8773k  100 8773k    0     0  3572k      0  0:00:02  0:00:02 --:--:-- 7430k
 52  [08/08/2018 04:01AM]: ==> Generating checksums for source files...
 53  [08/08/2018 04:01AM]: ==> Making package: python-efl 1.20.0-1 (Wed Aug  8 09:01:50 2018)
 54  [08/08/2018 04:01AM]: ==> Checking runtime dependencies...
 55  [08/08/2018 04:01AM]: ==> Installing missing dependencies...
 56  [08/08/2018 04:01AM]: looking for conflicting packages...
 57  [08/08/2018 04:01AM]: warning: dependency cycle detected:
 58  [08/08/2018 04:01AM]: warning: libglvnd will be installed before its mesa dependency
 59  [08/08/2018 04:01AM]: warning: harfbuzz will be installed before its freetype2 dependency
 60  [08/08/2018 04:01AM]: Packages (99) alsa-lib-1.1.6-1  avahi-0.7+16+g1cc2b8e-2  bullet-2.87-2  cairo-1.15.12-1  cdparanoia-10.2-7  flac-1.3.2-1  fontconfig-2.13.0+10+g58f5285-1  freetype2-2.9.1-1  fribidi-1.0.5-1  gdk-pixbuf2-2.36.12-1  ghostscript-9.23-1  giflib-5.1.4-1  graphene-1.8.2-1  graphite-1:1.3.11-1  gst-plugins-base-1.14.2-1  gst-plugins-base-libs-1.14.2-1  gstreamer-1.14.2-1  harfbuzz-1.8.5-1  icu-61.1-1  ijs-0.35-1  iso-codes-3.76-1  jasper-2.0.14-1  jbig2dec-0.14-1  lcms2-2.9-1  libasyncns-0.8+3+g68cd5af-1  libcroco-0.6.12+4+g9ad7287-1  libcups-2.2.8-3  libdaemon-0.14-4  libdatrie-0.2.12-1  libdrm-2.4.92-1  libevdev-1.5.9-1  libglvnd-1.0.0-1  libgudev-232-1  libice-1.0.9-2  libinput-1.11.2-1  libjpeg-turbo-1.5.3-1  libogg-1.3.3-3  libomxil-bellagio-0.9.3-2  libpaper-1.1.24-10  libpciaccess-0.14-1  libpng-1.6.34-2  libpulse-12.2-2  libraw-0.18.13-1  librsvg-2:2.42.6-1  libsm-1.2.2-3  libsndfile-1.0.28-1  libspectre-0.2.8-1  libthai-0.1.27-1  libtheora-1.1.1-4  libtiff-4.0.9-2  libunwind-1.2.1-1  libvisual-0.4.0-7  libvorbis-1.3.6-1  libwacom-0.30-1  libwebp-1.0.0-1  libx11-1.6.5-1  libxau-1.0.8-3  libxcb-1.13-1  libxcomposite-0.4.4-3  libxcursor-1.1.15-1  libxdamage-1.1.4-3  libxdmcp-1.1.2-2  libxext-1.3.3-2  libxfixes-5.0.3-2  libxft-2.3.2-2  libxi-1.7.9-1  libxinerama-1.1.4-1  libxkbcommon-0.8.2-1  libxml2-2.9.8-3  libxp-1.0.3-2  libxrandr-1.5.1-2  libxrender-0.9.10-1  libxshmfence-1.3-1  libxss-1.2.2-3  libxt-1.1.5-2  libxtst-1.2.3-1  libxv-1.0.11-1  libxxf86vm-1.1.4-2  llvm-libs-6.0.1-2  lm_sensors-3.4.0-4  luajit-2.0.5-1  mesa-18.1.5-1  mtdev-1.1.5-2  openjpeg-1.5.2-2  openjpeg2-2.3.0-2  opus-1.2.1-1  orc-0.4.28-1  pango-1.42.3-1  pixman-0.34.0-1  python-dbus-common-1.2.8-2  run-parts-4.8.6-1  shared-mime-info-1.9-1  wayland-1.15.0-1  wayland-protocols-1.15-1  xcb-proto-1.13-2  xkeyboard-config-2.24-1  xorgproto-2018.4-1  efl-1.20.7-1  python-dbus-1.2.8-2
 61  [08/08/2018 04:01AM]: Total Download Size:     7.61 MiB
 62  [08/08/2018 04:01AM]: Total Installed Size:  531.86 MiB
 63  [08/08/2018 04:01AM]: :: Proceed with installation? [Y/n]
 64  [08/08/2018 04:01AM]: downloading gst-plugins-base-libs-1.14.2-1-x86_64.pkg.tar.xz...
 65  [08/08/2018 04:01AM]: downloading libxinerama-1.1.4-1-x86_64.pkg.tar.xz...
 66  [08/08/2018 04:01AM]: downloading libxkbcommon-0.8.2-1-x86_64.pkg.tar.xz...
 67  [08/08/2018 04:01AM]: downloading openjpeg-1.5.2-2-x86_64.pkg.tar.xz...
 68  [08/08/2018 04:01AM]: downloading libxt-1.1.5-2-x86_64.pkg.tar.xz...
 69  [08/08/2018 04:01AM]: downloading libraw-0.18.13-1-x86_64.pkg.tar.xz...
 70  [08/08/2018 04:01AM]: downloading wayland-protocols-1.15-1-any.pkg.tar.xz...
 71  [08/08/2018 04:01AM]: downloading python-dbus-common-1.2.8-2-x86_64.pkg.tar.xz...
 72  [08/08/2018 04:01AM]: checking package integrity...
 73  [08/08/2018 04:02AM]: checking for file conflicts...
 74  [08/08/2018 04:02AM]: :: Processing package changes...
 75  [08/08/2018 04:02AM]: Optional dependencies for bullet
 76  [08/08/2018 04:02AM]:     glu: for the example browser
 77  [08/08/2018 04:02AM]:     python: python bindings [installed]
 78  [08/08/2018 04:02AM]:     python-numpy: python bindings
 79  [08/08/2018 04:02AM]:     bullet-docs: documentation
 80  [08/08/2018 04:02AM]: installing libomxil-bellagio...
 81  [08/08/2018 04:02AM]: Optional dependencies for lm_sensors
 82  [08/08/2018 04:02AM]:     rrdtool: for logging with sensord
 83  [08/08/2018 04:02AM]: Optional dependencies for mesa
 84  [08/08/2018 04:02AM]:     opengl-man-pages: for the OpenGL API man pages
 85  [08/08/2018 04:02AM]:     mesa-vdpau: for accelerated video playback
 86  [08/08/2018 04:02AM]:     libva-mesa-driver: for accelerated video playback
 87  [08/08/2018 04:02AM]: installing gst-plugins-base-libs...
 88  [08/08/2018 04:02AM]: Optional dependencies for alsa-lib
 89  [08/08/2018 04:02AM]:     python2: for python smixer plugin [installed]
 90  [08/08/2018 04:02AM]: Optional dependencies for harfbuzz
 91  [08/08/2018 04:02AM]:     cairo: hb-view program [pending]
 92  [08/08/2018 04:02AM]: warning: directory permissions differ on /var/
 93  [08/08/2018 04:02AM]: filesystem: 777  package: 755
 94  [08/08/2018 04:02AM]:   Fontconfig configuration is done via /etc/fonts/conf.avail and conf.d.
 95  [08/08/2018 04:02AM]:   Read /etc/fonts/conf.d/README for more information.
 96  [08/08/2018 04:02AM]:   Configuration via /etc/fonts/local.conf is still possible,
 97  [08/08/2018 04:02AM]:   but is no longer recommended for options available in conf.avail.
 98  [08/08/2018 04:02AM]:   Main systemwide configuration should be done by symlinks
 99  [08/08/2018 04:02AM]:   (especially for autohinting, sub-pixel and lcdfilter):
100  [08/08/2018 04:02AM]:   ln -s ../conf.avail/XX-foo.conf
101  [08/08/2018 04:02AM]:   Check also https://wiki.archlinux.org/index.php/Font_Configuration
102  [08/08/2018 04:02AM]:   and https://wiki.archlinux.org/index.php/Fonts.
103  [08/08/2018 04:02AM]: Rebuilding fontconfig cache... done.
104  [08/08/2018 04:02AM]: installing gst-plugins-base...
105  [08/08/2018 04:02AM]: Optional dependencies for libinput
106  [08/08/2018 04:02AM]:     gtk3: libinput debug-gui
107  [08/08/2018 04:02AM]:     python-pyudev: libinput measure
108  [08/08/2018 04:02AM]:     python-evdev: libinput measure
109  [08/08/2018 04:02AM]: Optional dependencies for libxcursor
110  [08/08/2018 04:02AM]:     gnome-themes-standard: fallback icon theme
111  [08/08/2018 04:02AM]: Optional dependencies for libtiff
112  [08/08/2018 04:02AM]:     freeglut: for using tiffgt
113  [08/08/2018 04:02AM]: Optional dependencies for libwebp
114  [08/08/2018 04:02AM]:     freeglut: vwebp viewer
115  [08/08/2018 04:02AM]: installing shared-mime-info...
116  [08/08/2018 04:02AM]: installing xkeyboard-config...
117  [08/08/2018 04:02AM]: Optional dependencies for openjpeg
118  [08/08/2018 04:02AM]:     lcms2: j2k_to_image and image_to_j2k programs [pending]
119  [08/08/2018 04:02AM]:     libpng: j2k_to_image and image_to_j2k programs [installed]
120  [08/08/2018 04:02AM]: Optional dependencies for avahi
121  [08/08/2018 04:02AM]:     gtk3: avahi-discover, avahi-discover-standalone, bshell, bssh, bvnc
122  [08/08/2018 04:02AM]:     qt5-base: qt5 bindings
123  [08/08/2018 04:02AM]:     python2-twisted: avahi-bookmarks
124  [08/08/2018 04:02AM]:     nss-mdns: NSS support for mDNS
125  [08/08/2018 04:02AM]:     python-gobject: avahi-discover
126  [08/08/2018 04:02AM]:     python-dbus: avahi-discover [pending]
127  [08/08/2018 04:02AM]: Optional dependencies for ghostscript
128  [08/08/2018 04:02AM]:     texlive-core: needed for dvipdf
129  [08/08/2018 04:02AM]: Optional dependencies for jasper
130  [08/08/2018 04:02AM]:     jasper-doc: documentation
131  [08/08/2018 04:02AM]: installing wayland-protocols...
132  [08/08/2018 04:02AM]: Optional dependencies for efl
133  [08/08/2018 04:02AM]:     python2: einabench-cmp [installed]
134  [08/08/2018 04:02AM]:     libreoffice: thumbnailing for DOC/PPT/XLS files
135  [08/08/2018 04:02AM]: installing python-dbus-common...
136  [08/08/2018 04:02AM]: :: Running post-transaction hooks...
137  [08/08/2018 04:02AM]: (1/7) Probing GDK-Pixbuf loader modules...
138  [08/08/2018 04:02AM]: (2/7) Reloading system manager configuration...
139  [08/08/2018 04:02AM]:   Skipped: Current root is not booted.
140  [08/08/2018 04:02AM]: (3/7) Updating udev hardware database...
141  [08/08/2018 04:02AM]: (4/7) Creating system user accounts...
142  [08/08/2018 04:02AM]:   Skipped: Device manager is not running.
143  [08/08/2018 04:02AM]: (6/7) Arming ConditionNeedsUpdate...
144  [08/08/2018 04:02AM]: (7/7) Updating the MIME type database...
145  [08/08/2018 04:02AM]: Packages (6) python-appdirs-1.4.3-2  python-packaging-17.1-2  python-pyparsing-2.2.0-2  python-setuptools-1:39.2.0-3  python-six-1.11.0-3  cython-0.28.4-2
146  [08/08/2018 04:02AM]: Total Download Size:    2.63 MiB
147  [08/08/2018 04:02AM]: Total Installed Size:  13.47 MiB
148  [08/08/2018 04:02AM]: downloading cython-0.28.4-2-x86_64.pkg.tar.xz...
149  [08/08/2018 04:02AM]: installing python-appdirs...
150  [08/08/2018 04:02AM]: installing python-pyparsing...
151  [08/08/2018 04:02AM]:   -> Found python-efl-1.20.0.tar.xz
152  [08/08/2018 04:02AM]: ==> Validating source files with sha256sums...
153  [08/08/2018 04:02AM]:     python-efl-1.20.0.tar.xz ... Passed
154  [08/08/2018 04:02AM]:   -> Extracting python-efl-1.20.0.tar.xz with bsdtar
155  [08/08/2018 04:02AM]: Checking for Python: OK, found 3.7.0
156  [08/08/2018 04:02AM]: Checking for Cython: not needed, using pre-generated C files
157  [08/08/2018 04:02AM]: Checking for Eina: OK, found 1.20.7
158  [08/08/2018 04:02AM]: Checking for Eo: OK, found 1.20.7
159  [08/08/2018 04:02AM]: Checking for Ecore: OK, found 1.20.7
160  [08/08/2018 04:02AM]: Checking for EcoreFile: OK, found 1.20.7
161  [08/08/2018 04:02AM]: Checking for EcoreInput: OK, found 1.20.7
162  [08/08/2018 04:02AM]: Checking for EcoreCon: OK, found 1.20.7
163  [08/08/2018 04:02AM]: Checking for EcoreX: OK, found 1.20.7
164  [08/08/2018 04:02AM]: Checking for Ethumb_Client: OK, found 1.20.7
165  [08/08/2018 04:02AM]: Checking for Emotion: OK, found 1.20.7
166  [08/08/2018 04:02AM]: Checking for DBus: OK, found 1.2.8
167  [08/08/2018 04:02AM]: creating build/lib.linux-x86_64-3.7
168  [08/08/2018 04:02AM]: creating build/lib.linux-x86_64-3.7/efl
169  [08/08/2018 04:02AM]: creating build/lib.linux-x86_64-3.7/efl/utils
170  [08/08/2018 04:02AM]: copying efl/utils/__init__.py -> build/lib.linux-x86_64-3.7/efl/utils
171  [08/08/2018 04:02AM]: copying efl/utils/setup.py -> build/lib.linux-x86_64-3.7/efl/utils
172  [08/08/2018 04:02AM]: copying efl/__init__.py -> build/lib.linux-x86_64-3.7/efl
173  [08/08/2018 04:02AM]: creating build/lib.linux-x86_64-3.7/efl/elementary
174  [08/08/2018 04:02AM]: copying efl/elementary/bubble.py -> build/lib.linux-x86_64-3.7/efl/elementary
175  [08/08/2018 04:02AM]: copying efl/elementary/__init__.py -> build/lib.linux-x86_64-3.7/efl/elementary
176  [08/08/2018 04:02AM]: copying efl/elementary/background.py -> build/lib.linux-x86_64-3.7/efl/elementary
177  [08/08/2018 04:02AM]: copying efl/elementary/slideshow.py -> build/lib.linux-x86_64-3.7/efl/elementary
178  [08/08/2018 04:02AM]: copying efl/elementary/transit.py -> build/lib.linux-x86_64-3.7/efl/elementary
179  [08/08/2018 04:02AM]: copying efl/elementary/slider.py -> build/lib.linux-x86_64-3.7/efl/elementary
180  [08/08/2018 04:02AM]: copying efl/elementary/hoversel.py -> build/lib.linux-x86_64-3.7/efl/elementary
181  [08/08/2018 04:02AM]: copying efl/elementary/naviframe.py -> build/lib.linux-x86_64-3.7/efl/elementary
182  [08/08/2018 04:02AM]: copying efl/elementary/general.py -> build/lib.linux-x86_64-3.7/efl/elementary
183  [08/08/2018 04:02AM]: copying efl/elementary/gengrid.py -> build/lib.linux-x86_64-3.7/efl/elementary
184  [08/08/2018 04:02AM]: copying efl/elementary/separator.py -> build/lib.linux-x86_64-3.7/efl/elementary
185  [08/08/2018 04:02AM]: copying efl/elementary/object.py -> build/lib.linux-x86_64-3.7/efl/elementary
186  [08/08/2018 04:02AM]: copying efl/elementary/image.py -> build/lib.linux-x86_64-3.7/efl/elementary
187  [08/08/2018 04:02AM]: copying efl/elementary/list.py -> build/lib.linux-x86_64-3.7/efl/elementary
188  [08/08/2018 04:02AM]: copying efl/elementary/photo.py -> build/lib.linux-x86_64-3.7/efl/elementary
189  [08/08/2018 04:02AM]: copying efl/elementary/plug.py -> build/lib.linux-x86_64-3.7/efl/elementary
190  [08/08/2018 04:02AM]: copying efl/elementary/radio.py -> build/lib.linux-x86_64-3.7/efl/elementary
191  [08/08/2018 04:02AM]: copying efl/elementary/index.py -> build/lib.linux-x86_64-3.7/efl/elementary
192  [08/08/2018 04:02AM]: copying efl/elementary/theme.py -> build/lib.linux-x86_64-3.7/efl/elementary
193  [08/08/2018 04:02AM]: copying efl/elementary/actionslider.py -> build/lib.linux-x86_64-3.7/efl/elementary
194  [08/08/2018 04:02AM]: copying efl/elementary/mapbuf.py -> build/lib.linux-x86_64-3.7/efl/elementary
195  [08/08/2018 04:02AM]: copying efl/elementary/menu.py -> build/lib.linux-x86_64-3.7/efl/elementary
196  [08/08/2018 04:02AM]: copying efl/elementary/window.py -> build/lib.linux-x86_64-3.7/efl/elementary
197  [08/08/2018 04:02AM]: copying efl/elementary/need.py -> build/lib.linux-x86_64-3.7/efl/elementary
198  [08/08/2018 04:02AM]: copying efl/elementary/thumb.py -> build/lib.linux-x86_64-3.7/efl/elementary
199  [08/08/2018 04:02AM]: copying efl/elementary/frame.py -> build/lib.linux-x86_64-3.7/efl/elementary
200  [08/08/2018 04:02AM]: copying efl/elementary/panel.py -> build/lib.linux-x86_64-3.7/efl/elementary
201  [08/08/2018 04:02AM]: copying efl/elementary/fileselector_entry.py -> build/lib.linux-x86_64-3.7/efl/elementary
202  [08/08/2018 04:02AM]: copying efl/elementary/genlist.py -> build/lib.linux-x86_64-3.7/efl/elementary
203  [08/08/2018 04:02AM]: copying efl/elementary/systray.py -> build/lib.linux-x86_64-3.7/efl/elementary
204  [08/08/2018 04:02AM]: copying efl/elementary/toolbar.py -> build/lib.linux-x86_64-3.7/efl/elementary
205  [08/08/2018 04:02AM]: copying efl/elementary/colorselector.py -> build/lib.linux-x86_64-3.7/efl/elementary
206  [08/08/2018 04:02AM]: copying efl/elementary/photocam.py -> build/lib.linux-x86_64-3.7/efl/elementary
207  [08/08/2018 04:02AM]: copying efl/elementary/fileselector_button.py -> build/lib.linux-x86_64-3.7/efl/elementary
208  [08/08/2018 04:02AM]: copying efl/elementary/button.py -> build/lib.linux-x86_64-3.7/efl/elementary
209  [08/08/2018 04:02AM]: copying efl/elementary/fileselector.py -> build/lib.linux-x86_64-3.7/efl/elementary
210  [08/08/2018 04:02AM]: copying efl/elementary/ctxpopup.py -> build/lib.linux-x86_64-3.7/efl/elementary
211  [08/08/2018 04:02AM]: copying efl/elementary/table.py -> build/lib.linux-x86_64-3.7/efl/elementary
212  [08/08/2018 04:02AM]: copying efl/elementary/segment_control.py -> build/lib.linux-x86_64-3.7/efl/elementary
213  [08/08/2018 04:02AM]: copying efl/elementary/map.py -> build/lib.linux-x86_64-3.7/efl/elementary
214  [08/08/2018 04:02AM]: copying efl/elementary/configuration.py -> build/lib.linux-x86_64-3.7/efl/elementary
215  [08/08/2018 04:02AM]: copying efl/elementary/check.py -> build/lib.linux-x86_64-3.7/efl/elementary
216  [08/08/2018 04:02AM]: copying efl/elementary/web.py -> build/lib.linux-x86_64-3.7/efl/elementary
217  [08/08/2018 04:02AM]: copying efl/elementary/notify.py -> build/lib.linux-x86_64-3.7/efl/elementary
218  [08/08/2018 04:02AM]: copying efl/elementary/flipselector.py -> build/lib.linux-x86_64-3.7/efl/elementary
219  [08/08/2018 04:02AM]: copying efl/elementary/multibuttonentry.py -> build/lib.linux-x86_64-3.7/efl/elementary
220  [08/08/2018 04:02AM]: copying efl/elementary/hover.py -> build/lib.linux-x86_64-3.7/efl/elementary
221  [08/08/2018 04:02AM]: copying efl/elementary/calendar_elm.py -> build/lib.linux-x86_64-3.7/efl/elementary
222  [08/08/2018 04:02AM]: copying efl/elementary/clock.py -> build/lib.linux-x86_64-3.7/efl/elementary
223  [08/08/2018 04:02AM]: copying efl/elementary/diskselector.py -> build/lib.linux-x86_64-3.7/efl/elementary
224  [08/08/2018 04:02AM]: copying efl/elementary/gesture_layer.py -> build/lib.linux-x86_64-3.7/efl/elementary
225  [08/08/2018 04:02AM]: copying efl/elementary/panes.py -> build/lib.linux-x86_64-3.7/efl/elementary
226  [08/08/2018 04:02AM]: copying efl/elementary/innerwindow.py -> build/lib.linux-x86_64-3.7/efl/elementary
227  [08/08/2018 04:02AM]: copying efl/elementary/flip.py -> build/lib.linux-x86_64-3.7/efl/elementary
228  [08/08/2018 04:02AM]: copying efl/elementary/box.py -> build/lib.linux-x86_64-3.7/efl/elementary
229  [08/08/2018 04:02AM]: copying efl/elementary/video.py -> build/lib.linux-x86_64-3.7/efl/elementary
230  [08/08/2018 04:02AM]: copying efl/elementary/icon.py -> build/lib.linux-x86_64-3.7/efl/elementary
231  [08/08/2018 04:02AM]: copying efl/elementary/dayselector.py -> build/lib.linux-x86_64-3.7/efl/elementary
232  [08/08/2018 04:02AM]: copying efl/elementary/grid.py -> build/lib.linux-x86_64-3.7/efl/elementary
233  [08/08/2018 04:02AM]: copying efl/elementary/datetime_elm.py -> build/lib.linux-x86_64-3.7/efl/elementary
234  [08/08/2018 04:02AM]: copying efl/elementary/progressbar.py -> build/lib.linux-x86_64-3.7/efl/elementary
235  [08/08/2018 04:02AM]: copying efl/elementary/spinner.py -> build/lib.linux-x86_64-3.7/efl/elementary
236  [08/08/2018 04:02AM]: copying efl/elementary/conformant.py -> build/lib.linux-x86_64-3.7/efl/elementary
237  [08/08/2018 04:02AM]: copying efl/elementary/scroller.py -> build/lib.linux-x86_64-3.7/efl/elementary
238  [08/08/2018 04:02AM]: copying efl/elementary/layout.py -> build/lib.linux-x86_64-3.7/efl/elementary
239  [08/08/2018 04:02AM]: copying efl/elementary/label.py -> build/lib.linux-x86_64-3.7/efl/elementary
240  [08/08/2018 04:02AM]: copying efl/elementary/entry.py -> build/lib.linux-x86_64-3.7/efl/elementary
241  [08/08/2018 04:02AM]: copying efl/elementary/popup.py -> build/lib.linux-x86_64-3.7/efl/elementary
242  [08/08/2018 04:02AM]: creating build/temp.linux-x86_64-3.7
243  [08/08/2018 04:02AM]: creating build/temp.linux-x86_64-3.7/efl
244  [08/08/2018 04:02AM]: creating build/temp.linux-x86_64-3.7/efl/eo
245  [08/08/2018 04:02AM]: gcc -pthread -DNDEBUG -g -fwrapv -O3 -Wall -march=x86-64 -mtune=generic -O2 -pipe -fstack-protector-strong -fno-plt -D_FORTIFY_SOURCE=2 -fPIC -DEFL_BETA_API_SUPPORT=1 -DEFL_EO_API_SUPPORT=1 -Iinclude/ -I/usr/include/python3.7m -c efl/eo/efl.eo.c -o build/temp.linux-x86_64-3.7/efl/eo/efl.eo.o -I/usr/include/eina-1/eina -I/usr/include/eina-1 -I/usr/include/eo-1 -I/usr/include/efl-1 -Wno-deprecated-declarations -Wno-unused-variable -Wno-format-security
246  [08/08/2018 04:02AM]: In file included from /usr/include/eina-1/Eina.h:226,
247  [08/08/2018 04:02AM]:                  from efl/eo/efl.eo.c:280:
248  [08/08/2018 04:02AM]: /usr/include/eina-1/eina/eina_module.h:232:2: warning: ignoring attribute malloc because it conflicts with attribute pure [-Wattributes]
249  [08/08/2018 04:02AM]:   eina_module_symbol_path_get(const void *symbol, const char *sub_dir) EINA_PURE EINA_MALLOC EINA_ARG_NONNULL(1, 2);
250  [08/08/2018 04:02AM]:   ^~~~~~~~~~~~~~~~~~~~~~~~~~~
251  [08/08/2018 04:02AM]: /usr/include/eina-1/eina/eina_module.h:249:2: warning: ignoring attribute malloc because it conflicts with attribute pure [-Wattributes]
252  [08/08/2018 04:02AM]:   eina_module_environment_path_get(const char *env, const char *sub_dir) EINA_PURE EINA_MALLOC EINA_ARG_NONNULL(1, 2);
253  [08/08/2018 04:02AM]:   ^~~~~~~~~~~~~~~~~~~~~~~~~~~~~~~~
254  [08/08/2018 04:02AM]: efl/eo/efl.eo.c: In function __Pyx_ExceptionSave:
255  [08/08/2018 04:02AM]: efl/eo/efl.eo.c:5662:21: error: PyThreadState {aka struct _ts} has no member named exc_type; did you mean curexc_type?
256  [08/08/2018 04:02AM]:      *type = tstate->exc_type;
257  [08/08/2018 04:02AM]:                      curexc_type
258  [08/08/2018 04:02AM]: efl/eo/efl.eo.c:5663:22: error: PyThreadState {aka struct _ts} has no member named exc_value; did you mean curexc_value?
259  [08/08/2018 04:02AM]:      *value = tstate->exc_value;
260  [08/08/2018 04:02AM]:                       ^~~~~~~~~
261  [08/08/2018 04:02AM]:                       curexc_value
262  [08/08/2018 04:02AM]: efl/eo/efl.eo.c:5664:19: error: PyThreadState {aka struct _ts} has no member named exc_traceback; did you mean curexc_traceback?
263  [08/08/2018 04:02AM]:      *tb = tstate->exc_traceback;
264  [08/08/2018 04:02AM]:                    ^~~~~~~~~~~~~
265  [08/08/2018 04:02AM]:                    curexc_traceback
266  [08/08/2018 04:02AM]: efl/eo/efl.eo.c: In function __Pyx_ExceptionReset:
267  [08/08/2018 04:02AM]:      tmp_type = tstate->exc_type;
268  [08/08/2018 04:02AM]:                         curexc_type
269  [08/08/2018 04:02AM]:      tmp_value = tstate->exc_value;
270  [08/08/2018 04:02AM]:                          ^~~~~~~~~
271  [08/08/2018 04:02AM]:                          curexc_value
272  [08/08/2018 04:02AM]:      tmp_tb = tstate->exc_traceback;
273  [08/08/2018 04:02AM]:                       ^~~~~~~~~~~~~
274  [08/08/2018 04:02AM]:                       curexc_traceback
275  [08/08/2018 04:02AM]:      tstate->exc_type = type;
276  [08/08/2018 04:02AM]:      tstate->exc_value = value;
277  [08/08/2018 04:02AM]:      tstate->exc_traceback = tb;
278  [08/08/2018 04:02AM]:              ^~~~~~~~~~~~~
279  [08/08/2018 04:02AM]:              curexc_traceback
280  [08/08/2018 04:02AM]: efl/eo/efl.eo.c: In function __Pyx_GetException:
281  [08/08/2018 04:02AM]:      tstate->exc_type = local_type;
282  [08/08/2018 04:02AM]:      tstate->exc_value = local_value;
283  [08/08/2018 04:02AM]:      tstate->exc_traceback = local_tb;
284  [08/08/2018 04:02AM]: error: command gcc failed with exit status 1
285  [08/08/2018 04:02AM]: ==> ERROR: A failure occurred in build().
286  [08/08/2018 04:02AM]: rm: cannot remove **.pkg.**: No such file or directory
287  [08/08/2018 04:02AM]: [\^/\^/^\^/^\^/\^/\^/^\^/^\^/]  BUILD FAILED  [\^/\^/^\^/^\^/\^/\^/^\^/^\^/]