Build Record

Build Number: 8383

Transaction: 4319
Package: spl-utils
Version: 1:0.7.10-1
Start: 09/07/2018 04:41PM
Finish: 09/07/2018 04:41PM
Result: failed

Build Log

  1 [09/07/2018 04:41PM]: [\^/\^/^\^/^\^/\^/\^/^\^/^\^/]  SETTING UP ENVIRONMENT  [\^/\^/^\^/^\^/\^/\^/^\^/^\^/]
  2  [09/07/2018 04:41PM]: [\^/\^/^\^/^\^/\^/\^/^\^/^\^/]  ADDING UPSTREAM PGP KEYS TO KEYRING  [\^/\^/^\^/^\^/\^/\^/^\^/^\^/]
  3  [09/07/2018 04:41PM]: gpg: WARNING: unsafe ownership on homedir /tmp/antbs/.gnupg
  4  [09/07/2018 04:41PM]: gpg: keybox /tmp/antbs/.gnupg/pubring.kbx created
  5  [09/07/2018 04:41PM]: gpg: key 23EFEFE93C4CFFFE: 1 signature not checked due to a missing key
  6  [09/07/2018 04:41PM]: gpg: /tmp/antbs/.gnupg/trustdb.gpg: trustdb created
  7  [09/07/2018 04:41PM]: gpg: key 23EFEFE93C4CFFFE: public key Italo A. Casas <[email protected]> imported
  8  [09/07/2018 04:41PM]: gpg: key B63B535A4C206CA9: 9 signatures not checked due to missing keys
  9  [09/07/2018 04:41PM]: gpg: key B63B535A4C206CA9: public key Evan Lucas <[email protected]> imported
 10  [09/07/2018 04:41PM]: gpg: key E73BC641CC11F4C8: 14 signatures not checked due to missing keys
 11  [09/07/2018 04:41PM]: gpg: bad data signature from key DEA16371974031A5: Wrong key usage (0x19, 0x2)
 12  [09/07/2018 04:41PM]: gpg: key E73BC641CC11F4C8: public key Myles Borins <[email protected]> imported
 13  [09/07/2018 04:41PM]: gpg: key C273792F7D83545D: 4 signatures not checked due to missing keys
 14  [09/07/2018 04:41PM]: gpg: key C273792F7D83545D: public key Rod Vagg <[email protected]> imported
 15  [09/07/2018 04:41PM]: gpg: key C97EC7A07EDE3FC1: 19 signatures not checked due to missing keys
 16  [09/07/2018 04:41PM]: gpg: bad data signature from key 8975BA8B6100C6B1: Wrong key usage (0x19, 0x2)
 17  [09/07/2018 04:41PM]: gpg: key C97EC7A07EDE3FC1: public key keybase.io/jasnell <[email protected]> imported
 18  [09/07/2018 04:41PM]: gpg: key 09FE44734EB7990E: 2 signatures not checked due to missing keys
 19  [09/07/2018 04:41PM]: gpg: key 09FE44734EB7990E: public key Jeremiah Senkpiel <[email protected]> imported
 20  [09/07/2018 04:41PM]: gpg: key 7434390BDBE9B9C5: public key Colin Ihrig <[email protected]> imported
 21  [09/07/2018 04:41PM]: gpg: key 61B7B526D98F0353: 26 signatures not checked due to missing keys
 22  [09/07/2018 04:41PM]: gpg: key 61B7B526D98F0353: public key Mozilla Software Releases <[email protected]> imported
 23  [09/07/2018 04:41PM]: gpg: key 61B7B526D98F0353: Mozilla Software Releases <[email protected]> not changed
 24  [09/07/2018 04:41PM]: gpg: no ultimately trusted keys found
 25  [09/07/2018 04:41PM]: gpg: Total number processed: 9
 26  [09/07/2018 04:41PM]: gpg:               imported: 8
 27  [09/07/2018 04:41PM]: gpg:              unchanged: 1
 28  [09/07/2018 04:41PM]: [\^/\^/^\^/^\^/\^/\^/^\^/^\^/]  SYNCING REPO DATABASES  [\^/\^/^\^/^\^/\^/\^/^\^/^\^/]
 29  [09/07/2018 04:41PM]: :: Synchronizing package databases...
 30  [09/07/2018 04:41PM]: downloading antergos-staging.db...
 31  [09/07/2018 04:41PM]: downloading antergos.db...
 32  [09/07/2018 04:41PM]: downloading core.db...
 33  [09/07/2018 04:41PM]: downloading community.db...
 34  [09/07/2018 04:41PM]: :: Starting full system upgrade...
 35  [09/07/2018 04:41PM]: looking for conflicting packages...
 36  [09/07/2018 04:41PM]: Packages (3) coreutils-8.30-1  file-5.34-1  sudo-1.8.25-1
 37  [09/07/2018 04:41PM]: Total Installed Size:  22.83 MiB
 38  [09/07/2018 04:41PM]: Net Upgrade Size:       0.78 MiB
 39  [09/07/2018 04:41PM]: :: Proceed with installation? [Y/n]
 40  [09/07/2018 04:41PM]: checking package integrity...
 41  [09/07/2018 04:41PM]: checking for file conflicts...
 42  [09/07/2018 04:41PM]: :: Processing package changes...
 43  [09/07/2018 04:41PM]: :: Running post-transaction hooks...
 44  [09/07/2018 04:41PM]: (1/3) Creating temporary files...
 45  [09/07/2018 04:41PM]: (2/3) Arming ConditionNeedsUpdate...
 46  [09/07/2018 04:41PM]: (3/3) Updating the info directory file...
 47  [09/07/2018 04:41PM]: [\^/\^/^\^/^\^/\^/\^/^\^/^\^/]  TRYING BUILD  [\^/\^/^\^/^\^/\^/\^/^\^/^\^/]
 48  [09/07/2018 04:41PM]: [\^/\^/^\^/^\^/\^/\^/^\^/^\^/]  UPDATING SOURCE CHECKSUMS  [\^/\^/^\^/^\^/\^/\^/^\^/^\^/]
 49  [09/07/2018 04:41PM]: Copyright (c) 2006-2018 Pacman Development Team <[email protected]>.
 50  [09/07/2018 04:41PM]: Copyright (C) 2002-2006 Judd Vinet <[email protected]>.
 51  [09/07/2018 04:41PM]: This is free software; see the source for copying conditions.
 52  [09/07/2018 04:41PM]: There is NO WARRANTY, to the extent permitted by law.
 53  [09/07/2018 04:41PM]:   -> Downloading spl-0.7-release.zip...
 54  [09/07/2018 04:41PM]:   % Total    % Received % Xferd  Average Speed   Time    Time     Time  Current
 55  [09/07/2018 04:41PM]:                                  Dload  Upload   Total   Spent    Left  Speed
 56  [09/07/2018 04:41PM]: 
 57   0     0    0     0    0     0      0      0 --:--:-- --:--:-- --:--:--     0
 58 100   128    0   128    0     0    859      0 --:--:-- --:--:-- --:--:--   864
 59  [09/07/2018 04:41PM]: 
 60 100  361k    0  361k    0     0   887k      0 --:--:-- --:--:-- --:--:--  887k
 61  [09/07/2018 04:41PM]:   -> Downloading 707.patch...
 62  [09/07/2018 04:41PM]: 
 63   0     0    0     0    0     0      0      0 --:--:-- --:--:-- --:--:--     0
 64 100   140    0   140    0     0    777      0 --:--:-- --:--:-- --:--:--   777
 65  [09/07/2018 04:41PM]: 
 66   0     0    0     0    0     0      0      0 --:--:-- --:--:-- --:--:--     0
 67 100 14183    0 14183    0     0  13481      0 --:--:--  0:00:01 --:--:-- 16744
 68  [09/07/2018 04:41PM]: ==> Generating checksums for source files...
 69  [09/07/2018 04:41PM]: ==> Making package: spl-utils 0.7.10git+af567ce-1 (Fri Sep  7 21:41:18 2018)
 70  [09/07/2018 04:41PM]: ==> Checking runtime dependencies...
 71  [09/07/2018 04:41PM]: ==> Installing missing dependencies...
 72  [09/07/2018 04:41PM]: Total Installed Size:  0.17 MiB
 73  [09/07/2018 04:41PM]: warning: directory permissions differ on /var/
 74  [09/07/2018 04:41PM]: filesystem: 777  package: 755
 75  [09/07/2018 04:41PM]: Optional dependencies for dkms
 76  [09/07/2018 04:41PM]:     linux-headers: build modules against the Arch kernel
 77  [09/07/2018 04:41PM]:     linux-lts-headers: build modules against the LTS kernel
 78  [09/07/2018 04:41PM]:     linux-zen-headers: build modules against the ZEN kernel
 79  [09/07/2018 04:41PM]:     linux-hardened-headers: build modules against the HARDENED kernel
 80  [09/07/2018 04:41PM]:   -> Found spl-0.7-release.zip
 81  [09/07/2018 04:41PM]: ==> Validating source files with md5sums...
 82  [09/07/2018 04:41PM]:     spl-0.7-release.zip ... Passed
 83  [09/07/2018 04:41PM]:   -> Extracting spl-0.7-release.zip with bsdtar
 84  [09/07/2018 04:41PM]: The next patch would create the file config/kernel-inode-times.m4,
 85  [09/07/2018 04:41PM]: which already exists!  Skipping patch.
 86  [09/07/2018 04:41PM]: patching file config/spl-build.m4
 87  [09/07/2018 04:41PM]: Reversed (or previously applied) patch detected!  Skipping patch.
 88  [09/07/2018 04:41PM]: 1 out of 1 hunk ignored -- saving rejects to file config/spl-build.m4.rej
 89  [09/07/2018 04:41PM]: patching file include/sys/condvar.h
 90  [09/07/2018 04:41PM]: 1 out of 1 hunk ignored -- saving rejects to file include/sys/condvar.h.rej
 91  [09/07/2018 04:41PM]: patching file include/sys/time.h
 92  [09/07/2018 04:41PM]: 2 out of 2 hunks ignored -- saving rejects to file include/sys/time.h.rej
 93  [09/07/2018 04:41PM]: patching file include/sys/types.h
 94  [09/07/2018 04:41PM]: 1 out of 1 hunk ignored -- saving rejects to file include/sys/types.h.rej
 95  [09/07/2018 04:41PM]: patching file include/sys/vnode.h
 96  [09/07/2018 04:41PM]: 1 out of 1 hunk ignored -- saving rejects to file include/sys/vnode.h.rej
 97  [09/07/2018 04:41PM]: patching file include/sys/kstat.h
 98  [09/07/2018 04:41PM]: 1 out of 1 hunk ignored -- saving rejects to file include/sys/kstat.h.rej
 99  [09/07/2018 04:41PM]: patching file module/spl/spl-kstat.c
100  [09/07/2018 04:41PM]: 2 out of 2 hunks ignored -- saving rejects to file module/spl/spl-kstat.c.rej
101  [09/07/2018 04:41PM]: patching file include/sys/isa_defs.h
102  [09/07/2018 04:41PM]: 1 out of 1 hunk ignored -- saving rejects to file include/sys/isa_defs.h.rej
103  [09/07/2018 04:41PM]: patching file include/sys/rwlock.h
104  [09/07/2018 04:41PM]: 2 out of 2 hunks ignored -- saving rejects to file include/sys/rwlock.h.rej
105  [09/07/2018 04:41PM]: patching file module/spl/spl-rwlock.c
106  [09/07/2018 04:41PM]: 2 out of 2 hunks ignored -- saving rejects to file module/spl/spl-rwlock.c.rej
107  [09/07/2018 04:41PM]: patching file module/spl/spl-vnode.c
108  [09/07/2018 04:41PM]: 1 out of 1 hunk ignored -- saving rejects to file module/spl/spl-vnode.c.rej
109  [09/07/2018 04:41PM]: 1 out of 1 hunk ignored -- saving rejects to file META.rej
110  [09/07/2018 04:41PM]: patching file rpm/generic/spl-kmod.spec.in
111  [09/07/2018 04:41PM]: 1 out of 1 hunk FAILED -- saving rejects to file rpm/generic/spl-kmod.spec.in.rej
112  [09/07/2018 04:41PM]: patching file rpm/generic/spl.spec.in
113  [09/07/2018 04:41PM]: 1 out of 1 hunk FAILED -- saving rejects to file rpm/generic/spl.spec.in.rej
114  [09/07/2018 04:41PM]: ==> ERROR: A failure occurred in prepare().
115  [09/07/2018 04:41PM]: rm: cannot remove **.pkg.**: No such file or directory
116  [09/07/2018 04:41PM]: [\^/\^/^\^/^\^/\^/\^/^\^/^\^/]  BUILD FAILED  [\^/\^/^\^/^\^/\^/\^/^\^/^\^/]