Build Record

Build Number: 8384

Transaction: 4319
Package: spl
Version: 1:0.7.10-1
Start: 09/07/2018 04:41PM
Finish: 09/07/2018 04:42PM
Result: failed

Build Log

  1 [09/07/2018 04:41PM]: [\^/\^/^\^/^\^/\^/\^/^\^/^\^/]  SETTING UP ENVIRONMENT  [\^/\^/^\^/^\^/\^/\^/^\^/^\^/]
  2  [09/07/2018 04:41PM]: [\^/\^/^\^/^\^/\^/\^/^\^/^\^/]  ADDING UPSTREAM PGP KEYS TO KEYRING  [\^/\^/^\^/^\^/\^/\^/^\^/^\^/]
  3  [09/07/2018 04:41PM]: gpg: WARNING: unsafe ownership on homedir /tmp/antbs/.gnupg
  4  [09/07/2018 04:41PM]: gpg: keybox /tmp/antbs/.gnupg/pubring.kbx created
  5  [09/07/2018 04:41PM]: gpg: key 23EFEFE93C4CFFFE: 1 signature not checked due to a missing key
  6  [09/07/2018 04:41PM]: gpg: /tmp/antbs/.gnupg/trustdb.gpg: trustdb created
  7  [09/07/2018 04:41PM]: gpg: key 23EFEFE93C4CFFFE: public key Italo A. Casas <[email protected]> imported
  8  [09/07/2018 04:41PM]: gpg: key B63B535A4C206CA9: 9 signatures not checked due to missing keys
  9  [09/07/2018 04:41PM]: gpg: key B63B535A4C206CA9: public key Evan Lucas <[email protected]> imported
 10  [09/07/2018 04:41PM]: gpg: key E73BC641CC11F4C8: 14 signatures not checked due to missing keys
 11  [09/07/2018 04:41PM]: gpg: bad data signature from key DEA16371974031A5: Wrong key usage (0x19, 0x2)
 12  [09/07/2018 04:41PM]: gpg: key E73BC641CC11F4C8: public key Myles Borins <[email protected]> imported
 13  [09/07/2018 04:41PM]: gpg: key C273792F7D83545D: 4 signatures not checked due to missing keys
 14  [09/07/2018 04:41PM]: gpg: key C273792F7D83545D: public key Rod Vagg <[email protected]> imported
 15  [09/07/2018 04:41PM]: gpg: key C97EC7A07EDE3FC1: 19 signatures not checked due to missing keys
 16  [09/07/2018 04:41PM]: gpg: bad data signature from key 8975BA8B6100C6B1: Wrong key usage (0x19, 0x2)
 17  [09/07/2018 04:41PM]: gpg: key C97EC7A07EDE3FC1: public key keybase.io/jasnell <[email protected]> imported
 18  [09/07/2018 04:41PM]: gpg: key 09FE44734EB7990E: 2 signatures not checked due to missing keys
 19  [09/07/2018 04:41PM]: gpg: key 09FE44734EB7990E: public key Jeremiah Senkpiel <[email protected]> imported
 20  [09/07/2018 04:41PM]: gpg: key 7434390BDBE9B9C5: public key Colin Ihrig <[email protected]> imported
 21  [09/07/2018 04:41PM]: gpg: key 61B7B526D98F0353: 26 signatures not checked due to missing keys
 22  [09/07/2018 04:41PM]: gpg: key 61B7B526D98F0353: public key Mozilla Software Releases <[email protected]> imported
 23  [09/07/2018 04:41PM]: gpg: key 61B7B526D98F0353: Mozilla Software Releases <[email protected]> not changed
 24  [09/07/2018 04:41PM]: gpg: no ultimately trusted keys found
 25  [09/07/2018 04:41PM]: gpg: Total number processed: 9
 26  [09/07/2018 04:41PM]: gpg:               imported: 8
 27  [09/07/2018 04:41PM]: gpg:              unchanged: 1
 28  [09/07/2018 04:41PM]: [\^/\^/^\^/^\^/\^/\^/^\^/^\^/]  SYNCING REPO DATABASES  [\^/\^/^\^/^\^/\^/\^/^\^/^\^/]
 29  [09/07/2018 04:41PM]: :: Synchronizing package databases...
 30  [09/07/2018 04:41PM]: downloading antergos-staging.db...
 31  [09/07/2018 04:41PM]: downloading antergos.db...
 32  [09/07/2018 04:41PM]: downloading core.db...
 33  [09/07/2018 04:41PM]: downloading community.db...
 34  [09/07/2018 04:41PM]: :: Starting full system upgrade...
 35  [09/07/2018 04:41PM]: looking for conflicting packages...
 36  [09/07/2018 04:41PM]: Packages (3) coreutils-8.30-1  file-5.34-1  sudo-1.8.25-1
 37  [09/07/2018 04:41PM]: Total Installed Size:  22.83 MiB
 38  [09/07/2018 04:41PM]: Net Upgrade Size:       0.78 MiB
 39  [09/07/2018 04:41PM]: :: Proceed with installation? [Y/n]
 40  [09/07/2018 04:41PM]: checking package integrity...
 41  [09/07/2018 04:41PM]: checking for file conflicts...
 42  [09/07/2018 04:41PM]: :: Processing package changes...
 43  [09/07/2018 04:41PM]: :: Running post-transaction hooks...
 44  [09/07/2018 04:41PM]: (1/3) Creating temporary files...
 45  [09/07/2018 04:41PM]: (2/3) Arming ConditionNeedsUpdate...
 46  [09/07/2018 04:41PM]: (3/3) Updating the info directory file...
 47  [09/07/2018 04:41PM]: [\^/\^/^\^/^\^/\^/\^/^\^/^\^/]  TRYING BUILD  [\^/\^/^\^/^\^/\^/\^/^\^/^\^/]
 48  [09/07/2018 04:41PM]: [\^/\^/^\^/^\^/\^/\^/^\^/^\^/]  UPDATING SOURCE CHECKSUMS  [\^/\^/^\^/^\^/\^/\^/^\^/^\^/]
 49  [09/07/2018 04:41PM]: Copyright (c) 2006-2018 Pacman Development Team <[email protected]>.
 50  [09/07/2018 04:41PM]: Copyright (C) 2002-2006 Judd Vinet <jv[email protected]>.
 51  [09/07/2018 04:41PM]: This is free software; see the source for copying conditions.
 52  [09/07/2018 04:41PM]: There is NO WARRANTY, to the extent permitted by law.
 53  [09/07/2018 04:41PM]:   -> Downloading spl-0.7-release.zip...
 54  [09/07/2018 04:41PM]:   % Total    % Received % Xferd  Average Speed   Time    Time     Time  Current
 55  [09/07/2018 04:41PM]:                                  Dload  Upload   Total   Spent    Left  Speed
 56  [09/07/2018 04:41PM]: 
 57   0     0    0     0    0     0      0      0 --:--:-- --:--:-- --:--:--     0
 58 100   128    0   128    0     0    969      0 --:--:-- --:--:-- --:--:--   969
 59  [09/07/2018 04:41PM]: 
 60 100  361k    0  361k    0     0  1276k      0 --:--:-- --:--:-- --:--:-- 1276k
 61  [09/07/2018 04:41PM]:   -> Downloading 707.patch...
 62  [09/07/2018 04:41PM]: 
 63   0     0    0     0    0     0      0      0 --:--:-- --:--:-- --:--:--     0
 64 100   140    0   140    0     0    744      0 --:--:-- --:--:-- --:--:--   744
 65  [09/07/2018 04:41PM]: 
 66 100 14183    0 14183    0     0  40292      0 --:--:-- --:--:-- --:--:-- 40292
 67  [09/07/2018 04:41PM]: ==> Generating checksums for source files...
 68  [09/07/2018 04:41PM]: ==> Making package: spl 0.7.10git+af567ce-1 (Fri Sep  7 21:41:43 2018)
 69  [09/07/2018 04:41PM]: ==> Checking runtime dependencies...
 70  [09/07/2018 04:41PM]: ==> Installing missing dependencies...
 71  [09/07/2018 04:41PM]: Packages (7) linux-firmware-20180825.fea76a0-1  mkinitcpio-24-2  mkinitcpio-busybox-1.29.2-1  dkms-2.5-3  linux-4.18.5.arch1-1  linux-headers-4.18.5.arch1-1  spl-utils-0.7.10git+af567ce-1
 72  [09/07/2018 04:41PM]: Total Download Size:    87.09 MiB
 73  [09/07/2018 04:41PM]: Total Installed Size:  458.50 MiB
 74  [09/07/2018 04:41PM]: downloading spl-utils-0.7.10git+af567ce-1-x86_64.pkg.tar.xz...
 75  [09/07/2018 04:41PM]: downloading linux-headers-4.18.5.arch1-1-x86_64.pkg.tar.xz...
 76  [09/07/2018 04:41PM]: downloading linux-firmware-20180825.fea76a0-1-any.pkg.tar.xz...
 77  [09/07/2018 04:41PM]: downloading mkinitcpio-busybox-1.29.2-1-x86_64.pkg.tar.xz...
 78  [09/07/2018 04:41PM]: warning: directory permissions differ on /var/
 79  [09/07/2018 04:41PM]: filesystem: 777  package: 755
 80  [09/07/2018 04:41PM]: Optional dependencies for dkms
 81  [09/07/2018 04:41PM]:     linux-headers: build modules against the Arch kernel [pending]
 82  [09/07/2018 04:41PM]:     linux-lts-headers: build modules against the LTS kernel
 83  [09/07/2018 04:41PM]:     linux-zen-headers: build modules against the ZEN kernel
 84  [09/07/2018 04:41PM]:     linux-hardened-headers: build modules against the HARDENED kernel
 85  [09/07/2018 04:41PM]: installing linux-firmware...
 86  [09/07/2018 04:42PM]: installing mkinitcpio-busybox...
 87  [09/07/2018 04:42PM]: Optional dependencies for mkinitcpio
 88  [09/07/2018 04:42PM]:     xz: Use lzma or xz compression for the initramfs image [installed]
 89  [09/07/2018 04:42PM]:     bzip2: Use bzip2 compression for the initramfs image [installed]
 90  [09/07/2018 04:42PM]:     lzop: Use lzo compression for the initramfs image
 91  [09/07/2018 04:42PM]:     lz4: Use lz4 compression for the initramfs image [installed]
 92  [09/07/2018 04:42PM]:     mkinitcpio-nfs-utils: Support for root filesystem on NFS
 93  [09/07/2018 04:42PM]: Optional dependencies for linux
 94  [09/07/2018 04:42PM]:     crda: to set the correct wireless channels of your country
 95  [09/07/2018 04:42PM]: (1/6) Updating linux module dependencies...
 96  [09/07/2018 04:42PM]: (2/6) Install DKMS modules
 97  [09/07/2018 04:42PM]: (3/6) Updating linux initcpios...
 98  [09/07/2018 04:42PM]: ==> Building image from preset: /etc/mkinitcpio.d/linux.preset: default
 99  [09/07/2018 04:42PM]:   -> -k /boot/vmlinuz-linux -c /etc/mkinitcpio.conf -g /boot/initramfs-linux.img
100  [09/07/2018 04:42PM]: ==> Starting build: 4.18.5-arch1-1-ARCH
101  [09/07/2018 04:42PM]:   -> Running build hook: [base]
102  [09/07/2018 04:42PM]:   -> Running build hook: [udev]
103  [09/07/2018 04:42PM]:   -> Running build hook: [autodetect]
104  [09/07/2018 04:42PM]:   -> Running build hook: [modconf]
105  [09/07/2018 04:42PM]:   -> Running build hook: [block]
106  [09/07/2018 04:42PM]:   -> Running build hook: [filesystems]
107  [09/07/2018 04:42PM]:   -> Running build hook: [keyboard]
108  [09/07/2018 04:42PM]:   -> Running build hook: [fsck]
109  [09/07/2018 04:42PM]: ==> ERROR: file not found: `fsck.aufs
110  [09/07/2018 04:42PM]: ==> WARNING: No fsck helpers found. fsck will not be run on boot.
111  [09/07/2018 04:42PM]: ==> Generating module dependencies
112  [09/07/2018 04:42PM]: ==> Creating gzip-compressed initcpio image: /boot/initramfs-linux.img
113  [09/07/2018 04:42PM]: ==> WARNING: errors were encountered during the build. The image may not be complete.
114  [09/07/2018 04:42PM]: ==> Building image from preset: /etc/mkinitcpio.d/linux.preset: fallback
115  [09/07/2018 04:42PM]:   -> -k /boot/vmlinuz-linux -c /etc/mkinitcpio.conf -g /boot/initramfs-linux-fallback.img -S autodetect
116  [09/07/2018 04:42PM]: ==> WARNING: Possibly missing firmware for module: aic94xx
117  [09/07/2018 04:42PM]: ==> WARNING: Possibly missing firmware for module: wd719x
118  [09/07/2018 04:42PM]: ==> Creating gzip-compressed initcpio image: /boot/initramfs-linux-fallback.img
119  [09/07/2018 04:42PM]: ==> Image generation successful
120  [09/07/2018 04:42PM]: error: command failed to execute correctly
121  [09/07/2018 04:42PM]: (4/6) Reloading system manager configuration...
122  [09/07/2018 04:42PM]:   Skipped: Current root is not booted.
123  [09/07/2018 04:42PM]:   -> Found spl-0.7-release.zip
124  [09/07/2018 04:42PM]: ==> Validating source files with md5sums...
125  [09/07/2018 04:42PM]:     spl-0.7-release.zip ... Passed
126  [09/07/2018 04:42PM]:   -> Extracting spl-0.7-release.zip with bsdtar
127  [09/07/2018 04:42PM]: The next patch would create the file config/kernel-inode-times.m4,
128  [09/07/2018 04:42PM]: which already exists!  Skipping patch.
129  [09/07/2018 04:42PM]: patching file config/spl-build.m4
130  [09/07/2018 04:42PM]: Reversed (or previously applied) patch detected!  Skipping patch.
131  [09/07/2018 04:42PM]: 1 out of 1 hunk ignored -- saving rejects to file config/spl-build.m4.rej
132  [09/07/2018 04:42PM]: patching file include/sys/condvar.h
133  [09/07/2018 04:42PM]: 1 out of 1 hunk ignored -- saving rejects to file include/sys/condvar.h.rej
134  [09/07/2018 04:42PM]: patching file include/sys/time.h
135  [09/07/2018 04:42PM]: 2 out of 2 hunks ignored -- saving rejects to file include/sys/time.h.rej
136  [09/07/2018 04:42PM]: patching file include/sys/types.h
137  [09/07/2018 04:42PM]: 1 out of 1 hunk ignored -- saving rejects to file include/sys/types.h.rej
138  [09/07/2018 04:42PM]: patching file include/sys/vnode.h
139  [09/07/2018 04:42PM]: 1 out of 1 hunk ignored -- saving rejects to file include/sys/vnode.h.rej
140  [09/07/2018 04:42PM]: patching file include/sys/kstat.h
141  [09/07/2018 04:42PM]: 1 out of 1 hunk ignored -- saving rejects to file include/sys/kstat.h.rej
142  [09/07/2018 04:42PM]: patching file module/spl/spl-kstat.c
143  [09/07/2018 04:42PM]: 2 out of 2 hunks ignored -- saving rejects to file module/spl/spl-kstat.c.rej
144  [09/07/2018 04:42PM]: patching file include/sys/isa_defs.h
145  [09/07/2018 04:42PM]: 1 out of 1 hunk ignored -- saving rejects to file include/sys/isa_defs.h.rej
146  [09/07/2018 04:42PM]: patching file include/sys/rwlock.h
147  [09/07/2018 04:42PM]: 2 out of 2 hunks ignored -- saving rejects to file include/sys/rwlock.h.rej
148  [09/07/2018 04:42PM]: patching file module/spl/spl-rwlock.c
149  [09/07/2018 04:42PM]: 2 out of 2 hunks ignored -- saving rejects to file module/spl/spl-rwlock.c.rej
150  [09/07/2018 04:42PM]: patching file module/spl/spl-vnode.c
151  [09/07/2018 04:42PM]: 1 out of 1 hunk ignored -- saving rejects to file module/spl/spl-vnode.c.rej
152  [09/07/2018 04:42PM]: 1 out of 1 hunk ignored -- saving rejects to file META.rej
153  [09/07/2018 04:42PM]: patching file rpm/generic/spl-kmod.spec.in
154  [09/07/2018 04:42PM]: 1 out of 1 hunk FAILED -- saving rejects to file rpm/generic/spl-kmod.spec.in.rej
155  [09/07/2018 04:42PM]: patching file rpm/generic/spl.spec.in
156  [09/07/2018 04:42PM]: 1 out of 1 hunk FAILED -- saving rejects to file rpm/generic/spl.spec.in.rej
157  [09/07/2018 04:42PM]: ==> ERROR: A failure occurred in prepare().
158  [09/07/2018 04:42PM]: rm: cannot remove **.pkg.**: No such file or directory
159  [09/07/2018 04:42PM]: [\^/\^/^\^/^\^/\^/\^/^\^/^\^/]  BUILD FAILED  [\^/\^/^\^/^\^/\^/\^/^\^/^\^/]