Build Record

Build Number: 8385

Transaction: 4319
Package: zfs-utils
Version: 1:0.7.10-1
Start: 09/07/2018 04:42PM
Finish: 09/07/2018 04:46PM
Result: failed

Build Log

  1 [09/07/2018 04:42PM]: [\^/\^/^\^/^\^/\^/\^/^\^/^\^/]  SETTING UP ENVIRONMENT  [\^/\^/^\^/^\^/\^/\^/^\^/^\^/]
  2  [09/07/2018 04:42PM]: [\^/\^/^\^/^\^/\^/\^/^\^/^\^/]  ADDING UPSTREAM PGP KEYS TO KEYRING  [\^/\^/^\^/^\^/\^/\^/^\^/^\^/]
  3  [09/07/2018 04:42PM]: gpg: WARNING: unsafe ownership on homedir /tmp/antbs/.gnupg
  4  [09/07/2018 04:42PM]: gpg: keybox /tmp/antbs/.gnupg/pubring.kbx created
  5  [09/07/2018 04:42PM]: gpg: key 23EFEFE93C4CFFFE: 1 signature not checked due to a missing key
  6  [09/07/2018 04:42PM]: gpg: /tmp/antbs/.gnupg/trustdb.gpg: trustdb created
  7  [09/07/2018 04:42PM]: gpg: key 23EFEFE93C4CFFFE: public key Italo A. Casas <[email protected]> imported
  8  [09/07/2018 04:42PM]: gpg: key B63B535A4C206CA9: 9 signatures not checked due to missing keys
  9  [09/07/2018 04:42PM]: gpg: key B63B535A4C206CA9: public key Evan Lucas <[email protected]> imported
 10  [09/07/2018 04:42PM]: gpg: key E73BC641CC11F4C8: 14 signatures not checked due to missing keys
 11  [09/07/2018 04:42PM]: gpg: bad data signature from key DEA16371974031A5: Wrong key usage (0x19, 0x2)
 12  [09/07/2018 04:42PM]: gpg: key E73BC641CC11F4C8: public key Myles Borins <[email protected]> imported
 13  [09/07/2018 04:42PM]: gpg: key C273792F7D83545D: 4 signatures not checked due to missing keys
 14  [09/07/2018 04:42PM]: gpg: key C273792F7D83545D: public key Rod Vagg <[email protected]> imported
 15  [09/07/2018 04:42PM]: gpg: key C97EC7A07EDE3FC1: 19 signatures not checked due to missing keys
 16  [09/07/2018 04:42PM]: gpg: bad data signature from key 8975BA8B6100C6B1: Wrong key usage (0x19, 0x2)
 17  [09/07/2018 04:42PM]: gpg: key C97EC7A07EDE3FC1: public key keybase.io/jasnell <[email protected]> imported
 18  [09/07/2018 04:42PM]: gpg: key 09FE44734EB7990E: 2 signatures not checked due to missing keys
 19  [09/07/2018 04:42PM]: gpg: key 09FE44734EB7990E: public key Jeremiah Senkpiel <[email protected]> imported
 20  [09/07/2018 04:42PM]: gpg: key 7434390BDBE9B9C5: public key Colin Ihrig <[email protected]> imported
 21  [09/07/2018 04:42PM]: gpg: key 61B7B526D98F0353: 26 signatures not checked due to missing keys
 22  [09/07/2018 04:42PM]: gpg: key 61B7B526D98F0353: public key Mozilla Software Releases <[email protected]> imported
 23  [09/07/2018 04:42PM]: gpg: key 61B7B526D98F0353: Mozilla Software Releases <[email protected]> not changed
 24  [09/07/2018 04:42PM]: gpg: no ultimately trusted keys found
 25  [09/07/2018 04:42PM]: gpg: Total number processed: 9
 26  [09/07/2018 04:42PM]: gpg:               imported: 8
 27  [09/07/2018 04:42PM]: gpg:              unchanged: 1
 28  [09/07/2018 04:42PM]: [\^/\^/^\^/^\^/\^/\^/^\^/^\^/]  SYNCING REPO DATABASES  [\^/\^/^\^/^\^/\^/\^/^\^/^\^/]
 29  [09/07/2018 04:43PM]: :: Synchronizing package databases...
 30  [09/07/2018 04:43PM]: downloading antergos-staging.db...
 31  [09/07/2018 04:43PM]: downloading antergos.db...
 32  [09/07/2018 04:43PM]: downloading core.db...
 33  [09/07/2018 04:43PM]: downloading community.db...
 34  [09/07/2018 04:43PM]: :: Starting full system upgrade...
 35  [09/07/2018 04:43PM]: looking for conflicting packages...
 36  [09/07/2018 04:43PM]: Packages (3) coreutils-8.30-1  file-5.34-1  sudo-1.8.25-1
 37  [09/07/2018 04:43PM]: Total Installed Size:  22.83 MiB
 38  [09/07/2018 04:43PM]: Net Upgrade Size:       0.78 MiB
 39  [09/07/2018 04:43PM]: :: Proceed with installation? [Y/n]
 40  [09/07/2018 04:43PM]: checking package integrity...
 41  [09/07/2018 04:43PM]: checking for file conflicts...
 42  [09/07/2018 04:43PM]: :: Processing package changes...
 43  [09/07/2018 04:43PM]: :: Running post-transaction hooks...
 44  [09/07/2018 04:43PM]: (1/3) Creating temporary files...
 45  [09/07/2018 04:43PM]: (2/3) Arming ConditionNeedsUpdate...
 46  [09/07/2018 04:43PM]: (3/3) Updating the info directory file...
 47  [09/07/2018 04:43PM]: [\^/\^/^\^/^\^/\^/\^/^\^/^\^/]  TRYING BUILD  [\^/\^/^\^/^\^/\^/\^/^\^/^\^/]
 48  [09/07/2018 04:43PM]: [\^/\^/^\^/^\^/\^/\^/^\^/^\^/]  UPDATING SOURCE CHECKSUMS  [\^/\^/^\^/^\^/\^/\^/^\^/^\^/]
 49  [09/07/2018 04:43PM]: Copyright (c) 2006-2018 Pacman Development Team <[email protected]>.
 50  [09/07/2018 04:43PM]: Copyright (C) 2002-2006 Judd Vinet <[email protected]>.
 51  [09/07/2018 04:43PM]: This is free software; see the source for copying conditions.
 52  [09/07/2018 04:43PM]: There is NO WARRANTY, to the extent permitted by law.
 53  [09/07/2018 04:43PM]:   -> Downloading zfs-0.7-release.zip...
 54  [09/07/2018 04:43PM]:   % Total    % Received % Xferd  Average Speed   Time    Time     Time  Current
 55  [09/07/2018 04:43PM]:                                  Dload  Upload   Total   Spent    Left  Speed
 56  [09/07/2018 04:43PM]: 
 57   0     0    0     0    0     0      0      0 --:--:-- --:--:-- --:--:--     0
 58 100   128    0   128    0     0    815      0 --:--:-- --:--:-- --:--:--   815
 59  [09/07/2018 04:43PM]: 
 60   0     0    0     0    0     0      0      0 --:--:-- --:--:-- --:--:--     0
 61 100 6660k    0 6660k    0     0  6587k      0 --:--:--  0:00:01 --:--:-- 9289k
 62  [09/07/2018 04:43PM]:   -> Found zfs-utils.bash-completion-r1
 63  [09/07/2018 04:43PM]:   -> Found zfs-utils.initcpio.install
 64  [09/07/2018 04:43PM]:   -> Found zfs-utils.initcpio.hook
 65  [09/07/2018 04:43PM]:   -> Downloading 7792.patch...
 66  [09/07/2018 04:43PM]: 
 67   0     0    0     0    0     0      0      0 --:--:-- --:--:-- --:--:--     0
 68 100   141    0   141    0     0    898      0 --:--:-- --:--:-- --:--:--   898
 69  [09/07/2018 04:43PM]: 
 70   0     0    0     0    0     0      0      0 --:--:-- --:--:-- --:--:--     0
 71 100  198k    0  198k    0     0   252k      0 --:--:-- --:--:-- --:--:--  316k
 72  [09/07/2018 04:43PM]: ==> Generating checksums for source files...
 73  [09/07/2018 04:43PM]: ==> Making package: zfs-utils 0.7.10git+7ec2b1c-1 (Fri Sep  7 21:43:07 2018)
 74  [09/07/2018 04:43PM]: ==> Checking runtime dependencies...
 75  [09/07/2018 04:43PM]: ==> Installing missing dependencies...
 76  [09/07/2018 04:43PM]: Packages (8) dkms-2.5-3  linux-4.18.5.arch1-1  linux-firmware-20180825.fea76a0-1  linux-headers-4.18.5.arch1-1  mkinitcpio-24-2  mkinitcpio-busybox-1.29.2-1  spl-utils-0.7.10git+af567ce-1  spl-0.7.10git+af567ce-1
 77  [09/07/2018 04:43PM]: Total Installed Size:  462.34 MiB
 78  [09/07/2018 04:43PM]: warning: directory permissions differ on /var/
 79  [09/07/2018 04:43PM]: filesystem: 777  package: 755
 80  [09/07/2018 04:43PM]: Optional dependencies for dkms
 81  [09/07/2018 04:43PM]:     linux-headers: build modules against the Arch kernel [pending]
 82  [09/07/2018 04:43PM]:     linux-lts-headers: build modules against the LTS kernel
 83  [09/07/2018 04:43PM]:     linux-zen-headers: build modules against the ZEN kernel
 84  [09/07/2018 04:43PM]:     linux-hardened-headers: build modules against the HARDENED kernel
 85  [09/07/2018 04:43PM]: installing linux-firmware...
 86  [09/07/2018 04:43PM]: installing mkinitcpio-busybox...
 87  [09/07/2018 04:43PM]: Optional dependencies for mkinitcpio
 88  [09/07/2018 04:43PM]:     xz: Use lzma or xz compression for the initramfs image [installed]
 89  [09/07/2018 04:43PM]:     bzip2: Use bzip2 compression for the initramfs image [installed]
 90  [09/07/2018 04:43PM]:     lzop: Use lzo compression for the initramfs image
 91  [09/07/2018 04:43PM]:     lz4: Use lz4 compression for the initramfs image [installed]
 92  [09/07/2018 04:43PM]:     mkinitcpio-nfs-utils: Support for root filesystem on NFS
 93  [09/07/2018 04:43PM]: Optional dependencies for linux
 94  [09/07/2018 04:43PM]:     crda: to set the correct wireless channels of your country
 95  [09/07/2018 04:43PM]: (1/6) Updating linux module dependencies...
 96  [09/07/2018 04:43PM]: (2/6) Install DKMS modules
 97  [09/07/2018 04:43PM]: ==> dkms install spl/0.7.10 -k 4.18.5-arch1-1-ARCH
 98  [09/07/2018 04:46PM]: (3/6) Updating linux initcpios...
 99  [09/07/2018 04:46PM]: ==> Building image from preset: /etc/mkinitcpio.d/linux.preset: default
100  [09/07/2018 04:46PM]:   -> -k /boot/vmlinuz-linux -c /etc/mkinitcpio.conf -g /boot/initramfs-linux.img
101  [09/07/2018 04:46PM]: ==> Starting build: 4.18.5-arch1-1-ARCH
102  [09/07/2018 04:46PM]:   -> Running build hook: [base]
103  [09/07/2018 04:46PM]:   -> Running build hook: [udev]
104  [09/07/2018 04:46PM]:   -> Running build hook: [autodetect]
105  [09/07/2018 04:46PM]:   -> Running build hook: [modconf]
106  [09/07/2018 04:46PM]:   -> Running build hook: [block]
107  [09/07/2018 04:46PM]:   -> Running build hook: [filesystems]
108  [09/07/2018 04:46PM]:   -> Running build hook: [keyboard]
109  [09/07/2018 04:46PM]:   -> Running build hook: [fsck]
110  [09/07/2018 04:46PM]: ==> ERROR: file not found: `fsck.aufs
111  [09/07/2018 04:46PM]: ==> WARNING: No fsck helpers found. fsck will not be run on boot.
112  [09/07/2018 04:46PM]: ==> Generating module dependencies
113  [09/07/2018 04:46PM]: ==> Creating gzip-compressed initcpio image: /boot/initramfs-linux.img
114  [09/07/2018 04:46PM]: ==> WARNING: errors were encountered during the build. The image may not be complete.
115  [09/07/2018 04:46PM]: ==> Building image from preset: /etc/mkinitcpio.d/linux.preset: fallback
116  [09/07/2018 04:46PM]:   -> -k /boot/vmlinuz-linux -c /etc/mkinitcpio.conf -g /boot/initramfs-linux-fallback.img -S autodetect
117  [09/07/2018 04:46PM]: ==> WARNING: Possibly missing firmware for module: aic94xx
118  [09/07/2018 04:46PM]: ==> WARNING: Possibly missing firmware for module: wd719x
119  [09/07/2018 04:46PM]: ==> Creating gzip-compressed initcpio image: /boot/initramfs-linux-fallback.img
120  [09/07/2018 04:46PM]: ==> Image generation successful
121  [09/07/2018 04:46PM]: error: command failed to execute correctly
122  [09/07/2018 04:46PM]: (4/6) Reloading system manager configuration...
123  [09/07/2018 04:46PM]:   Skipped: Current root is not booted.
124  [09/07/2018 04:46PM]:   -> Found zfs-0.7-release.zip
125  [09/07/2018 04:46PM]: ==> Validating source files with md5sums...
126  [09/07/2018 04:46PM]:     zfs-0.7-release.zip ... Passed
127  [09/07/2018 04:46PM]:     zfs-utils.bash-completion-r1 ... Passed
128  [09/07/2018 04:46PM]:     zfs-utils.initcpio.install ... Passed
129  [09/07/2018 04:46PM]:     zfs-utils.initcpio.hook ... Passed
130  [09/07/2018 04:46PM]:   -> Extracting zfs-0.7-release.zip with bsdtar
131  [09/07/2018 04:46PM]: patching file module/zfs/zvol.c
132  [09/07/2018 04:46PM]: 3 out of 3 hunks FAILED -- saving rejects to file module/zfs/zvol.c.rej
133  [09/07/2018 04:46PM]: patching file config/kernel-current-time.m4
134  [09/07/2018 04:46PM]: Reversed (or previously applied) patch detected!  Skipping patch.
135  [09/07/2018 04:46PM]: 1 out of 1 hunk ignored -- saving rejects to file config/kernel-current-time.m4.rej
136  [09/07/2018 04:46PM]: patching file include/sys/dmu.h
137  [09/07/2018 04:46PM]: 1 out of 1 hunk ignored -- saving rejects to file include/sys/dmu.h.rej
138  [09/07/2018 04:46PM]: patching file include/sys/dmu_objset.h
139  [09/07/2018 04:46PM]: 1 out of 1 hunk ignored -- saving rejects to file include/sys/dmu_objset.h.rej
140  [09/07/2018 04:46PM]: patching file include/sys/dsl_dir.h
141  [09/07/2018 04:46PM]: 2 out of 2 hunks ignored -- saving rejects to file include/sys/dsl_dir.h.rej
142  [09/07/2018 04:46PM]: patching file include/sys/spa_impl.h
143  [09/07/2018 04:46PM]: 1 out of 1 hunk ignored -- saving rejects to file include/sys/spa_impl.h.rej
144  [09/07/2018 04:46PM]: patching file include/sys/xvattr.h
145  [09/07/2018 04:46PM]: 1 out of 1 hunk ignored -- saving rejects to file include/sys/xvattr.h.rej
146  [09/07/2018 04:46PM]: patching file include/sys/zfs_context.h
147  [09/07/2018 04:46PM]: 2 out of 2 hunks ignored -- saving rejects to file include/sys/zfs_context.h.rej
148  [09/07/2018 04:46PM]: patching file include/sys/zfs_znode.h
149  [09/07/2018 04:46PM]: 1 out of 1 hunk ignored -- saving rejects to file include/sys/zfs_znode.h.rej
150  [09/07/2018 04:46PM]: patching file include/sys/zpl.h
151  [09/07/2018 04:46PM]: 1 out of 1 hunk ignored -- saving rejects to file include/sys/zpl.h.rej
152  [09/07/2018 04:46PM]: patching file lib/libspl/Makefile.am
153  [09/07/2018 04:46PM]: 1 out of 1 hunk ignored -- saving rejects to file lib/libspl/Makefile.am.rej
154  [09/07/2018 04:46PM]: The next patch would delete the file lib/libspl/gethrestime.c,
155  [09/07/2018 04:46PM]: which does not exist!  Skipping patch.
156  [09/07/2018 04:46PM]: The next patch would delete the file lib/libspl/gethrtime.c,
157  [09/07/2018 04:46PM]: patching file lib/libspl/include/sys/time.h
158  [09/07/2018 04:46PM]: 2 out of 2 hunks ignored -- saving rejects to file lib/libspl/include/sys/time.h.rej
159  [09/07/2018 04:46PM]: patching file lib/libzpool/kernel.c
160  [09/07/2018 04:46PM]: 2 out of 2 hunks ignored -- saving rejects to file lib/libzpool/kernel.c.rej
161  [09/07/2018 04:46PM]: patching file module/zfs/dmu_objset.c
162  [09/07/2018 04:46PM]: 1 out of 1 hunk ignored -- saving rejects to file module/zfs/dmu_objset.c.rej
163  [09/07/2018 04:46PM]: patching file module/zfs/dsl_dir.c
164  [09/07/2018 04:46PM]: 2 out of 2 hunks ignored -- saving rejects to file module/zfs/dsl_dir.c.rej
165  [09/07/2018 04:46PM]: patching file module/zfs/fm.c
166  [09/07/2018 04:46PM]: 1 out of 1 hunk ignored -- saving rejects to file module/zfs/fm.c.rej
167  [09/07/2018 04:46PM]: patching file module/zfs/zfs_ctldir.c
168  [09/07/2018 04:46PM]: 1 out of 1 hunk ignored -- saving rejects to file module/zfs/zfs_ctldir.c.rej
169  [09/07/2018 04:46PM]: patching file module/zfs/zfs_vnops.c
170  [09/07/2018 04:46PM]: 2 out of 2 hunks ignored -- saving rejects to file module/zfs/zfs_vnops.c.rej
171  [09/07/2018 04:46PM]: patching file module/zfs/zfs_znode.c
172  [09/07/2018 04:46PM]: 2 out of 2 hunks ignored -- saving rejects to file module/zfs/zfs_znode.c.rej
173  [09/07/2018 04:46PM]: patching file module/zfs/zpl_inode.c
174  [09/07/2018 04:46PM]: 1 out of 1 hunk ignored -- saving rejects to file module/zfs/zpl_inode.c.rej
175  [09/07/2018 04:46PM]: The next patch would delete the file config/kernel-bdev-block-device-operations.m4,
176  [09/07/2018 04:46PM]: The next patch would delete the file config/kernel-block-device-operations-release-void.m4,
177  [09/07/2018 04:46PM]: The next patch would create the file config/kernel-block-device-operations.m4,
178  [09/07/2018 04:46PM]: patching file config/kernel.m4
179  [09/07/2018 04:46PM]: 1 out of 1 hunk ignored -- saving rejects to file config/kernel.m4.rej
180  [09/07/2018 04:46PM]: patching file include/linux/blkdev_compat.h
181  [09/07/2018 04:46PM]: 1 out of 1 hunk ignored -- saving rejects to file include/linux/blkdev_compat.h.rej
182  [09/07/2018 04:46PM]: 39 out of 39 hunks ignored -- saving rejects to file module/zfs/zvol.c.rej
183  [09/07/2018 04:46PM]: 2 out of 2 hunks ignored -- saving rejects to file include/sys/dmu.h.rej
184  [09/07/2018 04:46PM]: patching file include/sys/dmu_tx.h
185  [09/07/2018 04:46PM]: 3 out of 3 hunks ignored -- saving rejects to file include/sys/dmu_tx.h.rej
186  [09/07/2018 04:46PM]: patching file module/zfs/dmu_tx.c
187  [09/07/2018 04:46PM]: 4 out of 4 hunks ignored -- saving rejects to file module/zfs/dmu_tx.c.rej
188  [09/07/2018 04:46PM]: 10 out of 10 hunks ignored -- saving rejects to file module/zfs/zfs_vnops.c.rej
189  [09/07/2018 04:46PM]: patching file module/zfs/zil.c
190  [09/07/2018 04:46PM]: 1 out of 1 hunk ignored -- saving rejects to file module/zfs/zil.c.rej
191  [09/07/2018 04:46PM]: patching file module/zfs/mmp.c
192  [09/07/2018 04:46PM]: 1 out of 1 hunk ignored -- saving rejects to file module/zfs/mmp.c.rej
193  [09/07/2018 04:46PM]: patching file configure.ac
194  [09/07/2018 04:46PM]: 1 out of 1 hunk ignored -- saving rejects to file configure.ac.rej
195  [09/07/2018 04:46PM]: patching file include/sys/zap_leaf.h
196  [09/07/2018 04:46PM]: 2 out of 2 hunks ignored -- saving rejects to file include/sys/zap_leaf.h.rej
197  [09/07/2018 04:46PM]: patching file module/zfs/zap.c
198  [09/07/2018 04:46PM]: 1 out of 1 hunk ignored -- saving rejects to file module/zfs/zap.c.rej
199  [09/07/2018 04:46PM]: patching file module/zfs/zap_leaf.c
200  [09/07/2018 04:46PM]: 1 out of 1 hunk ignored -- saving rejects to file module/zfs/zap_leaf.c.rej
201  [09/07/2018 04:46PM]: patching file module/zfs/zap_micro.c
202  [09/07/2018 04:46PM]: 3 out of 3 hunks ignored -- saving rejects to file module/zfs/zap_micro.c.rej
203  [09/07/2018 04:46PM]: patching file module/zfs/zfs_dir.c
204  [09/07/2018 04:46PM]: 3 out of 3 hunks ignored -- saving rejects to file module/zfs/zfs_dir.c.rej
205  [09/07/2018 04:46PM]: patching file tests/runfiles/linux.run
206  [09/07/2018 04:46PM]: 2 out of 2 hunks ignored -- saving rejects to file tests/runfiles/linux.run.rej
207  [09/07/2018 04:46PM]: patching file tests/zfs-tests/tests/functional/Makefile.am
208  [09/07/2018 04:46PM]: 1 out of 1 hunk ignored -- saving rejects to file tests/zfs-tests/tests/functional/Makefile.am.rej
209  [09/07/2018 04:46PM]: patching file tests/zfs-tests/tests/functional/casenorm/Makefile.am
210  [09/07/2018 04:46PM]: 1 out of 1 hunk ignored -- saving rejects to file tests/zfs-tests/tests/functional/casenorm/Makefile.am.rej
211  [09/07/2018 04:46PM]: The next patch would create the file tests/zfs-tests/tests/functional/casenorm/mixed_create_failure.ksh,
212  [09/07/2018 04:46PM]: The next patch would create the file tests/zfs-tests/tests/functional/cp_files/.gitignore,
213  [09/07/2018 04:46PM]: The next patch would create the file tests/zfs-tests/tests/functional/cp_files/Makefile.am,
214  [09/07/2018 04:46PM]: The next patch would create the file tests/zfs-tests/tests/functional/cp_files/cleanup.ksh,
215  [09/07/2018 04:46PM]: The next patch would create the file tests/zfs-tests/tests/functional/cp_files/cp_files.c,
216  [09/07/2018 04:46PM]: The next patch would create the file tests/zfs-tests/tests/functional/cp_files/cp_files_001_pos.ksh,
217  [09/07/2018 04:46PM]: The next patch would create the file tests/zfs-tests/tests/functional/cp_files/setup.ksh,
218  [09/07/2018 04:46PM]: patching file module/zfs/vdev_disk.c
219  [09/07/2018 04:46PM]: Hunk #5 succeeded at 856 with fuzz 1 (offset 58 lines).
220  [09/07/2018 04:46PM]: 5 out of 6 hunks FAILED -- saving rejects to file module/zfs/vdev_disk.c.rej
221  [09/07/2018 04:46PM]: Hunk #1 succeeded at 868 (offset 53 lines).
222  [09/07/2018 04:46PM]: patching file scripts/dkms.mkconf
223  [09/07/2018 04:46PM]: 1 out of 1 hunk ignored -- saving rejects to file scripts/dkms.mkconf.rej
224  [09/07/2018 04:46PM]: patching file include/sys/vdev_disk.h
225  [09/07/2018 04:46PM]: 1 out of 1 hunk ignored -- saving rejects to file include/sys/vdev_disk.h.rej
226  [09/07/2018 04:46PM]: patching file lib/libefi/rdwr_efi.c
227  [09/07/2018 04:46PM]: 3 out of 3 hunks ignored -- saving rejects to file lib/libefi/rdwr_efi.c.rej
228  [09/07/2018 04:46PM]: patching file lib/libzfs/libzfs_pool.c
229  [09/07/2018 04:46PM]: 3 out of 3 hunks ignored -- saving rejects to file lib/libzfs/libzfs_pool.c.rej
230  [09/07/2018 04:46PM]: patching file module/zfs/vdev.c
231  [09/07/2018 04:46PM]: 2 out of 2 hunks ignored -- saving rejects to file module/zfs/vdev.c.rej
232  [09/07/2018 04:46PM]: 4 out of 4 hunks ignored -- saving rejects to file module/zfs/vdev_disk.c.rej
233  [09/07/2018 04:46PM]: patching file tests/zfs-tests/tests/functional/cli_root/zpool_expand/zpool_expand_002_pos.ksh
234  [09/07/2018 04:46PM]: 8 out of 8 hunks ignored -- saving rejects to file tests/zfs-tests/tests/functional/cli_root/zpool_expand/zpool_expand_002_pos.ksh.rej
235  [09/07/2018 04:46PM]: patching file cmd/zpool/zpool_main.c
236  [09/07/2018 04:46PM]: 1 out of 1 hunk ignored -- saving rejects to file cmd/zpool/zpool_main.c.rej
237  [09/07/2018 04:46PM]: patching file include/libzfs.h
238  [09/07/2018 04:46PM]: 1 out of 1 hunk ignored -- saving rejects to file include/libzfs.h.rej
239  [09/07/2018 04:46PM]: patching file include/sys/spa.h
240  [09/07/2018 04:46PM]: 2 out of 2 hunks ignored -- saving rejects to file include/sys/spa.h.rej
241  [09/07/2018 04:46PM]: patching file lib/libspl/include/sys/kstat.h
242  [09/07/2018 04:46PM]: 1 out of 1 hunk ignored -- saving rejects to file lib/libspl/include/sys/kstat.h.rej
243  [09/07/2018 04:46PM]: patching file lib/libzfs/libzfs_status.c
244  [09/07/2018 04:46PM]: 1 out of 1 hunk ignored -- saving rejects to file lib/libzfs/libzfs_status.c.rej
245  [09/07/2018 04:46PM]: patching file module/zfs/spa_misc.c
246  [09/07/2018 04:46PM]: 2 out of 2 hunks ignored -- saving rejects to file module/zfs/spa_misc.c.rej
247  [09/07/2018 04:46PM]: patching file module/zfs/spa_stats.c
248  [09/07/2018 04:46PM]: 3 out of 3 hunks ignored -- saving rejects to file module/zfs/spa_stats.c.rej
249  [09/07/2018 04:46PM]: 1 out of 1 hunk ignored -- saving rejects to file tests/runfiles/linux.run.rej
250  [09/07/2018 04:46PM]: patching file tests/zfs-tests/include/libtest.shlib
251  [09/07/2018 04:46PM]: 2 out of 2 hunks ignored -- saving rejects to file tests/zfs-tests/include/libtest.shlib.rej
252  [09/07/2018 04:46PM]: The next patch would create the file tests/zfs-tests/tests/functional/kstat/Makefile.am,
253  [09/07/2018 04:46PM]: The next patch would create the file tests/zfs-tests/tests/functional/kstat/cleanup.ksh,
254  [09/07/2018 04:46PM]: The next patch would create the file tests/zfs-tests/tests/functional/kstat/setup.ksh,
255  [09/07/2018 04:46PM]: The next patch would create the file tests/zfs-tests/tests/functional/kstat/state.ksh,
256  [09/07/2018 04:46PM]: patching file config/kernel-elevator-change.m4
257  [09/07/2018 04:46PM]: 1 out of 1 hunk ignored -- saving rejects to file config/kernel-elevator-change.m4.rej
258  [09/07/2018 04:46PM]: patching file cmd/zpool/zpool_vdev.c
259  [09/07/2018 04:46PM]: 1 out of 1 hunk ignored -- saving rejects to file cmd/zpool/zpool_vdev.c.rej
260  [09/07/2018 04:46PM]: patching file lib/libspl/include/sys/isa_defs.h
261  [09/07/2018 04:46PM]: 4 out of 4 hunks ignored -- saving rejects to file lib/libspl/include/sys/isa_defs.h.rej
262  [09/07/2018 04:46PM]: patching file module/icp/algs/modes/ccm.c
263  [09/07/2018 04:46PM]: 1 out of 1 hunk ignored -- saving rejects to file module/icp/algs/modes/ccm.c.rej
264  [09/07/2018 04:46PM]: patching file module/zfs/sa.c
265  [09/07/2018 04:46PM]: 1 out of 1 hunk ignored -- saving rejects to file module/zfs/sa.c.rej
266  [09/07/2018 04:46PM]: patching file include/sys/zfs_vfsops.h
267  [09/07/2018 04:46PM]: 1 out of 1 hunk ignored -- saving rejects to file include/sys/zfs_vfsops.h.rej
268  [09/07/2018 04:46PM]: patching file module/zfs/zpl_super.c
269  [09/07/2018 04:46PM]: 1 out of 1 hunk ignored -- saving rejects to file module/zfs/zpl_super.c.rej
270  [09/07/2018 04:46PM]: patching file man/man5/zpool-features.5
271  [09/07/2018 04:46PM]: 5 out of 5 hunks ignored -- saving rejects to file man/man5/zpool-features.5.rej
272  [09/07/2018 04:46PM]: patching file man/man8/zfs.8
273  [09/07/2018 04:46PM]: 2 out of 2 hunks ignored -- saving rejects to file man/man8/zfs.8.rej
274  [09/07/2018 04:46PM]: patching file module/zfs/zfs_ioctl.c
275  [09/07/2018 04:46PM]: 1 out of 1 hunk FAILED -- saving rejects to file module/zfs/zfs_ioctl.c.rej
276  [09/07/2018 04:46PM]: patching file lib/libzfs/libzfs_sendrecv.c
277  [09/07/2018 04:46PM]: 1 out of 1 hunk ignored -- saving rejects to file lib/libzfs/libzfs_sendrecv.c.rej
278  [09/07/2018 04:46PM]: patching file tests/zfs-tests/tests/functional/cli_root/zfs_receive/receive-o-x_props_override.ksh
279  [09/07/2018 04:46PM]: 5 out of 5 hunks FAILED -- saving rejects to file tests/zfs-tests/tests/functional/cli_root/zfs_receive/receive-o-x_props_override.ksh.rej
280  [09/07/2018 04:46PM]: 2 out of 2 hunks ignored -- saving rejects to file module/zfs/zfs_ioctl.c.rej
281  [09/07/2018 04:46PM]: patching file cmd/arcstat/arcstat.py
282  [09/07/2018 04:46PM]: 1 out of 1 hunk ignored -- saving rejects to file cmd/arcstat/arcstat.py.rej
283  [09/07/2018 04:46PM]: patching file cmd/zfs/zfs_main.c
284  [09/07/2018 04:46PM]: 3 out of 3 hunks ignored -- saving rejects to file cmd/zfs/zfs_main.c.rej
285  [09/07/2018 04:46PM]: 3 out of 3 hunks ignored -- saving rejects to file cmd/zpool/zpool_main.c.rej
286  [09/07/2018 04:46PM]: patching file rpm/generic/zfs.spec.in
287  [09/07/2018 04:46PM]: 2 out of 2 hunks FAILED -- saving rejects to file rpm/generic/zfs.spec.in.rej
288  [09/07/2018 04:46PM]: 1 out of 1 hunk FAILED -- saving rejects to file rpm/generic/zfs.spec.in.rej
289  [09/07/2018 04:46PM]: patching file lib/libshare/smb.c
290  [09/07/2018 04:46PM]: 1 out of 1 hunk ignored -- saving rejects to file lib/libshare/smb.c.rej
291  [09/07/2018 04:46PM]: patching file module/icp/core/kcf_mech_tabs.c
292  [09/07/2018 04:46PM]: 1 out of 1 hunk ignored -- saving rejects to file module/icp/core/kcf_mech_tabs.c.rej
293  [09/07/2018 04:46PM]: patching file tests/zfs-tests/tests/functional/ctime/ctime.c
294  [09/07/2018 04:46PM]: 1 out of 1 hunk ignored -- saving rejects to file tests/zfs-tests/tests/functional/ctime/ctime.c.rej
295  [09/07/2018 04:46PM]: patching file cmd/ztest/ztest.c
296  [09/07/2018 04:46PM]: 4 out of 4 hunks ignored -- saving rejects to file cmd/ztest/ztest.c.rej
297  [09/07/2018 04:46PM]: patching file include/sys/dnode.h
298  [09/07/2018 04:46PM]: 2 out of 2 hunks ignored -- saving rejects to file include/sys/dnode.h.rej
299  [09/07/2018 04:46PM]: patching file module/zfs/dmu_object.c
300  [09/07/2018 04:46PM]: 1 out of 1 hunk ignored -- saving rejects to file module/zfs/dmu_object.c.rej
301  [09/07/2018 04:46PM]: patching file module/zfs/dmu_send.c
302  [09/07/2018 04:46PM]: 3 out of 3 hunks ignored -- saving rejects to file module/zfs/dmu_send.c.rej
303  [09/07/2018 04:46PM]: patching file module/zfs/dnode.c
304  [09/07/2018 04:46PM]: 6 out of 6 hunks ignored -- saving rejects to file module/zfs/dnode.c.rej
305  [09/07/2018 04:46PM]: patching file module/zfs/dnode_sync.c
306  [09/07/2018 04:46PM]: 2 out of 2 hunks ignored -- saving rejects to file module/zfs/dnode_sync.c.rej
307  [09/07/2018 04:46PM]: patching file tests/zfs-tests/tests/functional/rsend/Makefile.am
308  [09/07/2018 04:46PM]: 1 out of 1 hunk ignored -- saving rejects to file tests/zfs-tests/tests/functional/rsend/Makefile.am.rej
309  [09/07/2018 04:46PM]: The next patch would create the file tests/zfs-tests/tests/functional/rsend/send_realloc_dnode_size.ksh,
310  [09/07/2018 04:46PM]: 1 out of 1 hunk FAILED -- saving rejects to file module/zfs/dmu_send.c.rej
311  [09/07/2018 04:46PM]: 1 out of 1 hunk ignored -- saving rejects to file module/zfs/dnode.c.rej
312  [09/07/2018 04:46PM]: patching file tests/zfs-tests/tests/functional/rsend/send_realloc_dnode_size.ksh
313  [09/07/2018 04:46PM]: 4 out of 4 hunks ignored -- saving rejects to file tests/zfs-tests/tests/functional/rsend/send_realloc_dnode_size.ksh.rej
314  [09/07/2018 04:46PM]: patching file module/zfs/metaslab.c
315  [09/07/2018 04:46PM]: 1 out of 1 hunk ignored -- saving rejects to file module/zfs/metaslab.c.rej
316  [09/07/2018 04:46PM]: 1 out of 1 hunk ignored -- saving rejects to file META.rej
317  [09/07/2018 04:46PM]: patching file rpm/generic/zfs-kmod.spec.in
318  [09/07/2018 04:46PM]: 1 out of 1 hunk FAILED -- saving rejects to file rpm/generic/zfs-kmod.spec.in.rej
319  [09/07/2018 04:46PM]: ==> ERROR: A failure occurred in prepare().
320  [09/07/2018 04:46PM]: rm: cannot remove **.pkg.**: No such file or directory
321  [09/07/2018 04:46PM]: [\^/\^/^\^/^\^/\^/\^/^\^/^\^/]  BUILD FAILED  [\^/\^/^\^/^\^/\^/\^/^\^/^\^/]