Build Record

Build Number: 8386

Transaction: 4319
Package: zfs
Version: 1:0.7.10-1
Start: 09/07/2018 04:46PM
Finish: 09/07/2018 04:50PM
Result: failed

Build Log

  1 [09/07/2018 04:46PM]: [\^/\^/^\^/^\^/\^/\^/^\^/^\^/]  SETTING UP ENVIRONMENT  [\^/\^/^\^/^\^/\^/\^/^\^/^\^/]
  2  [09/07/2018 04:46PM]: [\^/\^/^\^/^\^/\^/\^/^\^/^\^/]  ADDING UPSTREAM PGP KEYS TO KEYRING  [\^/\^/^\^/^\^/\^/\^/^\^/^\^/]
  3  [09/07/2018 04:46PM]: gpg: WARNING: unsafe ownership on homedir /tmp/antbs/.gnupg
  4  [09/07/2018 04:46PM]: gpg: keybox /tmp/antbs/.gnupg/pubring.kbx created
  5  [09/07/2018 04:46PM]: gpg: key 23EFEFE93C4CFFFE: 1 signature not checked due to a missing key
  6  [09/07/2018 04:46PM]: gpg: /tmp/antbs/.gnupg/trustdb.gpg: trustdb created
  7  [09/07/2018 04:46PM]: gpg: key 23EFEFE93C4CFFFE: public key Italo A. Casas <[email protected]> imported
  8  [09/07/2018 04:46PM]: gpg: key B63B535A4C206CA9: 9 signatures not checked due to missing keys
  9  [09/07/2018 04:46PM]: gpg: key B63B535A4C206CA9: public key Evan Lucas <[email protected]> imported
 10  [09/07/2018 04:46PM]: gpg: key E73BC641CC11F4C8: 14 signatures not checked due to missing keys
 11  [09/07/2018 04:46PM]: gpg: bad data signature from key DEA16371974031A5: Wrong key usage (0x19, 0x2)
 12  [09/07/2018 04:46PM]: gpg: key E73BC641CC11F4C8: public key Myles Borins <[email protected]> imported
 13  [09/07/2018 04:46PM]: gpg: key C273792F7D83545D: 4 signatures not checked due to missing keys
 14  [09/07/2018 04:46PM]: gpg: key C273792F7D83545D: public key Rod Vagg <[email protected]> imported
 15  [09/07/2018 04:46PM]: gpg: key C97EC7A07EDE3FC1: 19 signatures not checked due to missing keys
 16  [09/07/2018 04:46PM]: gpg: bad data signature from key 8975BA8B6100C6B1: Wrong key usage (0x19, 0x2)
 17  [09/07/2018 04:46PM]: gpg: key C97EC7A07EDE3FC1: public key keybase.io/jasnell <[email protected]> imported
 18  [09/07/2018 04:46PM]: gpg: key 09FE44734EB7990E: 2 signatures not checked due to missing keys
 19  [09/07/2018 04:46PM]: gpg: key 09FE44734EB7990E: public key Jeremiah Senkpiel <[email protected]> imported
 20  [09/07/2018 04:46PM]: gpg: key 7434390BDBE9B9C5: public key Colin Ihrig <[email protected]> imported
 21  [09/07/2018 04:46PM]: gpg: key 61B7B526D98F0353: 26 signatures not checked due to missing keys
 22  [09/07/2018 04:46PM]: gpg: key 61B7B526D98F0353: public key Mozilla Software Releases <[email protected]> imported
 23  [09/07/2018 04:46PM]: gpg: key 61B7B526D98F0353: Mozilla Software Releases <[email protected]> not changed
 24  [09/07/2018 04:46PM]: gpg: no ultimately trusted keys found
 25  [09/07/2018 04:46PM]: gpg: Total number processed: 9
 26  [09/07/2018 04:46PM]: gpg:               imported: 8
 27  [09/07/2018 04:46PM]: gpg:              unchanged: 1
 28  [09/07/2018 04:46PM]: [\^/\^/^\^/^\^/\^/\^/^\^/^\^/]  SYNCING REPO DATABASES  [\^/\^/^\^/^\^/\^/\^/^\^/^\^/]
 29  [09/07/2018 04:47PM]: :: Synchronizing package databases...
 30  [09/07/2018 04:47PM]: downloading antergos-staging.db...
 31  [09/07/2018 04:47PM]: downloading antergos.db...
 32  [09/07/2018 04:47PM]: downloading core.db...
 33  [09/07/2018 04:47PM]: downloading community.db...
 34  [09/07/2018 04:47PM]: :: Starting full system upgrade...
 35  [09/07/2018 04:47PM]: looking for conflicting packages...
 36  [09/07/2018 04:47PM]: Packages (3) coreutils-8.30-1  file-5.34-1  sudo-1.8.25-1
 37  [09/07/2018 04:47PM]: Total Installed Size:  22.83 MiB
 38  [09/07/2018 04:47PM]: Net Upgrade Size:       0.78 MiB
 39  [09/07/2018 04:47PM]: :: Proceed with installation? [Y/n]
 40  [09/07/2018 04:47PM]: checking package integrity...
 41  [09/07/2018 04:47PM]: checking for file conflicts...
 42  [09/07/2018 04:47PM]: :: Processing package changes...
 43  [09/07/2018 04:47PM]: :: Running post-transaction hooks...
 44  [09/07/2018 04:47PM]: (1/3) Creating temporary files...
 45  [09/07/2018 04:47PM]: (2/3) Arming ConditionNeedsUpdate...
 46  [09/07/2018 04:47PM]: (3/3) Updating the info directory file...
 47  [09/07/2018 04:47PM]: [\^/\^/^\^/^\^/\^/\^/^\^/^\^/]  TRYING BUILD  [\^/\^/^\^/^\^/\^/\^/^\^/^\^/]
 48  [09/07/2018 04:47PM]: [\^/\^/^\^/^\^/\^/\^/^\^/^\^/]  UPDATING SOURCE CHECKSUMS  [\^/\^/^\^/^\^/\^/\^/^\^/^\^/]
 49  [09/07/2018 04:47PM]: Copyright (c) 2006-2018 Pacman Development Team <[email protected]>.
 50  [09/07/2018 04:47PM]: Copyright (C) 2002-2006 Judd Vinet <jv[email protected]>.
 51  [09/07/2018 04:47PM]: This is free software; see the source for copying conditions.
 52  [09/07/2018 04:47PM]: There is NO WARRANTY, to the extent permitted by law.
 53  [09/07/2018 04:47PM]:   -> Downloading zfs-0.7-release.zip...
 54  [09/07/2018 04:47PM]:   % Total    % Received % Xferd  Average Speed   Time    Time     Time  Current
 55  [09/07/2018 04:47PM]:                                  Dload  Upload   Total   Spent    Left  Speed
 56  [09/07/2018 04:47PM]: 
 57   0     0    0     0    0     0      0      0 --:--:-- --:--:-- --:--:--     0
 58 100   128    0   128    0     0    836      0 --:--:-- --:--:-- --:--:--   836
 59  [09/07/2018 04:47PM]: 
 60 100 5436k    0 5436k    0     0  6343k      0 --:--:-- --:--:-- --:--:-- 6343k
 61 100 6660k    0 6660k    0     0  7303k      0 --:--:-- --:--:-- --:--:-- 21.7M
 62  [09/07/2018 04:47PM]:   -> Downloading 7792.patch...
 63  [09/07/2018 04:47PM]: 
 64   0     0    0     0    0     0      0      0 --:--:-- --:--:-- --:--:--     0
 65 100   141    0   141    0     0    992      0 --:--:-- --:--:-- --:--:--   992
 66  [09/07/2018 04:47PM]: 
 67 100  198k    0  198k    0     0   310k      0 --:--:-- --:--:-- --:--:--  310k
 68  [09/07/2018 04:47PM]: ==> Generating checksums for source files...
 69  [09/07/2018 04:47PM]: ==> Making package: zfs 0.7.10git+7ec2b1c-1 (Fri Sep  7 21:47:09 2018)
 70  [09/07/2018 04:47PM]: ==> Checking runtime dependencies...
 71  [09/07/2018 04:47PM]: ==> Installing missing dependencies...
 72  [09/07/2018 04:47PM]: Packages (9) linux-firmware-20180825.fea76a0-1  mkinitcpio-24-2  mkinitcpio-busybox-1.29.2-1  spl-utils-0.7.10git+af567ce-1  dkms-2.5-3  linux-4.18.5.arch1-1  linux-headers-4.18.5.arch1-1  spl-0.7.10git+af567ce-1  zfs-utils-0.7.10git+7ec2b1c-1
 73  [09/07/2018 04:47PM]: Total Download Size:     3.68 MiB
 74  [09/07/2018 04:47PM]: Total Installed Size:  474.56 MiB
 75  [09/07/2018 04:47PM]: downloading zfs-utils-0.7.10git+7ec2b1c-1-x86_64.pkg.tar.xz...
 76  [09/07/2018 04:47PM]: warning: directory permissions differ on /var/
 77  [09/07/2018 04:47PM]: filesystem: 777  package: 755
 78  [09/07/2018 04:47PM]: Optional dependencies for dkms
 79  [09/07/2018 04:47PM]:     linux-headers: build modules against the Arch kernel [pending]
 80  [09/07/2018 04:47PM]:     linux-lts-headers: build modules against the LTS kernel
 81  [09/07/2018 04:47PM]:     linux-zen-headers: build modules against the ZEN kernel
 82  [09/07/2018 04:47PM]:     linux-hardened-headers: build modules against the HARDENED kernel
 83  [09/07/2018 04:47PM]: installing linux-firmware...
 84  [09/07/2018 04:47PM]: installing mkinitcpio-busybox...
 85  [09/07/2018 04:47PM]: Optional dependencies for mkinitcpio
 86  [09/07/2018 04:47PM]:     xz: Use lzma or xz compression for the initramfs image [installed]
 87  [09/07/2018 04:47PM]:     bzip2: Use bzip2 compression for the initramfs image [installed]
 88  [09/07/2018 04:47PM]:     lzop: Use lzo compression for the initramfs image
 89  [09/07/2018 04:47PM]:     lz4: Use lz4 compression for the initramfs image [installed]
 90  [09/07/2018 04:47PM]:     mkinitcpio-nfs-utils: Support for root filesystem on NFS
 91  [09/07/2018 04:47PM]: Optional dependencies for linux
 92  [09/07/2018 04:47PM]:     crda: to set the correct wireless channels of your country
 93  [09/07/2018 04:47PM]: warning: directory permissions differ on /etc/sudoers.d/
 94  [09/07/2018 04:47PM]: (1/7) Updating linux module dependencies...
 95  [09/07/2018 04:47PM]: (2/7) Install DKMS modules
 96  [09/07/2018 04:47PM]: ==> dkms install spl/0.7.10 -k 4.18.5-arch1-1-ARCH
 97  [09/07/2018 04:50PM]: (3/7) Updating linux initcpios...
 98  [09/07/2018 04:50PM]: ==> Building image from preset: /etc/mkinitcpio.d/linux.preset: default
 99  [09/07/2018 04:50PM]:   -> -k /boot/vmlinuz-linux -c /etc/mkinitcpio.conf -g /boot/initramfs-linux.img
100  [09/07/2018 04:50PM]: ==> Starting build: 4.18.5-arch1-1-ARCH
101  [09/07/2018 04:50PM]:   -> Running build hook: [base]
102  [09/07/2018 04:50PM]:   -> Running build hook: [udev]
103  [09/07/2018 04:50PM]:   -> Running build hook: [autodetect]
104  [09/07/2018 04:50PM]:   -> Running build hook: [modconf]
105  [09/07/2018 04:50PM]:   -> Running build hook: [block]
106  [09/07/2018 04:50PM]:   -> Running build hook: [filesystems]
107  [09/07/2018 04:50PM]:   -> Running build hook: [keyboard]
108  [09/07/2018 04:50PM]:   -> Running build hook: [fsck]
109  [09/07/2018 04:50PM]: ==> ERROR: file not found: `fsck.aufs
110  [09/07/2018 04:50PM]: ==> WARNING: No fsck helpers found. fsck will not be run on boot.
111  [09/07/2018 04:50PM]: ==> Generating module dependencies
112  [09/07/2018 04:50PM]: ==> Creating gzip-compressed initcpio image: /boot/initramfs-linux.img
113  [09/07/2018 04:50PM]: ==> WARNING: errors were encountered during the build. The image may not be complete.
114  [09/07/2018 04:50PM]: ==> Building image from preset: /etc/mkinitcpio.d/linux.preset: fallback
115  [09/07/2018 04:50PM]:   -> -k /boot/vmlinuz-linux -c /etc/mkinitcpio.conf -g /boot/initramfs-linux-fallback.img -S autodetect
116  [09/07/2018 04:50PM]: ==> WARNING: Possibly missing firmware for module: aic94xx
117  [09/07/2018 04:50PM]: ==> WARNING: Possibly missing firmware for module: wd719x
118  [09/07/2018 04:50PM]: ==> Creating gzip-compressed initcpio image: /boot/initramfs-linux-fallback.img
119  [09/07/2018 04:50PM]: ==> Image generation successful
120  [09/07/2018 04:50PM]: error: command failed to execute correctly
121  [09/07/2018 04:50PM]: (4/7) Reloading system manager configuration...
122  [09/07/2018 04:50PM]:   Skipped: Current root is not booted.
123  [09/07/2018 04:50PM]:   Skipped: Device manager is not running.
124  [09/07/2018 04:50PM]:   -> Found zfs-0.7-release.zip
125  [09/07/2018 04:50PM]: ==> Validating source files with md5sums...
126  [09/07/2018 04:50PM]:     zfs-0.7-release.zip ... Passed
127  [09/07/2018 04:50PM]:   -> Extracting zfs-0.7-release.zip with bsdtar
128  [09/07/2018 04:50PM]: patching file module/zfs/zvol.c
129  [09/07/2018 04:50PM]: 3 out of 3 hunks FAILED -- saving rejects to file module/zfs/zvol.c.rej
130  [09/07/2018 04:50PM]: patching file config/kernel-current-time.m4
131  [09/07/2018 04:50PM]: Reversed (or previously applied) patch detected!  Skipping patch.
132  [09/07/2018 04:50PM]: 1 out of 1 hunk ignored -- saving rejects to file config/kernel-current-time.m4.rej
133  [09/07/2018 04:50PM]: patching file include/sys/dmu.h
134  [09/07/2018 04:50PM]: 1 out of 1 hunk ignored -- saving rejects to file include/sys/dmu.h.rej
135  [09/07/2018 04:50PM]: patching file include/sys/dmu_objset.h
136  [09/07/2018 04:50PM]: 1 out of 1 hunk ignored -- saving rejects to file include/sys/dmu_objset.h.rej
137  [09/07/2018 04:50PM]: patching file include/sys/dsl_dir.h
138  [09/07/2018 04:50PM]: 2 out of 2 hunks ignored -- saving rejects to file include/sys/dsl_dir.h.rej
139  [09/07/2018 04:50PM]: patching file include/sys/spa_impl.h
140  [09/07/2018 04:50PM]: 1 out of 1 hunk ignored -- saving rejects to file include/sys/spa_impl.h.rej
141  [09/07/2018 04:50PM]: patching file include/sys/xvattr.h
142  [09/07/2018 04:50PM]: 1 out of 1 hunk ignored -- saving rejects to file include/sys/xvattr.h.rej
143  [09/07/2018 04:50PM]: patching file include/sys/zfs_context.h
144  [09/07/2018 04:50PM]: 2 out of 2 hunks ignored -- saving rejects to file include/sys/zfs_context.h.rej
145  [09/07/2018 04:50PM]: patching file include/sys/zfs_znode.h
146  [09/07/2018 04:50PM]: 1 out of 1 hunk ignored -- saving rejects to file include/sys/zfs_znode.h.rej
147  [09/07/2018 04:50PM]: patching file include/sys/zpl.h
148  [09/07/2018 04:50PM]: 1 out of 1 hunk ignored -- saving rejects to file include/sys/zpl.h.rej
149  [09/07/2018 04:50PM]: patching file lib/libspl/Makefile.am
150  [09/07/2018 04:50PM]: 1 out of 1 hunk ignored -- saving rejects to file lib/libspl/Makefile.am.rej
151  [09/07/2018 04:50PM]: The next patch would delete the file lib/libspl/gethrestime.c,
152  [09/07/2018 04:50PM]: which does not exist!  Skipping patch.
153  [09/07/2018 04:50PM]: The next patch would delete the file lib/libspl/gethrtime.c,
154  [09/07/2018 04:50PM]: patching file lib/libspl/include/sys/time.h
155  [09/07/2018 04:50PM]: 2 out of 2 hunks ignored -- saving rejects to file lib/libspl/include/sys/time.h.rej
156  [09/07/2018 04:50PM]: patching file lib/libzpool/kernel.c
157  [09/07/2018 04:50PM]: 2 out of 2 hunks ignored -- saving rejects to file lib/libzpool/kernel.c.rej
158  [09/07/2018 04:50PM]: patching file module/zfs/dmu_objset.c
159  [09/07/2018 04:50PM]: 1 out of 1 hunk ignored -- saving rejects to file module/zfs/dmu_objset.c.rej
160  [09/07/2018 04:50PM]: patching file module/zfs/dsl_dir.c
161  [09/07/2018 04:50PM]: 2 out of 2 hunks ignored -- saving rejects to file module/zfs/dsl_dir.c.rej
162  [09/07/2018 04:50PM]: patching file module/zfs/fm.c
163  [09/07/2018 04:50PM]: 1 out of 1 hunk ignored -- saving rejects to file module/zfs/fm.c.rej
164  [09/07/2018 04:50PM]: patching file module/zfs/zfs_ctldir.c
165  [09/07/2018 04:50PM]: 1 out of 1 hunk ignored -- saving rejects to file module/zfs/zfs_ctldir.c.rej
166  [09/07/2018 04:50PM]: patching file module/zfs/zfs_vnops.c
167  [09/07/2018 04:50PM]: 2 out of 2 hunks ignored -- saving rejects to file module/zfs/zfs_vnops.c.rej
168  [09/07/2018 04:50PM]: patching file module/zfs/zfs_znode.c
169  [09/07/2018 04:50PM]: 2 out of 2 hunks ignored -- saving rejects to file module/zfs/zfs_znode.c.rej
170  [09/07/2018 04:50PM]: patching file module/zfs/zpl_inode.c
171  [09/07/2018 04:50PM]: 1 out of 1 hunk ignored -- saving rejects to file module/zfs/zpl_inode.c.rej
172  [09/07/2018 04:50PM]: The next patch would delete the file config/kernel-bdev-block-device-operations.m4,
173  [09/07/2018 04:50PM]: The next patch would delete the file config/kernel-block-device-operations-release-void.m4,
174  [09/07/2018 04:50PM]: The next patch would create the file config/kernel-block-device-operations.m4,
175  [09/07/2018 04:50PM]: patching file config/kernel.m4
176  [09/07/2018 04:50PM]: 1 out of 1 hunk ignored -- saving rejects to file config/kernel.m4.rej
177  [09/07/2018 04:50PM]: patching file include/linux/blkdev_compat.h
178  [09/07/2018 04:50PM]: 1 out of 1 hunk ignored -- saving rejects to file include/linux/blkdev_compat.h.rej
179  [09/07/2018 04:50PM]: 39 out of 39 hunks ignored -- saving rejects to file module/zfs/zvol.c.rej
180  [09/07/2018 04:50PM]: 2 out of 2 hunks ignored -- saving rejects to file include/sys/dmu.h.rej
181  [09/07/2018 04:50PM]: patching file include/sys/dmu_tx.h
182  [09/07/2018 04:50PM]: 3 out of 3 hunks ignored -- saving rejects to file include/sys/dmu_tx.h.rej
183  [09/07/2018 04:50PM]: patching file module/zfs/dmu_tx.c
184  [09/07/2018 04:50PM]: 4 out of 4 hunks ignored -- saving rejects to file module/zfs/dmu_tx.c.rej
185  [09/07/2018 04:50PM]: 10 out of 10 hunks ignored -- saving rejects to file module/zfs/zfs_vnops.c.rej
186  [09/07/2018 04:50PM]: patching file module/zfs/zil.c
187  [09/07/2018 04:50PM]: 1 out of 1 hunk ignored -- saving rejects to file module/zfs/zil.c.rej
188  [09/07/2018 04:50PM]: patching file module/zfs/mmp.c
189  [09/07/2018 04:50PM]: 1 out of 1 hunk ignored -- saving rejects to file module/zfs/mmp.c.rej
190  [09/07/2018 04:50PM]: patching file configure.ac
191  [09/07/2018 04:50PM]: 1 out of 1 hunk ignored -- saving rejects to file configure.ac.rej
192  [09/07/2018 04:50PM]: patching file include/sys/zap_leaf.h
193  [09/07/2018 04:50PM]: 2 out of 2 hunks ignored -- saving rejects to file include/sys/zap_leaf.h.rej
194  [09/07/2018 04:50PM]: patching file module/zfs/zap.c
195  [09/07/2018 04:50PM]: 1 out of 1 hunk ignored -- saving rejects to file module/zfs/zap.c.rej
196  [09/07/2018 04:50PM]: patching file module/zfs/zap_leaf.c
197  [09/07/2018 04:50PM]: 1 out of 1 hunk ignored -- saving rejects to file module/zfs/zap_leaf.c.rej
198  [09/07/2018 04:50PM]: patching file module/zfs/zap_micro.c
199  [09/07/2018 04:50PM]: 3 out of 3 hunks ignored -- saving rejects to file module/zfs/zap_micro.c.rej
200  [09/07/2018 04:50PM]: patching file module/zfs/zfs_dir.c
201  [09/07/2018 04:50PM]: 3 out of 3 hunks ignored -- saving rejects to file module/zfs/zfs_dir.c.rej
202  [09/07/2018 04:50PM]: patching file tests/runfiles/linux.run
203  [09/07/2018 04:50PM]: 2 out of 2 hunks ignored -- saving rejects to file tests/runfiles/linux.run.rej
204  [09/07/2018 04:50PM]: patching file tests/zfs-tests/tests/functional/Makefile.am
205  [09/07/2018 04:50PM]: 1 out of 1 hunk ignored -- saving rejects to file tests/zfs-tests/tests/functional/Makefile.am.rej
206  [09/07/2018 04:50PM]: patching file tests/zfs-tests/tests/functional/casenorm/Makefile.am
207  [09/07/2018 04:50PM]: 1 out of 1 hunk ignored -- saving rejects to file tests/zfs-tests/tests/functional/casenorm/Makefile.am.rej
208  [09/07/2018 04:50PM]: The next patch would create the file tests/zfs-tests/tests/functional/casenorm/mixed_create_failure.ksh,
209  [09/07/2018 04:50PM]: The next patch would create the file tests/zfs-tests/tests/functional/cp_files/.gitignore,
210  [09/07/2018 04:50PM]: The next patch would create the file tests/zfs-tests/tests/functional/cp_files/Makefile.am,
211  [09/07/2018 04:50PM]: The next patch would create the file tests/zfs-tests/tests/functional/cp_files/cleanup.ksh,
212  [09/07/2018 04:50PM]: The next patch would create the file tests/zfs-tests/tests/functional/cp_files/cp_files.c,
213  [09/07/2018 04:50PM]: The next patch would create the file tests/zfs-tests/tests/functional/cp_files/cp_files_001_pos.ksh,
214  [09/07/2018 04:50PM]: The next patch would create the file tests/zfs-tests/tests/functional/cp_files/setup.ksh,
215  [09/07/2018 04:50PM]: patching file module/zfs/vdev_disk.c
216  [09/07/2018 04:50PM]: Hunk #5 succeeded at 856 with fuzz 1 (offset 58 lines).
217  [09/07/2018 04:50PM]: 5 out of 6 hunks FAILED -- saving rejects to file module/zfs/vdev_disk.c.rej
218  [09/07/2018 04:50PM]: Hunk #1 succeeded at 868 (offset 53 lines).
219  [09/07/2018 04:50PM]: patching file scripts/dkms.mkconf
220  [09/07/2018 04:50PM]: 1 out of 1 hunk ignored -- saving rejects to file scripts/dkms.mkconf.rej
221  [09/07/2018 04:50PM]: patching file include/sys/vdev_disk.h
222  [09/07/2018 04:50PM]: 1 out of 1 hunk ignored -- saving rejects to file include/sys/vdev_disk.h.rej
223  [09/07/2018 04:50PM]: patching file lib/libefi/rdwr_efi.c
224  [09/07/2018 04:50PM]: 3 out of 3 hunks ignored -- saving rejects to file lib/libefi/rdwr_efi.c.rej
225  [09/07/2018 04:50PM]: patching file lib/libzfs/libzfs_pool.c
226  [09/07/2018 04:50PM]: 3 out of 3 hunks ignored -- saving rejects to file lib/libzfs/libzfs_pool.c.rej
227  [09/07/2018 04:50PM]: patching file module/zfs/vdev.c
228  [09/07/2018 04:50PM]: 2 out of 2 hunks ignored -- saving rejects to file module/zfs/vdev.c.rej
229  [09/07/2018 04:50PM]: 4 out of 4 hunks ignored -- saving rejects to file module/zfs/vdev_disk.c.rej
230  [09/07/2018 04:50PM]: patching file tests/zfs-tests/tests/functional/cli_root/zpool_expand/zpool_expand_002_pos.ksh
231  [09/07/2018 04:50PM]: 8 out of 8 hunks ignored -- saving rejects to file tests/zfs-tests/tests/functional/cli_root/zpool_expand/zpool_expand_002_pos.ksh.rej
232  [09/07/2018 04:50PM]: patching file cmd/zpool/zpool_main.c
233  [09/07/2018 04:50PM]: 1 out of 1 hunk ignored -- saving rejects to file cmd/zpool/zpool_main.c.rej
234  [09/07/2018 04:50PM]: patching file include/libzfs.h
235  [09/07/2018 04:50PM]: 1 out of 1 hunk ignored -- saving rejects to file include/libzfs.h.rej
236  [09/07/2018 04:50PM]: patching file include/sys/spa.h
237  [09/07/2018 04:50PM]: 2 out of 2 hunks ignored -- saving rejects to file include/sys/spa.h.rej
238  [09/07/2018 04:50PM]: patching file lib/libspl/include/sys/kstat.h
239  [09/07/2018 04:50PM]: 1 out of 1 hunk ignored -- saving rejects to file lib/libspl/include/sys/kstat.h.rej
240  [09/07/2018 04:50PM]: patching file lib/libzfs/libzfs_status.c
241  [09/07/2018 04:50PM]: 1 out of 1 hunk ignored -- saving rejects to file lib/libzfs/libzfs_status.c.rej
242  [09/07/2018 04:50PM]: patching file module/zfs/spa_misc.c
243  [09/07/2018 04:50PM]: 2 out of 2 hunks ignored -- saving rejects to file module/zfs/spa_misc.c.rej
244  [09/07/2018 04:50PM]: patching file module/zfs/spa_stats.c
245  [09/07/2018 04:50PM]: 3 out of 3 hunks ignored -- saving rejects to file module/zfs/spa_stats.c.rej
246  [09/07/2018 04:50PM]: 1 out of 1 hunk ignored -- saving rejects to file tests/runfiles/linux.run.rej
247  [09/07/2018 04:50PM]: patching file tests/zfs-tests/include/libtest.shlib
248  [09/07/2018 04:50PM]: 2 out of 2 hunks ignored -- saving rejects to file tests/zfs-tests/include/libtest.shlib.rej
249  [09/07/2018 04:50PM]: The next patch would create the file tests/zfs-tests/tests/functional/kstat/Makefile.am,
250  [09/07/2018 04:50PM]: The next patch would create the file tests/zfs-tests/tests/functional/kstat/cleanup.ksh,
251  [09/07/2018 04:50PM]: The next patch would create the file tests/zfs-tests/tests/functional/kstat/setup.ksh,
252  [09/07/2018 04:50PM]: The next patch would create the file tests/zfs-tests/tests/functional/kstat/state.ksh,
253  [09/07/2018 04:50PM]: patching file config/kernel-elevator-change.m4
254  [09/07/2018 04:50PM]: 1 out of 1 hunk ignored -- saving rejects to file config/kernel-elevator-change.m4.rej
255  [09/07/2018 04:50PM]: patching file cmd/zpool/zpool_vdev.c
256  [09/07/2018 04:50PM]: 1 out of 1 hunk ignored -- saving rejects to file cmd/zpool/zpool_vdev.c.rej
257  [09/07/2018 04:50PM]: patching file lib/libspl/include/sys/isa_defs.h
258  [09/07/2018 04:50PM]: 4 out of 4 hunks ignored -- saving rejects to file lib/libspl/include/sys/isa_defs.h.rej
259  [09/07/2018 04:50PM]: patching file module/icp/algs/modes/ccm.c
260  [09/07/2018 04:50PM]: 1 out of 1 hunk ignored -- saving rejects to file module/icp/algs/modes/ccm.c.rej
261  [09/07/2018 04:50PM]: patching file module/zfs/sa.c
262  [09/07/2018 04:50PM]: 1 out of 1 hunk ignored -- saving rejects to file module/zfs/sa.c.rej
263  [09/07/2018 04:50PM]: patching file include/sys/zfs_vfsops.h
264  [09/07/2018 04:50PM]: 1 out of 1 hunk ignored -- saving rejects to file include/sys/zfs_vfsops.h.rej
265  [09/07/2018 04:50PM]: patching file module/zfs/zpl_super.c
266  [09/07/2018 04:50PM]: 1 out of 1 hunk ignored -- saving rejects to file module/zfs/zpl_super.c.rej
267  [09/07/2018 04:50PM]: patching file man/man5/zpool-features.5
268  [09/07/2018 04:50PM]: 5 out of 5 hunks ignored -- saving rejects to file man/man5/zpool-features.5.rej
269  [09/07/2018 04:50PM]: patching file man/man8/zfs.8
270  [09/07/2018 04:50PM]: 2 out of 2 hunks ignored -- saving rejects to file man/man8/zfs.8.rej
271  [09/07/2018 04:50PM]: patching file module/zfs/zfs_ioctl.c
272  [09/07/2018 04:50PM]: 1 out of 1 hunk FAILED -- saving rejects to file module/zfs/zfs_ioctl.c.rej
273  [09/07/2018 04:50PM]: patching file lib/libzfs/libzfs_sendrecv.c
274  [09/07/2018 04:50PM]: 1 out of 1 hunk ignored -- saving rejects to file lib/libzfs/libzfs_sendrecv.c.rej
275  [09/07/2018 04:50PM]: patching file tests/zfs-tests/tests/functional/cli_root/zfs_receive/receive-o-x_props_override.ksh
276  [09/07/2018 04:50PM]: 5 out of 5 hunks FAILED -- saving rejects to file tests/zfs-tests/tests/functional/cli_root/zfs_receive/receive-o-x_props_override.ksh.rej
277  [09/07/2018 04:50PM]: 2 out of 2 hunks ignored -- saving rejects to file module/zfs/zfs_ioctl.c.rej
278  [09/07/2018 04:50PM]: patching file cmd/arcstat/arcstat.py
279  [09/07/2018 04:50PM]: 1 out of 1 hunk ignored -- saving rejects to file cmd/arcstat/arcstat.py.rej
280  [09/07/2018 04:50PM]: patching file cmd/zfs/zfs_main.c
281  [09/07/2018 04:50PM]: 3 out of 3 hunks ignored -- saving rejects to file cmd/zfs/zfs_main.c.rej
282  [09/07/2018 04:50PM]: 3 out of 3 hunks ignored -- saving rejects to file cmd/zpool/zpool_main.c.rej
283  [09/07/2018 04:50PM]: patching file rpm/generic/zfs.spec.in
284  [09/07/2018 04:50PM]: 2 out of 2 hunks FAILED -- saving rejects to file rpm/generic/zfs.spec.in.rej
285  [09/07/2018 04:50PM]: 1 out of 1 hunk FAILED -- saving rejects to file rpm/generic/zfs.spec.in.rej
286  [09/07/2018 04:50PM]: patching file lib/libshare/smb.c
287  [09/07/2018 04:50PM]: 1 out of 1 hunk ignored -- saving rejects to file lib/libshare/smb.c.rej
288  [09/07/2018 04:50PM]: patching file module/icp/core/kcf_mech_tabs.c
289  [09/07/2018 04:50PM]: 1 out of 1 hunk ignored -- saving rejects to file module/icp/core/kcf_mech_tabs.c.rej
290  [09/07/2018 04:50PM]: patching file tests/zfs-tests/tests/functional/ctime/ctime.c
291  [09/07/2018 04:50PM]: 1 out of 1 hunk ignored -- saving rejects to file tests/zfs-tests/tests/functional/ctime/ctime.c.rej
292  [09/07/2018 04:50PM]: patching file cmd/ztest/ztest.c
293  [09/07/2018 04:50PM]: 4 out of 4 hunks ignored -- saving rejects to file cmd/ztest/ztest.c.rej
294  [09/07/2018 04:50PM]: patching file include/sys/dnode.h
295  [09/07/2018 04:50PM]: 2 out of 2 hunks ignored -- saving rejects to file include/sys/dnode.h.rej
296  [09/07/2018 04:50PM]: patching file module/zfs/dmu_object.c
297  [09/07/2018 04:50PM]: 1 out of 1 hunk ignored -- saving rejects to file module/zfs/dmu_object.c.rej
298  [09/07/2018 04:50PM]: patching file module/zfs/dmu_send.c
299  [09/07/2018 04:50PM]: 3 out of 3 hunks ignored -- saving rejects to file module/zfs/dmu_send.c.rej
300  [09/07/2018 04:50PM]: patching file module/zfs/dnode.c
301  [09/07/2018 04:50PM]: 6 out of 6 hunks ignored -- saving rejects to file module/zfs/dnode.c.rej
302  [09/07/2018 04:50PM]: patching file module/zfs/dnode_sync.c
303  [09/07/2018 04:50PM]: 2 out of 2 hunks ignored -- saving rejects to file module/zfs/dnode_sync.c.rej
304  [09/07/2018 04:50PM]: patching file tests/zfs-tests/tests/functional/rsend/Makefile.am
305  [09/07/2018 04:50PM]: 1 out of 1 hunk ignored -- saving rejects to file tests/zfs-tests/tests/functional/rsend/Makefile.am.rej
306  [09/07/2018 04:50PM]: The next patch would create the file tests/zfs-tests/tests/functional/rsend/send_realloc_dnode_size.ksh,
307  [09/07/2018 04:50PM]: 1 out of 1 hunk FAILED -- saving rejects to file module/zfs/dmu_send.c.rej
308  [09/07/2018 04:50PM]: 1 out of 1 hunk ignored -- saving rejects to file module/zfs/dnode.c.rej
309  [09/07/2018 04:50PM]: patching file tests/zfs-tests/tests/functional/rsend/send_realloc_dnode_size.ksh
310  [09/07/2018 04:50PM]: 4 out of 4 hunks ignored -- saving rejects to file tests/zfs-tests/tests/functional/rsend/send_realloc_dnode_size.ksh.rej
311  [09/07/2018 04:50PM]: patching file module/zfs/metaslab.c
312  [09/07/2018 04:50PM]: 1 out of 1 hunk ignored -- saving rejects to file module/zfs/metaslab.c.rej
313  [09/07/2018 04:50PM]: 1 out of 1 hunk ignored -- saving rejects to file META.rej
314  [09/07/2018 04:50PM]: patching file rpm/generic/zfs-kmod.spec.in
315  [09/07/2018 04:50PM]: 1 out of 1 hunk FAILED -- saving rejects to file rpm/generic/zfs-kmod.spec.in.rej
316  [09/07/2018 04:50PM]: ==> ERROR: A failure occurred in prepare().
317  [09/07/2018 04:50PM]: rm: cannot remove **.pkg.**: No such file or directory
318  [09/07/2018 04:50PM]: [\^/\^/^\^/^\^/\^/\^/^\^/^\^/]  BUILD FAILED  [\^/\^/^\^/^\^/\^/\^/^\^/^\^/]