Build Record

Build Number: 9146

Transaction: 4601
Package: copyq
Version: 3.7.3-1
Start: 03/12/2019 02:20PM
Finish: 03/12/2019 02:21PM
Result: failed
 copyq/PKGBUILD CHANGED

Build Log

 1 [03/12/2019 02:20PM]: [\^/\^/^\^/^\^/\^/\^/^\^/^\^/]  SETTING UP ENVIRONMENT  [\^/\^/^\^/^\^/\^/\^/^\^/^\^/]
 2  [03/12/2019 02:20PM]: [\^/\^/^\^/^\^/\^/\^/^\^/^\^/]  ADDING UPSTREAM PGP KEYS TO KEYRING  [\^/\^/^\^/^\^/\^/\^/^\^/^\^/]
 3  [03/12/2019 02:20PM]: gpg: WARNING: unsafe ownership on homedir /tmp/antbs/.gnupg
 4  [03/12/2019 02:20PM]: gpg: keybox /tmp/antbs/.gnupg/pubring.kbx created
 5  [03/12/2019 02:21PM]: gpg: keyserver receive failed: No keyserver available
 6  [03/12/2019 02:21PM]: [\^/\^/^\^/^\^/\^/\^/^\^/^\^/]  SYNCING REPO DATABASES  [\^/\^/^\^/^\^/\^/\^/^\^/^\^/]
 7  [03/12/2019 02:21PM]: :: Synchronizing package databases...
 8  [03/12/2019 02:21PM]: downloading antergos-staging.db...
 9  [03/12/2019 02:21PM]: downloading antergos.db...
10  [03/12/2019 02:21PM]: error: failed retrieving file core.db from mirror.csclub.uwaterloo.ca : The requested URL returned error: 404
11  [03/12/2019 02:21PM]: error: failed retrieving file core.db from mirrors.uni-plovdiv.net : The requested URL returned error: 404
12  [03/12/2019 02:21PM]: error: failed retrieving file core.db from jpn.mirror.pkgbuild.com : The requested URL returned error: 404
13  [03/12/2019 02:21PM]: error: failed to update core (unexpected error)
14  [03/12/2019 02:21PM]: error: failed retrieving file extra.db from mirror.csclub.uwaterloo.ca : The requested URL returned error: 404
15  [03/12/2019 02:21PM]: error: failed retrieving file extra.db from mirrors.uni-plovdiv.net : The requested URL returned error: 404
16  [03/12/2019 02:21PM]: error: failed retrieving file extra.db from jpn.mirror.pkgbuild.com : The requested URL returned error: 404
17  [03/12/2019 02:21PM]: error: failed to update extra (unexpected error)
18  [03/12/2019 02:21PM]: error: failed retrieving file community.db from mirror.csclub.uwaterloo.ca : The requested URL returned error: 404
19  [03/12/2019 02:21PM]: error: failed retrieving file community.db from mirrors.uni-plovdiv.net : The requested URL returned error: 404
20  [03/12/2019 02:21PM]: error: failed retrieving file community.db from jpn.mirror.pkgbuild.com : The requested URL returned error: 404
21  [03/12/2019 02:21PM]: error: failed to update community (unexpected error)
22  [03/12/2019 02:21PM]: error: failed to synchronize all databases
23  [03/12/2019 02:21PM]: [\^/\^/^\^/^\^/\^/\^/^\^/^\^/]  TRYING BUILD  [\^/\^/^\^/^\^/\^/\^/^\^/^\^/]
24  [03/12/2019 02:21PM]: [\^/\^/^\^/^\^/\^/\^/^\^/^\^/]  UPDATING SOURCE CHECKSUMS  [\^/\^/^\^/^\^/\^/\^/^\^/^\^/]
25  [03/12/2019 02:21PM]: makepkg (pacman) 5.1.3
26  [03/12/2019 02:21PM]: Copyright (c) 2006-2018 Pacman Development Team <[email protected]>.
27  [03/12/2019 02:21PM]: Copyright (C) 2002-2006 Judd Vinet <[email protected]>.
28  [03/12/2019 02:21PM]: This is free software; see the source for copying conditions.
29  [03/12/2019 02:21PM]: There is NO WARRANTY, to the extent permitted by law.
30  [03/12/2019 02:21PM]:   -> Downloading v3.7.3.tar.gz...
31  [03/12/2019 02:21PM]:   % Total    % Received % Xferd  Average Speed   Time    Time     Time  Current
32  [03/12/2019 02:21PM]:                                  Dload  Upload   Total   Spent    Left  Speed
33  [03/12/2019 02:21PM]: 
34   0     0    0     0    0     0      0      0 --:--:-- --:--:-- --:--:--     0
35 100   118    0   118    0     0    360      0 --:--:-- --:--:-- --:--:--   360
36  [03/12/2019 02:21PM]: 
37   0     0    0     0    0     0      0      0 --:--:-- --:--:-- --:--:--     0
38 100 2836k    0 2836k    0     0  3014k      0 --:--:-- --:--:-- --:--:-- 5896k
39  [03/12/2019 02:21PM]: ==> Generating checksums for source files...
40  [03/12/2019 02:21PM]: ==> Making package: copyq 3.7.3-1 (Tue Mar 12 19:21:15 2019)
41  [03/12/2019 02:21PM]: ==> Checking runtime dependencies...
42  [03/12/2019 02:21PM]: ==> Installing missing dependencies...
43  [03/12/2019 02:21PM]: error: failed to prepare transaction (package architecture is not valid)
44  [03/12/2019 02:21PM]: :: package qt5-base-5.12.1-2-x86_64 does not have a valid architecture
45  [03/12/2019 02:21PM]: :: package libxtst-1.2.3-2-x86_64 does not have a valid architecture
46  [03/12/2019 02:21PM]: :: package qt5-webkit-5.212.0alpha2-23-x86_64 does not have a valid architecture
47  [03/12/2019 02:21PM]: :: package qt5-svg-5.12.1-1-x86_64 does not have a valid architecture
48  [03/12/2019 02:21PM]: :: package qt5-tools-5.12.1-1-x86_64 does not have a valid architecture
49  [03/12/2019 02:21PM]: :: package qt5-script-5.12.1-1-x86_64 does not have a valid architecture
50  [03/12/2019 02:21PM]: :: package libxfixes-5.0.3-2-x86_64 does not have a valid architecture
51  [03/12/2019 02:21PM]: :: package qt5-x11extras-5.12.1-1-x86_64 does not have a valid architecture
52  [03/12/2019 02:21PM]: ==> ERROR: pacman failed to install missing dependencies.
53  [03/12/2019 02:21PM]: rm: cannot remove **.pkg.**: No such file or directory
54  [03/12/2019 02:21PM]: [\^/\^/^\^/^\^/\^/\^/^\^/^\^/]  BUILD FAILED  [\^/\^/^\^/^\^/\^/\^/^\^/^\^/]